<svg width="32" height="32" viewBox="0 0 32 32" fill="none" xmlns="http://www.w3.org/2000/svg">
<path fill-rule="evenodd" clip-rule="evenodd" d="M26.6667 5.33337H5.33335C3.85335 5.33337 2.68002 6.52004 2.68002 8.00004L2.66669 24C2.66669 25.48 3.85335 26.6667 5.33335 26.6667H26.6667C28.1467 26.6667 29.3334 25.48 29.3334 24V8.00004C29.3334 6.52004 28.1467 5.33337 26.6667 5.33337ZM26.6667 24H5.33335V16H26.6667V24ZM5.33335 10.6667H26.6667V8.00004H5.33335V10.6667Z" fill="#3C516D"/>
</svg>
