%YAML 1.1
%TAG !u! tag:unity3d.com,2011:
--- !u!114 &11400000
MonoBehaviour:
  m_ObjectHideFlags: 0
  m_CorrespondingSourceObject: {fileID: 0}
  m_PrefabInstance: {fileID: 0}
  m_PrefabAsset: {fileID: 0}
  m_GameObject: {fileID: 0}
  m_Enabled: 1
  m_EditorHideFlags: 0
  m_Script: {fileID: 11500000, guid: 9e38df29b2de6ab41923f50f0d893372, type: 3}
  m_Name: HealthPotion
  m_EditorClassIdentifier: 
  id: 1
  itemName: HealthPotion
  description: Potion de heal (regenere 50hp)
  image: {fileID: 21300000, guid: 535fa6b335eb3714d9067bdfddd76ab7, type: 3}
  heal: 50
  boostSpeed: 0
  speedDuration: 0
  prix: 10
