%YAML 1.1
%TAG !u! tag:unity3d.com,2011:
--- !u!1045 &1
EditorBuildSettings:
  m_ObjectHideFlags: 0
  serializedVersion: 2
  m_Scenes:
  - enabled: 1
    path: Assets/Scene/i.unity
    guid: 0451090e95baa794aae5bd21e2504278
  - enabled: 0
    path: Assets/Scene/Menu.unity
    guid: 83433eb2f35349d4aab9f281da1e8f09
  m_configObjects: {}
