%YAML 1.1
%TAG !u! tag:unity3d.com,2011:
--- !u!114 &11400000
MonoBehaviour:
  m_ObjectHideFlags: 0
  m_CorrespondingSourceObject: {fileID: 0}
  m_PrefabInstance: {fileID: 0}
  m_PrefabAsset: {fileID: 0}
  m_GameObject: {fileID: 0}
  m_Enabled: 1
  m_EditorHideFlags: 0
  m_Script: {fileID: 11500000, guid: 9e38df29b2de6ab41923f50f0d893372, type: 3}
  m_Name: Lampe
  m_EditorClassIdentifier: 
  id: 0
  itemName: Lampe
  description: Une lampe pour eclairer les endroits les plus sombre de la carte
  image: {fileID: 21300000, guid: 230e2e47d1ad45e4fa5538e10b0f9673, type: 3}
  heal: 0
  boostSpeed: 0
  speedDuration: 0
  isLighting: 1
  prix: 15
