[api-updater (non-obsolete-error-filter)] 17/09/2021 15:01:58 : Starting C:/Program Files/Unity/Hub/Editor/2020.3.18f1/Editor/Data/Tools/ScriptUpdater/APIUpdater.NonObsoleteApiUpdaterDetector.exe
[api-updater (non-obsolete-error-filter)] 
----------------------------------
jit/startup time      : 444,5122ms
moved types parse time: 75ms
candidates parse time : 2ms
C# parse time         : 281ms
candidates check time : 31ms
console write time    : 0ms

[api-updater (non-obsolete-error-filter)] 17/09/2021 15:21:55 : Starting C:/Program Files/Unity/Hub/Editor/2020.3.18f1/Editor/Data/Tools/ScriptUpdater/APIUpdater.NonObsoleteApiUpdaterDetector.exe
[api-updater (non-obsolete-error-filter)] 
----------------------------------
jit/startup time      : 115,1537ms
moved types parse time: 51ms
candidates parse time : 1ms
C# parse time         : 187ms
candidates check time : 32ms
console write time    : 0ms

[api-updater (non-obsolete-error-filter)] 17/09/2021 15:28:26 : Starting C:/Program Files/Unity/Hub/Editor/2020.3.18f1/Editor/Data/Tools/ScriptUpdater/APIUpdater.NonObsoleteApiUpdaterDetector.exe
[api-updater (non-obsolete-error-filter)] 
----------------------------------
jit/startup time      : 90,9541ms
moved types parse time: 51ms
candidates parse time : 1ms
C# parse time         : 193ms
candidates check time : 27ms
console write time    : 0ms

[api-updater (non-obsolete-error-filter)] 17/09/2021 15:34:06 : Starting C:/Program Files/Unity/Hub/Editor/2020.3.18f1/Editor/Data/Tools/ScriptUpdater/APIUpdater.NonObsoleteApiUpdaterDetector.exe
[api-updater (non-obsolete-error-filter)] 
----------------------------------
jit/startup time      : 95,5127ms
moved types parse time: 56ms
candidates parse time : 1ms
C# parse time         : 195ms
candidates check time : 30ms
console write time    : 0ms

[api-updater (non-obsolete-error-filter)] 17/09/2021 15:50:26 : Starting C:/Program Files/Unity/Hub/Editor/2020.3.18f1/Editor/Data/Tools/ScriptUpdater/APIUpdater.NonObsoleteApiUpdaterDetector.exe
[api-updater (non-obsolete-error-filter)] 
----------------------------------
jit/startup time      : 98,1967ms
moved types parse time: 54ms
candidates parse time : 1ms
C# parse time         : 190ms
candidates check time : 32ms
console write time    : 0ms

[api-updater (non-obsolete-error-filter)] 17/09/2021 15:53:51 : Starting C:/Program Files/Unity/Hub/Editor/2020.3.18f1/Editor/Data/Tools/ScriptUpdater/APIUpdater.NonObsoleteApiUpdaterDetector.exe
[api-updater (non-obsolete-error-filter)] 
----------------------------------
jit/startup time      : 91,0452ms
moved types parse time: 50ms
candidates parse time : 1ms
C# parse time         : 184ms
candidates check time : 30ms
console write time    : 0ms

[api-updater (non-obsolete-error-filter)] 17/09/2021 15:54:01 : Starting C:/Program Files/Unity/Hub/Editor/2020.3.18f1/Editor/Data/Tools/ScriptUpdater/APIUpdater.NonObsoleteApiUpdaterDetector.exe
[api-updater (non-obsolete-error-filter)] 
----------------------------------
jit/startup time      : 93,7909ms
moved types parse time: 54ms
candidates parse time : 1ms
C# parse time         : 192ms
candidates check time : 34ms
console write time    : 0ms

[api-updater (non-obsolete-error-filter)] 17/09/2021 15:57:25 : Starting C:/Program Files/Unity/Hub/Editor/2020.3.18f1/Editor/Data/Tools/ScriptUpdater/APIUpdater.NonObsoleteApiUpdaterDetector.exe
[api-updater (non-obsolete-error-filter)] 
----------------------------------
jit/startup time      : 92,635ms
moved types parse time: 56ms
candidates parse time : 1ms
C# parse time         : 205ms
candidates check time : 35ms
console write time    : 0ms

[api-updater (non-obsolete-error-filter)] 20/09/2021 20:04:34 : Starting C:/Program Files/Unity/Hub/Editor/2020.3.18f1/Editor/Data/Tools/ScriptUpdater/APIUpdater.NonObsoleteApiUpdaterDetector.exe
[api-updater (non-obsolete-error-filter)] 
----------------------------------
jit/startup time      : 437,8311ms
moved types parse time: 62ms
candidates parse time : 1ms
C# parse time         : 247ms
candidates check time : 28ms
console write time    : 0ms

[api-updater (non-obsolete-error-filter)] 20/09/2021 20:04:51 : Starting C:/Program Files/Unity/Hub/Editor/2020.3.18f1/Editor/Data/Tools/ScriptUpdater/APIUpdater.NonObsoleteApiUpdaterDetector.exe
[api-updater (non-obsolete-error-filter)] 
----------------------------------
jit/startup time      : 98,3541ms
moved types parse time: 52ms
candidates parse time : 1ms
C# parse time         : 179ms
candidates check time : 28ms
console write time    : 0ms

[api-updater (non-obsolete-error-filter)] 20/09/2021 20:05:02 : Starting C:/Program Files/Unity/Hub/Editor/2020.3.18f1/Editor/Data/Tools/ScriptUpdater/APIUpdater.NonObsoleteApiUpdaterDetector.exe
[api-updater (non-obsolete-error-filter)] 
----------------------------------
jit/startup time      : 95,2013ms
moved types parse time: 54ms
candidates parse time : 1ms
C# parse time         : 190ms
candidates check time : 29ms
console write time    : 0ms

[api-updater (non-obsolete-error-filter)] 22/09/2021 19:02:20 : Starting C:/Program Files/Unity/Hub/Editor/2020.3.18f1/Editor/Data/Tools/ScriptUpdater/APIUpdater.NonObsoleteApiUpdaterDetector.exe
[api-updater (non-obsolete-error-filter)] 
----------------------------------
jit/startup time      : 278,9458ms
moved types parse time: 69ms
candidates parse time : 1ms
C# parse time         : 290ms
candidates check time : 31ms
console write time    : 0ms

[api-updater (non-obsolete-error-filter)] 22/09/2021 19:03:15 : Starting C:/Program Files/Unity/Hub/Editor/2020.3.18f1/Editor/Data/Tools/ScriptUpdater/APIUpdater.NonObsoleteApiUpdaterDetector.exe
[api-updater (non-obsolete-error-filter)] 
----------------------------------
jit/startup time      : 92,4853ms
moved types parse time: 51ms
candidates parse time : 1ms
C# parse time         : 180ms
candidates check time : 29ms
console write time    : 0ms

[api-updater (non-obsolete-error-filter)] 22/09/2021 19:10:26 : Starting C:/Program Files/Unity/Hub/Editor/2020.3.18f1/Editor/Data/Tools/ScriptUpdater/APIUpdater.NonObsoleteApiUpdaterDetector.exe
[api-updater (non-obsolete-error-filter)] 
----------------------------------
jit/startup time      : 91,3ms
moved types parse time: 49ms
candidates parse time : 1ms
C# parse time         : 192ms
candidates check time : 26ms
console write time    : 0ms

[api-updater (non-obsolete-error-filter)] 23/09/2021 09:06:08 : Starting C:/Program Files/Unity/Hub/Editor/2020.3.18f1/Editor/Data/Tools/ScriptUpdater/APIUpdater.NonObsoleteApiUpdaterDetector.exe
[api-updater (non-obsolete-error-filter)] 
----------------------------------
jit/startup time      : 281,2963ms
moved types parse time: 61ms
candidates parse time : 1ms
C# parse time         : 290ms
candidates check time : 30ms
console write time    : 0ms

[api-updater (non-obsolete-error-filter)] 23/09/2021 09:06:46 : Starting C:/Program Files/Unity/Hub/Editor/2020.3.18f1/Editor/Data/Tools/ScriptUpdater/APIUpdater.NonObsoleteApiUpdaterDetector.exe
[api-updater (non-obsolete-error-filter)] 
----------------------------------
jit/startup time      : 77,5204ms
moved types parse time: 49ms
candidates parse time : 1ms
C# parse time         : 177ms
candidates check time : 25ms
console write time    : 0ms

[api-updater (non-obsolete-error-filter)] 23/09/2021 09:07:09 : Starting C:/Program Files/Unity/Hub/Editor/2020.3.18f1/Editor/Data/Tools/ScriptUpdater/APIUpdater.NonObsoleteApiUpdaterDetector.exe
[api-updater (non-obsolete-error-filter)] 
----------------------------------
jit/startup time      : 78,0703ms
moved types parse time: 58ms
candidates parse time : 1ms
C# parse time         : 178ms
candidates check time : 27ms
console write time    : 0ms

[api-updater (non-obsolete-error-filter)] 23/09/2021 09:11:40 : Starting C:/Program Files/Unity/Hub/Editor/2020.3.18f1/Editor/Data/Tools/ScriptUpdater/APIUpdater.NonObsoleteApiUpdaterDetector.exe
[api-updater (non-obsolete-error-filter)] 
----------------------------------
jit/startup time      : 77,7417ms
moved types parse time: 49ms
candidates parse time : 1ms
C# parse time         : 190ms
candidates check time : 32ms
console write time    : 0ms

[api-updater (non-obsolete-error-filter)] 23/09/2021 09:15:20 : Starting C:/Program Files/Unity/Hub/Editor/2020.3.18f1/Editor/Data/Tools/ScriptUpdater/APIUpdater.NonObsoleteApiUpdaterDetector.exe
[api-updater (non-obsolete-error-filter)] 
----------------------------------
jit/startup time      : 87,3105ms
moved types parse time: 49ms
candidates parse time : 1ms
C# parse time         : 188ms
candidates check time : 28ms
console write time    : 0ms

[api-updater (non-obsolete-error-filter)] 23/09/2021 09:20:51 : Starting C:/Program Files/Unity/Hub/Editor/2020.3.18f1/Editor/Data/Tools/ScriptUpdater/APIUpdater.NonObsoleteApiUpdaterDetector.exe
[api-updater (non-obsolete-error-filter)] 
----------------------------------
jit/startup time      : 84,7768ms
moved types parse time: 52ms
candidates parse time : 1ms
C# parse time         : 177ms
candidates check time : 24ms
console write time    : 0ms

[api-updater (non-obsolete-error-filter)] 23/09/2021 10:55:03 : Starting C:/Program Files/Unity/Hub/Editor/2020.3.18f1/Editor/Data/Tools/ScriptUpdater/APIUpdater.NonObsoleteApiUpdaterDetector.exe
[api-updater (non-obsolete-error-filter)] 
----------------------------------
jit/startup time      : 113,3976ms
moved types parse time: 50ms
candidates parse time : 1ms
C# parse time         : 195ms
candidates check time : 27ms
console write time    : 0ms

[api-updater (non-obsolete-error-filter)] 23/09/2021 12:06:24 : Starting C:/Program Files/Unity/Hub/Editor/2020.3.18f1/Editor/Data/Tools/ScriptUpdater/APIUpdater.NonObsoleteApiUpdaterDetector.exe
[api-updater (non-obsolete-error-filter)] 
----------------------------------
jit/startup time      : 111,104ms
moved types parse time: 50ms
candidates parse time : 1ms
C# parse time         : 190ms
candidates check time : 29ms
console write time    : 0ms

[api-updater (non-obsolete-error-filter)] 23/09/2021 12:06:44 : Starting C:/Program Files/Unity/Hub/Editor/2020.3.18f1/Editor/Data/Tools/ScriptUpdater/APIUpdater.NonObsoleteApiUpdaterDetector.exe
[api-updater (non-obsolete-error-filter)] 
----------------------------------
jit/startup time      : 85,9554ms
moved types parse time: 52ms
candidates parse time : 1ms
C# parse time         : 179ms
candidates check time : 27ms
console write time    : 0ms

[api-updater (non-obsolete-error-filter)] 23/09/2021 12:07:54 : Starting C:/Program Files/Unity/Hub/Editor/2020.3.18f1/Editor/Data/Tools/ScriptUpdater/APIUpdater.NonObsoleteApiUpdaterDetector.exe
[api-updater (non-obsolete-error-filter)] 
----------------------------------
jit/startup time      : 80,0231ms
moved types parse time: 50ms
candidates parse time : 1ms
C# parse time         : 185ms
candidates check time : 36ms
console write time    : 0ms

[api-updater (non-obsolete-error-filter)] 23/09/2021 12:08:53 : Starting C:/Program Files/Unity/Hub/Editor/2020.3.18f1/Editor/Data/Tools/ScriptUpdater/APIUpdater.NonObsoleteApiUpdaterDetector.exe
[api-updater (non-obsolete-error-filter)] 
----------------------------------
jit/startup time      : 90,216ms
moved types parse time: 50ms
candidates parse time : 1ms
C# parse time         : 185ms
candidates check time : 27ms
console write time    : 0ms

[api-updater (non-obsolete-error-filter)] 23/09/2021 12:09:23 : Starting C:/Program Files/Unity/Hub/Editor/2020.3.18f1/Editor/Data/Tools/ScriptUpdater/APIUpdater.NonObsoleteApiUpdaterDetector.exe
[api-updater (non-obsolete-error-filter)] 
----------------------------------
jit/startup time      : 84,4131ms
moved types parse time: 56ms
candidates parse time : 1ms
C# parse time         : 181ms
candidates check time : 29ms
console write time    : 0ms

[api-updater (non-obsolete-error-filter)] 23/09/2021 12:11:39 : Starting C:/Program Files/Unity/Hub/Editor/2020.3.18f1/Editor/Data/Tools/ScriptUpdater/APIUpdater.NonObsoleteApiUpdaterDetector.exe
[api-updater (non-obsolete-error-filter)] 
----------------------------------
jit/startup time      : 83,8094ms
moved types parse time: 51ms
candidates parse time : 1ms
C# parse time         : 179ms
candidates check time : 27ms
console write time    : 0ms

[api-updater (non-obsolete-error-filter)] 23/09/2021 12:11:57 : Starting C:/Program Files/Unity/Hub/Editor/2020.3.18f1/Editor/Data/Tools/ScriptUpdater/APIUpdater.NonObsoleteApiUpdaterDetector.exe
[api-updater (non-obsolete-error-filter)] 
----------------------------------
jit/startup time      : 85,203ms
moved types parse time: 52ms
candidates parse time : 1ms
C# parse time         : 189ms
candidates check time : 27ms
console write time    : 0ms

[api-updater (non-obsolete-error-filter)] 23/09/2021 18:44:24 : Starting C:/Program Files/Unity/Hub/Editor/2020.3.18f1/Editor/Data/Tools/ScriptUpdater/APIUpdater.NonObsoleteApiUpdaterDetector.exe
[api-updater (non-obsolete-error-filter)] 
----------------------------------
jit/startup time      : 225,0472ms
moved types parse time: 64ms
candidates parse time : 1ms
C# parse time         : 245ms
candidates check time : 31ms
console write time    : 1ms

[api-updater (non-obsolete-error-filter)] 23/09/2021 18:45:17 : Starting C:/Program Files/Unity/Hub/Editor/2020.3.18f1/Editor/Data/Tools/ScriptUpdater/APIUpdater.NonObsoleteApiUpdaterDetector.exe
[api-updater (non-obsolete-error-filter)] 
----------------------------------
jit/startup time      : 77,5926ms
moved types parse time: 51ms
candidates parse time : 1ms
C# parse time         : 170ms
candidates check time : 25ms
console write time    : 0ms

[api-updater (non-obsolete-error-filter)] 23/09/2021 18:48:52 : Starting C:/Program Files/Unity/Hub/Editor/2020.3.18f1/Editor/Data/Tools/ScriptUpdater/APIUpdater.NonObsoleteApiUpdaterDetector.exe
[api-updater (non-obsolete-error-filter)] 
----------------------------------
jit/startup time      : 78,0652ms
moved types parse time: 49ms
candidates parse time : 1ms
C# parse time         : 183ms
candidates check time : 29ms
console write time    : 0ms

[api-updater (non-obsolete-error-filter)] 23/09/2021 18:49:03 : Starting C:/Program Files/Unity/Hub/Editor/2020.3.18f1/Editor/Data/Tools/ScriptUpdater/APIUpdater.NonObsoleteApiUpdaterDetector.exe
[api-updater (non-obsolete-error-filter)] 
----------------------------------
jit/startup time      : 93,4263ms
moved types parse time: 53ms
candidates parse time : 1ms
C# parse time         : 186ms
candidates check time : 39ms
console write time    : 0ms

[api-updater (non-obsolete-error-filter)] 07/10/2021 10:19:06 : Starting C:/Program Files/Unity/Hub/Editor/2020.3.18f1/Editor/Data/Tools/ScriptUpdater/APIUpdater.NonObsoleteApiUpdaterDetector.exe
[api-updater (non-obsolete-error-filter)] 
----------------------------------
jit/startup time      : 302,9811ms
moved types parse time: 63ms
candidates parse time : 1ms
C# parse time         : 260ms
candidates check time : 29ms
console write time    : 1ms

[api-updater (non-obsolete-error-filter)] 07/10/2021 10:19:33 : Starting C:/Program Files/Unity/Hub/Editor/2020.3.18f1/Editor/Data/Tools/ScriptUpdater/APIUpdater.NonObsoleteApiUpdaterDetector.exe
[api-updater (non-obsolete-error-filter)] 
----------------------------------
jit/startup time      : 92,8945ms
moved types parse time: 54ms
candidates parse time : 1ms
C# parse time         : 194ms
candidates check time : 27ms
console write time    : 0ms

[api-updater (non-obsolete-error-filter)] 14/10/2021 12:13:40 : Starting C:/Program Files/Unity/Hub/Editor/2020.3.18f1/Editor/Data/Tools/ScriptUpdater/APIUpdater.NonObsoleteApiUpdaterDetector.exe
[api-updater (non-obsolete-error-filter)] 
----------------------------------
jit/startup time      : 229,465ms
moved types parse time: 69ms
candidates parse time : 1ms
C# parse time         : 252ms
candidates check time : 27ms
console write time    : 1ms

[api-updater (non-obsolete-error-filter)] 14/10/2021 12:28:04 : Starting C:/Program Files/Unity/Hub/Editor/2020.3.18f1/Editor/Data/Tools/ScriptUpdater/APIUpdater.NonObsoleteApiUpdaterDetector.exe
[api-updater (non-obsolete-error-filter)] 
----------------------------------
jit/startup time      : 105,1559ms
moved types parse time: 56ms
candidates parse time : 1ms
C# parse time         : 193ms
candidates check time : 44ms
console write time    : 0ms

[api-updater (non-obsolete-error-filter)] 14/10/2021 12:34:31 : Starting C:/Program Files/Unity/Hub/Editor/2020.3.18f1/Editor/Data/Tools/ScriptUpdater/APIUpdater.NonObsoleteApiUpdaterDetector.exe
[api-updater (non-obsolete-error-filter)] 
----------------------------------
jit/startup time      : 90,4072ms
moved types parse time: 54ms
candidates parse time : 1ms
C# parse time         : 188ms
candidates check time : 27ms
console write time    : 0ms

[api-updater (non-obsolete-error-filter)] 14/10/2021 12:34:45 : Starting C:/Program Files/Unity/Hub/Editor/2020.3.18f1/Editor/Data/Tools/ScriptUpdater/APIUpdater.NonObsoleteApiUpdaterDetector.exe
[api-updater (non-obsolete-error-filter)] 
----------------------------------
jit/startup time      : 87,8376ms
moved types parse time: 60ms
candidates parse time : 1ms
C# parse time         : 215ms
candidates check time : 28ms
console write time    : 0ms

[api-updater (non-obsolete-error-filter)] 14/10/2021 12:39:56 : Starting C:/Program Files/Unity/Hub/Editor/2020.3.18f1/Editor/Data/Tools/ScriptUpdater/APIUpdater.NonObsoleteApiUpdaterDetector.exe
[api-updater (non-obsolete-error-filter)] 
----------------------------------
jit/startup time      : 98,3271ms
moved types parse time: 55ms
candidates parse time : 1ms
C# parse time         : 198ms
candidates check time : 30ms
console write time    : 0ms

[api-updater (non-obsolete-error-filter)] 15/10/2021 15:59:43 : Starting C:/Program Files/Unity/Hub/Editor/2020.3.18f1/Editor/Data/Tools/ScriptUpdater/APIUpdater.NonObsoleteApiUpdaterDetector.exe
[api-updater (non-obsolete-error-filter)] 
----------------------------------
jit/startup time      : 256,0397ms
moved types parse time: 65ms
candidates parse time : 1ms
C# parse time         : 307ms
candidates check time : 32ms
console write time    : 1ms

[api-updater (non-obsolete-error-filter)] 04/11/2021 10:26:54 : Starting C:/Program Files/Unity/Hub/Editor/2020.3.18f1/Editor/Data/Tools/ScriptUpdater/APIUpdater.NonObsoleteApiUpdaterDetector.exe
[api-updater (non-obsolete-error-filter)] 
----------------------------------
jit/startup time      : 385,8779ms
moved types parse time: 69ms
candidates parse time : 1ms
C# parse time         : 291ms
candidates check time : 31ms
console write time    : 1ms

[api-updater (non-obsolete-error-filter)] 04/11/2021 10:31:02 : Starting C:/Program Files/Unity/Hub/Editor/2020.3.18f1/Editor/Data/Tools/ScriptUpdater/APIUpdater.NonObsoleteApiUpdaterDetector.exe
[api-updater (non-obsolete-error-filter)] 
----------------------------------
jit/startup time      : 135,4958ms
moved types parse time: 65ms
candidates parse time : 2ms
C# parse time         : 255ms
candidates check time : 34ms
console write time    : 0ms

[api-updater (non-obsolete-error-filter)] 04/11/2021 12:14:01 : Starting C:/Program Files/Unity/Hub/Editor/2020.3.18f1/Editor/Data/Tools/ScriptUpdater/APIUpdater.NonObsoleteApiUpdaterDetector.exe
[api-updater (non-obsolete-error-filter)] 
----------------------------------
jit/startup time      : 112,7062ms
moved types parse time: 52ms
candidates parse time : 1ms
C# parse time         : 195ms
candidates check time : 38ms
console write time    : 0ms

[api-updater (non-obsolete-error-filter)] 10/11/2021 21:36:10 : Starting C:/Program Files/Unity/Hub/Editor/2020.3.18f1/Editor/Data/Tools/ScriptUpdater/APIUpdater.NonObsoleteApiUpdaterDetector.exe
[api-updater (non-obsolete-error-filter)] Exception caught while loading types from C:\Users\loanb\OneDrive\Bureau\Cours\L3\S5\LIFPROJET\a-lsd\Library\ScriptAssemblies\Unity.TextMeshPro.Editor.dll (some types may not be loaded)
	Exception of type 'System.Reflection.ReflectionTypeLoadException' was thrown.
	  at (wrapper managed-to-native) System.Reflection.Assembly.GetTypes(System.Reflection.Assembly,bool)
  at System.Reflection.Assembly.GetTypes () [0x00000] in <695d1cc93cca45069c528c15c9fdd749>:0 
  at APIUpdater.NonObsoleteApiUpdaterDetector.ExtraInfoParser+<LoadTypesWithMovedFromAttributeAsync>d__3.MoveNext () [0x000c8] in <68bff7873e0e4aa69a14dfc30bebbe3e>:0 
	Could not load file or assembly 'UnityEditor.CoreModule, Version=0.0.0.0, Culture=neutral, PublicKeyToken=null' or one of its dependencies.

[api-updater (non-obsolete-error-filter)] 
----------------------------------
jit/startup time      : 209,8833ms
moved types parse time: 63ms
candidates parse time : 1ms
C# parse time         : 291ms
candidates check time : 41ms
console write time    : 0ms

[api-updater (non-obsolete-error-filter)] 10/11/2021 22:06:48 : Starting C:/Program Files/Unity/Hub/Editor/2020.3.18f1/Editor/Data/Tools/ScriptUpdater/APIUpdater.NonObsoleteApiUpdaterDetector.exe
[api-updater (non-obsolete-error-filter)] 
----------------------------------
jit/startup time      : 114,8765ms
moved types parse time: 53ms
candidates parse time : 1ms
C# parse time         : 224ms
candidates check time : 36ms
console write time    : 0ms

[api-updater (non-obsolete-error-filter)] 10/11/2021 22:08:02 : Starting C:/Program Files/Unity/Hub/Editor/2020.3.18f1/Editor/Data/Tools/ScriptUpdater/APIUpdater.NonObsoleteApiUpdaterDetector.exe
[api-updater (non-obsolete-error-filter)] 
----------------------------------
jit/startup time      : 82,356ms
moved types parse time: 52ms
candidates parse time : 1ms
C# parse time         : 184ms
candidates check time : 28ms
console write time    : 0ms

[api-updater (non-obsolete-error-filter)] 10/11/2021 22:09:15 : Starting C:/Program Files/Unity/Hub/Editor/2020.3.18f1/Editor/Data/Tools/ScriptUpdater/APIUpdater.NonObsoleteApiUpdaterDetector.exe
[api-updater (non-obsolete-error-filter)] 
----------------------------------
jit/startup time      : 82,3993ms
moved types parse time: 51ms
candidates parse time : 1ms
C# parse time         : 201ms
candidates check time : 32ms
console write time    : 0ms

[api-updater (non-obsolete-error-filter)] 11/11/2021 13:01:45 : Starting C:/Program Files/Unity/Hub/Editor/2020.3.18f1/Editor/Data/Tools/ScriptUpdater/APIUpdater.NonObsoleteApiUpdaterDetector.exe
[api-updater (non-obsolete-error-filter)] 
----------------------------------
jit/startup time      : 129,1682ms
moved types parse time: 51ms
candidates parse time : 1ms
C# parse time         : 202ms
candidates check time : 28ms
console write time    : 0ms

[api-updater (non-obsolete-error-filter)] 11/11/2021 13:13:11 : Starting C:/Program Files/Unity/Hub/Editor/2020.3.18f1/Editor/Data/Tools/ScriptUpdater/APIUpdater.NonObsoleteApiUpdaterDetector.exe
[api-updater (non-obsolete-error-filter)] 
----------------------------------
jit/startup time      : 79,9482ms
moved types parse time: 51ms
candidates parse time : 1ms
C# parse time         : 187ms
candidates check time : 29ms
console write time    : 0ms

[api-updater (non-obsolete-error-filter)] 16/11/2021 16:47:41 : Starting C:/Program Files/Unity/Hub/Editor/2020.3.18f1/Editor/Data/Tools/ScriptUpdater/APIUpdater.NonObsoleteApiUpdaterDetector.exe
[api-updater (non-obsolete-error-filter)] 
----------------------------------
jit/startup time      : 408,0719ms
moved types parse time: 66ms
candidates parse time : 2ms
C# parse time         : 247ms
candidates check time : 26ms
console write time    : 1ms

[api-updater (non-obsolete-error-filter)] 18/11/2021 09:23:05 : Starting C:/Program Files/Unity/Hub/Editor/2020.3.18f1/Editor/Data/Tools/ScriptUpdater/APIUpdater.NonObsoleteApiUpdaterDetector.exe
[api-updater (non-obsolete-error-filter)] 
----------------------------------
jit/startup time      : 196,0001ms
moved types parse time: 70ms
candidates parse time : 1ms
C# parse time         : 250ms
candidates check time : 31ms
console write time    : 1ms

