{
    "Version": "2012-10-17",
    "Statement": [
        {
            "Sid": "",
            "Effect": "Allow",
            "Action": [
                "cloudwatch:PutMetricData"
            ],
            "Resource": [
                "*"
            ]
        },
        {
            "Sid": "",
            "Effect": "Allow",
            "Action": [
                "s3:*"
            ],
            "Resource": [
                "arn:aws:s3:::gitlab-com-snowplow-test-one/*"
            ]
        },
        {
            "Sid": "",
            "Effect": "Allow",
            "Action": [
                "dynamodb:*"
            ],
            "Resource": [
                "arn:aws:dynamodb:us-east-1:855262394183:table/SnowplowS3Loader-gitlab-us-east-1"
            ]
        },
        {
            "Sid": "",
            "Effect": "Allow",
            "Action": [
                "kinesis:*"
            ],
            "Resource": [
                "*"
            ]
        }
    ]
}
