{
  "gitlap_com_mx": {
    "gitlap.com.": {
      "records": [
        "10 mx1.emailsrvr.com.",
        "20 mx2.emailsrvr.com."
      ],
      "ttl": 300
    }
  },
  "gitlap_com_ns": {
    "gitlap.com.": {
      "records": [
        "ns-548.awsdns-04.net.",
        "ns-1754.awsdns-27.co.uk.",
        "ns-266.awsdns-33.com.",
        "ns-1468.awsdns-55.org."
      ],
      "ttl": 172800
    },
    "_05f7cfc1b1162fb582a6b57b6fbf5ffc.log.gitlap.com.": {
      "records": [
        "5532.dns-approval.sslmate.com."
      ],
      "ttl": 30
    },
    "_05f7cfc1b1162fb582a6b57b6fbf5ffc.www.log.gitlap.com.": {
      "records": [
        "5532.dns-approval.sslmate.com."
      ],
      "ttl": 30
    },
    "_989b3f4358ca5c90a7c61770903f2be4.network-scanner.gitlap.com.": {
      "records": [
        "5532.dns-approval.sslmate.com."
      ],
      "ttl": 30
    },
    "_989b3f4358ca5c90a7c61770903f2be4.www.network-scanner.gitlap.com.": {
      "records": [
        "5532.dns-approval.sslmate.com."
      ],
      "ttl": 30
    },
    "_1dc712e294ebed5762d743afb0eeba78.sentry-infra.gitlap.com.": {
      "records": [
        "5532.dns-approval.sslmate.com."
      ],
      "ttl": 30
    },
    "_1dc712e294ebed5762d743afb0eeba78.www.sentry-infra.gitlap.com.": {
      "records": [
        "5532.dns-approval.sslmate.com."
      ],
      "ttl": 30
    },
    "_fa6624a7aab4a2abe4536c19b739da32.sentry.gitlap.com.": {
      "records": [
        "5532.dns-approval.sslmate.com."
      ],
      "ttl": 30
    },
    "_fdf32ca4ec9f39b259d2bb378b8cccdc.sentry.gitlap.com.": {
      "records": [
        "5532.dns-approval.sslmate.com."
      ],
      "ttl": 30
    },
    "_fdf32ca4ec9f39b259d2bb378b8cccdc.www.sentry.gitlap.com.": {
      "records": [
        "5532.dns-approval.sslmate.com."
      ],
      "ttl": 30
    }
  },
  "gitlap_com_soa": {
    "gitlap.com.": {
      "records": [
        "ns-266.awsdns-33.com. awsdns-hostmaster.amazon.com. 1 7200 900 1209600 86400"
      ],
      "ttl": 900
    }
  },
  "gitlap_com_txt": {
    "gitlap.com.": {
      "records": [
        "v=spf1 include:emailsrvr.com ~all",
        "google-site-verification=MCUAjThAgp1PIZtSF0oujgQCaQ4Ii3gKRWOhico9GR0",
        "google-site-verification=uVmPxjEVDs4Wl0bphQNcNPHclo60Ba95CHCOMZaniK8",
        "_globalsign-domain-verification=gZnlkfgbXGeMssb-7oXHgnjonieud8CR5o7lTblG-H"
      ],
      "ttl": 300
    }
  },
  "gitlap_com_a": {
    "apilab.gitlap.com.": {
      "records": [
        "162.243.19.214"
      ],
      "ttl": 300
    },
    "athar-hameed.gitlap.com.": {
      "records": [
        "128.199.152.80"
      ],
      "ttl": 60
    },
    "axil-geo-ams.gitlap.com.": {
      "records": [
        "37.139.29.247"
      ],
      "ttl": 300
    },
    "axil-geo-sfo.gitlap.com.": {
      "records": [
        "104.236.191.64"
      ],
      "ttl": 300
    },
    "axil-review-app.gitlap.com.": {
      "records": [
        "178.62.207.141"
      ],
      "ttl": 300
    },
    "registry.axil.gitlap.com.": {
      "records": [
        "45.55.39.45"
      ],
      "ttl": 300
    },
    "ce.gitlap.com.": {
      "records": [
        "198.211.121.147"
      ],
      "ttl": 300
    },
    "centos.gitlap.com.": {
      "records": [
        "146.185.148.104"
      ],
      "ttl": 300
    },
    "centos65-3-omnibus.gitlap.com.": {
      "records": [
        "188.166.8.55"
      ],
      "ttl": 300
    },
    "centos65-4-omnibus.gitlap.com.": {
      "records": [
        "188.166.8.56"
      ],
      "ttl": 300
    },
    "centos7-4-omnibus.gitlap.com.": {
      "records": [
        "188.166.8.75"
      ],
      "ttl": 300
    },
    "centos7-5-omnibus.gitlap.com.": {
      "records": [
        "128.199.33.12"
      ],
      "ttl": 300
    },
    "pcf.cf.gitlap.com.": {
      "records": [
        "52.19.57.228"
      ],
      "ttl": 300
    },
    "cookbooks-staging.gitlap.com.": {
      "records": [
        "178.62.250.149"
      ],
      "ttl": 300
    },
    "debian7-1-omnibus-rpi2.gitlap.com.": {
      "records": [
        "212.47.240.21"
      ],
      "ttl": 300
    },
    "debian7-3-omnibus.gitlap.com.": {
      "records": [
        "188.166.62.225"
      ],
      "ttl": 300
    },
    "debian7-4-omnibus.gitlap.com.": {
      "records": [
        "188.166.9.208"
      ],
      "ttl": 300
    },
    "debian8-1-omnibus.gitlap.com.": {
      "records": [
        "188.166.93.231"
      ],
      "ttl": 300
    },
    "debian8-2-omnibus.gitlap.com.": {
      "records": [
        "188.166.94.134"
      ],
      "ttl": 300
    },
    "docker-ci-1.gitlap.com.": {
      "records": [
        "104.209.215.170"
      ],
      "ttl": 300
    },
    "docker-ci-2.gitlap.com.": {
      "records": [
        "104.208.243.253"
      ],
      "ttl": 300
    },
    "docker-cloud.gitlap.com.": {
      "records": [
        "162.243.115.26"
      ],
      "ttl": 300
    },
    "*.docker-cloud.gitlap.com.": {
      "records": [
        "162.243.115.26"
      ],
      "ttl": 300
    },
    "docker-omnibus.gitlap.com.": {
      "records": [
        "104.46.98.103"
      ],
      "ttl": 300
    },
    "douwe2.gitlap.com.": {
      "records": [
        "107.170.24.88"
      ],
      "ttl": 300
    },
    "drew-test.gitlap.com.": {
      "records": [
        "104.236.223.60"
      ],
      "ttl": 60
    },
    "experimental-runner.gitlap.com.": {
      "records": [
        "188.166.3.25"
      ],
      "ttl": 300
    },
    "freebsd-runner.gitlap.com.": {
      "records": [
        "40.84.63.122"
      ],
      "ttl": 300
    },
    "gabriel-ee.gitlap.com.": {
      "records": [
        "104.236.106.11"
      ],
      "ttl": 60
    },
    "gabriel-geo.gitlap.com.": {
      "records": [
        "37.139.3.79"
      ],
      "ttl": 60
    },
    "gitlab-runner-builder.gitlap.com.": {
      "records": [
        "159.203.104.25"
      ],
      "ttl": 300
    },
    "glm.gitlap.com.": {
      "records": [
        "188.166.73.245"
      ],
      "ttl": 300
    },
    "harish-ramachandran-testing.gitlap.com.": {
      "records": [
        "67.205.145.122"
      ],
      "ttl": 300
    },
    "harish-ramachandran.gitlap.com.": {
      "records": [
        "198.199.73.30"
      ],
      "ttl": 300
    },
    "issueboard.gitlap.com.": {
      "records": [
        "138.68.52.162"
      ],
      "ttl": 300
    },
    "jen-shin.gitlap.com.": {
      "records": [
        "128.199.223.189"
      ],
      "ttl": 300
    },
    "kerberos.gitlap.com.": {
      "records": [
        "104.236.125.131"
      ],
      "ttl": 300
    },
    "marin.gitlap.com.": {
      "records": [
        "54.211.215.241"
      ],
      "ttl": 300
    },
    "gitlab.marin.gitlap.com.": {
      "records": [
        "54.211.215.241"
      ],
      "ttl": 300
    },
    "koding.marin.gitlap.com.": {
      "records": [
        "54.165.122.200"
      ],
      "ttl": 300
    },
    "registry.marin.gitlap.com.": {
      "records": [
        "54.211.215.241"
      ],
      "ttl": 300
    },
    "mark-fletcher.gitlap.com.": {
      "records": [
        "46.101.83.54"
      ],
      "ttl": 300
    },
    "marketo-tools.gitlap.com.": {
      "records": [
        "104.236.236.43"
      ],
      "ttl": 300
    },
    "matija-cupic.gitlap.com.": {
      "records": [
        "167.99.196.112"
      ],
      "ttl": 300
    },
    "*.matija-pages.gitlap.com.": {
      "records": [
        "167.99.196.112"
      ],
      "ttl": 1800
    },
    "muthuri.gitlap.com.": {
      "records": [
        "178.62.233.131"
      ],
      "ttl": 300
    },
    "network-scanner.gitlap.com.": {
      "records": [
        "165.227.75.84"
      ],
      "ttl": 300
    },
    "nl-importer.gitlap.com.": {
      "records": [
        "178.62.233.131"
      ],
      "ttl": 300
    },
    "origin-1.gitlap.com.": {
      "records": [
        "198.199.87.151"
      ],
      "ttl": 300
    },
    "origin.gitlap.com.": {
      "records": [
        "198.199.87.151"
      ],
      "ttl": 300
    },
    "*.apps.origin.gitlap.com.": {
      "records": [
        "198.199.87.151"
      ],
      "ttl": 300
    },
    "gitlab.apps.origin.gitlap.com.": {
      "records": [
        "138.68.26.249"
      ],
      "ttl": 300
    },
    "pcf-ops-manager.gitlap.com.": {
      "records": [
        "54.83.162.67"
      ],
      "ttl": 60
    },
    "pcf.gitlap.com.": {
      "records": [
        "52.19.57.228"
      ],
      "ttl": 300
    },
    "phab.gitlap.com.": {
      "records": [
        "188.166.104.43"
      ],
      "ttl": 300
    },
    "phk.gitlap.com.": {
      "records": [
        "54.93.100.169"
      ],
      "ttl": 300
    },
    "platzi.gitlap.com.": {
      "records": [
        "104.131.158.160"
      ],
      "ttl": 300
    },
    "public-runner-1.gitlap.com.": {
      "records": [
        "137.116.72.154"
      ],
      "ttl": 300
    },
    "public-runner-10.gitlap.com.": {
      "records": [
        "104.208.235.215"
      ],
      "ttl": 300
    },
    "public-runner-11.gitlap.com.": {
      "records": [
        "104.208.232.103"
      ],
      "ttl": 300
    },
    "public-runner-12.gitlap.com.": {
      "records": [
        "104.208.235.186"
      ],
      "ttl": 300
    },
    "public-runner-13.gitlap.com.": {
      "records": [
        "104.208.245.128"
      ],
      "ttl": 300
    },
    "public-runner-14.gitlap.com.": {
      "records": [
        "104.208.246.240"
      ],
      "ttl": 300
    },
    "public-runner-15.gitlap.com.": {
      "records": [
        "104.208.246.107"
      ],
      "ttl": 300
    },
    "public-runner-16.gitlap.com.": {
      "records": [
        "104.208.153.220"
      ],
      "ttl": 300
    },
    "public-runner-17.gitlap.com.": {
      "records": [
        "104.208.157.47"
      ],
      "ttl": 300
    },
    "public-runner-18.gitlap.com.": {
      "records": [
        "104.208.158.158"
      ],
      "ttl": 300
    },
    "public-runner-19.gitlap.com.": {
      "records": [
        "104.208.153.61"
      ],
      "ttl": 300
    },
    "public-runner-2.gitlap.com.": {
      "records": [
        "104.208.238.146"
      ],
      "ttl": 300
    },
    "public-runner-20.gitlap.com.": {
      "records": [
        "104.208.157.82"
      ],
      "ttl": 300
    },
    "public-runner-21.gitlap.com.": {
      "records": [
        "104.208.246.118"
      ],
      "ttl": 300
    },
    "public-runner-22.gitlap.com.": {
      "records": [
        "104.208.152.73"
      ],
      "ttl": 300
    },
    "public-runner-23.gitlap.com.": {
      "records": [
        "104.208.159.106"
      ],
      "ttl": 300
    },
    "public-runner-24.gitlap.com.": {
      "records": [
        "104.208.153.237"
      ],
      "ttl": 300
    },
    "public-runner-25.gitlap.com.": {
      "records": [
        "104.209.214.67"
      ],
      "ttl": 300
    },
    "public-runner-3.gitlap.com.": {
      "records": [
        "104.209.139.208"
      ],
      "ttl": 300
    },
    "public-runner-4.gitlap.com.": {
      "records": [
        "104.209.140.202"
      ],
      "ttl": 300
    },
    "public-runner-5.gitlap.com.": {
      "records": [
        "104.209.132.253"
      ],
      "ttl": 300
    },
    "public-runner-6.gitlap.com.": {
      "records": [
        "104.209.135.9"
      ],
      "ttl": 300
    },
    "public-runner-7.gitlap.com.": {
      "records": [
        "104.208.240.177"
      ],
      "ttl": 300
    },
    "public-runner-8.gitlap.com.": {
      "records": [
        "104.208.243.56"
      ],
      "ttl": 300
    },
    "public-runner-9.gitlap.com.": {
      "records": [
        "104.208.158.12"
      ],
      "ttl": 300
    },
    "qa.gitlap.com.": {
      "records": [
        "146.185.146.149"
      ],
      "ttl": 300
    },
    "quality-dashboard.gitlap.com.": {
      "records": [
        "159.65.20.7"
      ],
      "ttl": 300
    },
    "redmine.gitlap.com.": {
      "records": [
        "146.185.163.5"
      ],
      "ttl": 300
    },
    "runner1.gitlap.com.": {
      "records": [
        "188.226.253.132"
      ],
      "ttl": 300
    },
    "runner10.gitlap.com.": {
      "records": [
        "159.203.81.169"
      ],
      "ttl": 300
    },
    "runner11.gitlap.com.": {
      "records": [
        "159.203.112.105"
      ],
      "ttl": 300
    },
    "runner12.gitlap.com.": {
      "records": [
        "45.55.46.156"
      ],
      "ttl": 300
    },
    "runner2.gitlap.com.": {
      "records": [
        "178.62.139.48"
      ],
      "ttl": 300
    },
    "runner3.gitlap.com.": {
      "records": [
        "178.62.154.223"
      ],
      "ttl": 300
    },
    "runner4.gitlap.com.": {
      "records": [
        "104.236.4.247"
      ],
      "ttl": 300
    },
    "runner5.gitlap.com.": {
      "records": [
        "188.226.192.4"
      ],
      "ttl": 300
    },
    "runner6.gitlap.com.": {
      "records": [
        "188.166.84.109"
      ],
      "ttl": 300
    },
    "runner7.gitlap.com.": {
      "records": [
        "45.55.36.137"
      ],
      "ttl": 300
    },
    "runner8.gitlap.com.": {
      "records": [
        "45.55.50.149"
      ],
      "ttl": 300
    },
    "runner9.gitlap.com.": {
      "records": [
        "159.203.73.239"
      ],
      "ttl": 300
    },
    "saml-qa.gitlap.com.": {
      "records": [
        "198.199.75.140"
      ],
      "ttl": 300
    },
    "saml-test.gitlap.com.": {
      "records": [
        "52.90.39.191"
      ],
      "ttl": 60
    },
    "sentry-infra.gitlap.com.": {
      "records": [
        "13.77.99.191"
      ],
      "ttl": 300
    },
    "stallman.gitlap.com.": {
      "records": [
        "185.40.99.162"
      ],
      "ttl": 300
    },
    "stanhu-geo-primary.gitlap.com.": {
      "records": [
        "35.197.88.99"
      ],
      "ttl": 300
    },
    "stanhu-geo-secondary.gitlap.com.": {
      "records": [
        "35.195.118.8"
      ],
      "ttl": 300
    },
    "testjob.gitlap.com.": {
      "records": [
        "104.131.225.34"
      ],
      "ttl": 300
    },
    "ubuntu1204-3-omnibus.gitlap.com.": {
      "records": [
        "188.166.9.212"
      ],
      "ttl": 300
    },
    "ubuntu1204-4-omnibus.gitlap.com.": {
      "records": [
        "178.62.231.44"
      ],
      "ttl": 300
    },
    "ubuntu1404-3-omnibus.gitlap.com.": {
      "records": [
        "188.166.54.232"
      ],
      "ttl": 300
    },
    "ubuntu1404-4-omnibus.gitlap.com.": {
      "records": [
        "188.166.9.220"
      ],
      "ttl": 300
    },
    "ubuntu1604-1-omnibus.gitlap.com.": {
      "records": [
        "188.166.36.90"
      ],
      "ttl": 300
    },
    "ubuntu1604-2-omnibus.gitlap.com.": {
      "records": [
        "188.166.37.66"
      ],
      "ttl": 300
    },
    "velociraptor.gitlap.com.": {
      "records": [
        "104.197.101.131"
      ],
      "ttl": 300
    },
    "win2012-ci-runner.gitlap.com.": {
      "records": [
        "40.79.34.40"
      ],
      "ttl": 300
    },
    "yorick-influxdb.gitlap.com.": {
      "records": [
        "45.55.173.201"
      ],
      "ttl": 300
    }
  },
  "gitlap_com_caa": {
    "gitlap.com.": {
      "records": [
        "0 issue \"globalsign.com\"",
        "0 issue \"letsencrypt.org\"",
        "0 issue \"sectigo.com\"",
        "0 iodef \"mailto:security@gitlab.com\""
      ],
      "ttl": 300
    }
  },
  "gitlap_com_cname": {
    "*.athar-hameed.gitlap.com.": {
      "records": [
        "athar-hameed.gitlap.com."
      ],
      "ttl": 60
    },
    "*.axil.gitlap.com.": {
      "records": [
        "axil.gitlap.com."
      ],
      "ttl": 300
    },
    "email.centos.gitlap.com.": {
      "records": [
        "mailgun.org."
      ],
      "ttl": 300
    },
    "ild45vbnyhag.centos.gitlap.com.": {
      "records": [
        "gv-g6s6dq4v3btwmz.dv.googlehosted.com."
      ],
      "ttl": 300
    },
    "*.cf.gitlap.com.": {
      "records": [
        "pcf-stack-pcf-elb-158375515.eu-west-1.elb.amazonaws.com."
      ],
      "ttl": 300
    },
    "cindy.gitlap.com.": {
      "records": [
        "gitlab.rocks"
      ],
      "ttl": 300
    },
    "*.harish-ramachandran-testing.gitlap.com.": {
      "records": [
        "harish-ramachandran-testing.gitlap.com."
      ],
      "ttl": 300
    },
    "*.harish-ramachandran.gitlap.com.": {
      "records": [
        "harish-ramachandran.gitlap.com."
      ],
      "ttl": 300
    },
    "*.jen-shin.gitlap.com.": {
      "records": [
        "jen-shin.gitlap.com."
      ],
      "ttl": 300
    },
    "*.marin.gitlap.com.": {
      "records": [
        "marin.gitlap.com."
      ],
      "ttl": 300
    },
    "*.*.marin.gitlap.com.": {
      "records": [
        "marin.gitlap.com."
      ],
      "ttl": 300
    },
    "*.mark-fletcher.gitlap.com.": {
      "records": [
        "mark-fletcher.gitlap.com."
      ],
      "ttl": 300
    },
    "*.matija-cupic.gitlap.com.": {
      "records": [
        "matija-cupic.gitlap.com."
      ],
      "ttl": 300
    },
    "monitoring.gitlap.com.": {
      "records": [
        "performance.gitlab.net."
      ],
      "ttl": 300
    },
    "profiler.gitlap.com.": {
      "records": [
        "profiler.s3-website-us-east-1.amazonaws.com."
      ],
      "ttl": 300
    },
    "*.quality-dashboard.gitlap.com.": {
      "records": [
        "quality-dashboard.gitlap.com"
      ],
      "ttl": 300
    },
    "sentry.gitlap.com.": {
      "records": [
        "sentry.gitlab.net."
      ],
      "ttl": 300
    },
    "fdf32ca4ec9f39b259d2bb378b8cccdc.sentry.gitlap.com.": {
      "records": [
        "da2d6431f13df9567d64857e5dddac57ea31071e.comodoca.com."
      ],
      "ttl": 5
    }
  }
}
