-------------------------------------------------------------------------------
Test set: io.freeswitch.OutboundClientTest
-------------------------------------------------------------------------------
Tests run: 1, Failures: 0, Errors: 0, Skipped: 0, Time elapsed: 0.304 sec
