io\freeswitch\event\IEventsListener.class
io\freeswitch\inbound\FreeSwitchHandler.class
io\freeswitch\command\FilterCommand.class
io\freeswitch\outbound\FreeSwitchClient$3$2.class
io\freeswitch\ChannelEventRunnable.class
io\freeswitch\common\UuidFactory.class
io\freeswitch\command\NologCommand.class
io\freeswitch\event\ChannelExecuteComplete.class
io\freeswitch\codec\FreeSwitchMessageHeaders$HeaderName.class
io\freeswitch\command\ExitCommand.class
io\freeswitch\command\AuthCommand.class
io\freeswitch\command\SayCommand.class
io\freeswitch\codec\FreeSwitchDecoder.class
io\freeswitch\command\SetVarCommand.class
io\freeswitch\inbound\FreeSwitchServer.class
io\freeswitch\command\SchedApiCommand.class
io\freeswitch\event\ChannelProgressMedia.class
io\freeswitch\command\BgApiCommand.class
io\freeswitch\codec\HeaderParser.class
io\freeswitch\command\GetVarCommand.class
io\freeswitch\outbound\FreeSwitchClient.class
io\freeswitch\outbound\FreeSwitchClient$1.class
io\freeswitch\command\HangupCommand.class
io\freeswitch\event\RecordStop.class
io\freeswitch\command\RecordCommand.class
io\freeswitch\common\LogLevels.class
io\freeswitch\event\ChannelUnbridge.class
io\freeswitch\SayMethod.class
io\freeswitch\IEndPoint.class
io\freeswitch\event\BackgroundJob.class
io\freeswitch\command\MyEventsCommand.class
io\freeswitch\codec\FreeSwitchDecoder$State.class
io\freeswitch\command\LogCommand.class
io\freeswitch\event\ChannelHangup.class
io\freeswitch\outbound\FreeSwitchClient$2.class
io\freeswitch\command\PlayAndGetDigitsCommand.class
io\freeswitch\event\ChannelExecute.class
io\freeswitch\codec\FreeSwitchMessageHeaders.class
io\freeswitch\event\ChannelBridge.class
io\freeswitch\command\OriginateCommand.class
io\freeswitch\command\SleepCommand.class
io\freeswitch\ConnectionFailure.class
io\freeswitch\command\DivertEventsCommand.class
io\freeswitch\codec\FreeSwitchMessageHeaders$HeaderValue.class
io\freeswitch\command\ConnectCommand.class
io\freeswitch\message\FreeSwitchMessage.class
io\freeswitch\event\ChannelProgress.class
io\freeswitch\SayType.class
io\freeswitch\outbound\DefaultFreeSwitchClientPipelineFactory.class
io\freeswitch\inbound\DefaultFreeSwitchHandler.class
io\freeswitch\message\CommandReply.class
io\freeswitch\inbound\FreeSwitchHandler$1.class
io\freeswitch\command\NixEventCommand.class
io\freeswitch\event\EslEvent.class
io\freeswitch\ExecutionHandler.class
io\freeswitch\inbound\FreeSwitchSession.class
io\freeswitch\command\EventCommand.class
io\freeswitch\command\PlaybackCommand.class
io\freeswitch\event\EventHeaders.class
io\freeswitch\command\NoEventsCommand.class
io\freeswitch\ChannelVariable.class
io\freeswitch\inbound\DefaultInboundPipelineFactory.class
io\freeswitch\common\HangupCauses.class
io\freeswitch\IProtocolListener.class
io\freeswitch\SayGender.class
io\freeswitch\outbound\FreeSwitchClient$3$1.class
io\freeswitch\command\BaseCommand.class
io\freeswitch\inbound\FreeSwitchPipelineFactory.class
io\freeswitch\event\Dtmf.class
io\freeswitch\event\SessionHeartbeat.class
io\freeswitch\command\SendMsgCommand.class
io\freeswitch\inbound\FreeSwitchHandler$SyncCallback.class
io\freeswitch\outbound\FreeSwitchClientHandler.class
io\freeswitch\event\ChannelHangupComplete.class
io\freeswitch\event\AbstractEvent.class
io\freeswitch\command\EventsCommand.class
io\freeswitch\outbound\FreeSwitchClient$3.class
io\freeswitch\codec\FreeSwitchDecoder$1.class
io\freeswitch\outbound\FreeSwitchClientHandler$SyncCallback.class
io\freeswitch\outbound\DefaultFreeSwitchClientHandler.class
io\freeswitch\command\SpeakCommand.class
io\freeswitch\command\ResumeCommand.class
io\freeswitch\outbound\FreeSwitchClientHandler$1.class
io\freeswitch\command\ApiCommand.class
