https://m.facebook.com/groups/109891215838313
https://m.facebook.com/groups/112115225485493
https://m.facebook.com/groups/112347172255359
https://m.facebook.com/groups/117557691725172
https://m.facebook.com/groups/126600154178837
https://m.facebook.com/groups/134695553299257
https://m.facebook.com/groups/137417539638916
https://m.facebook.com/groups/1417132801877720
https://m.facebook.com/groups/143021632569416
https://m.facebook.com/groups/1444475412499590
https://m.facebook.com/groups/149435065261379
https://m.facebook.com/groups/150605005048958
https://m.facebook.com/groups/151907375006490
https://m.facebook.com/groups/1525495301056000
https://m.facebook.com/groups/153822591411558
https://m.facebook.com/groups/156035021262595
https://m.facebook.com/groups/157235317768033
https://m.facebook.com/groups/160343464043710
https://m.facebook.com/groups/160861250791244
https://m.facebook.com/groups/163203007092303
https://m.facebook.com/groups/163698007173643
https://m.facebook.com/groups/167695689999251
https://m.facebook.com/groups/168284950003877
https://m.facebook.com/groups/171102003094974
https://m.facebook.com/groups/173129446152261
https://m.facebook.com/groups/177617779004060
https://m.facebook.com/groups/179507712209223
https://m.facebook.com/groups/179793855546311
https://m.facebook.com/groups/182579701859385
https://m.facebook.com/groups/183418791818351
https://m.facebook.com/groups/183548105102544
https://m.facebook.com/groups/184650458267903
https://m.facebook.com/groups/186628481503654
https://m.facebook.com/groups/189966717834413
https://m.facebook.com/groups/190924711099028
https://m.facebook.com/groups/191169787722348
https://m.facebook.com/groups/196501120473137
https://m.facebook.com/groups/199597153526840
https://m.facebook.com/groups/202400423298995
https://m.facebook.com/groups/204254322979023
https://m.facebook.com/groups/211959162239620
https://m.facebook.com/groups/213673782139123
https://m.facebook.com/groups/215058422028470
https://m.facebook.com/groups/217953908294233
https://m.facebook.com/groups/218776568306974
https://m.facebook.com/groups/220416601365889
https://m.facebook.com/groups/221438368032240
https://m.facebook.com/groups/221755388027509
https://m.facebook.com/groups/221978411329566
https://m.facebook.com/groups/223797847749489
https://m.facebook.com/groups/224198644352552
https://m.facebook.com/groups/224495077705121
https://m.facebook.com/groups/236901256428293
https://m.facebook.com/groups/237223553097575
https://m.facebook.com/groups/238897819639958
https://m.facebook.com/groups/239119056218442
https://m.facebook.com/groups/241212859403228
https://m.facebook.com/groups/242888649149195
https://m.facebook.com/groups/243994739094031
https://m.facebook.com/groups/246407972211156
https://m.facebook.com/groups/247072968784472
https://m.facebook.com/groups/250679295026329
https://m.facebook.com/groups/251121035008285
https://m.facebook.com/groups/254108114699285
https://m.facebook.com/groups/259777384212031
https://m.facebook.com/groups/260383503988357
https://m.facebook.com/groups/260522470802158
https://m.facebook.com/groups/264592670410096
https://m.facebook.com/groups/265924806927444
https://m.facebook.com/groups/267779826645969
https://m.facebook.com/groups/270531846414456
https://m.facebook.com/groups/272554942913519
https://m.facebook.com/groups/273328672743233
https://m.facebook.com/groups/276687415832554
https://m.facebook.com/groups/277551279089438
https://m.facebook.com/groups/278622682289608
https://m.facebook.com/groups/280857228685235
https://m.facebook.com/groups/283354708374887
https://m.facebook.com/groups/284234661708350
https://m.facebook.com/groups/284269031703539
https://m.facebook.com/groups/285605011545658
https://m.facebook.com/groups/288142794604371
https://m.facebook.com/groups/289274647901036
https://m.facebook.com/groups/292095290866645
https://m.facebook.com/groups/293723034125954
https://m.facebook.com/groups/294204057346222
https://m.facebook.com/groups/294662323998434
https://m.facebook.com/groups/296894507087487
https://m.facebook.com/groups/297492600325143
https://m.facebook.com/groups/298532737021247
https://m.facebook.com/groups/301552526603269
https://m.facebook.com/groups/302311349874698
https://m.facebook.com/groups/304535613053774
https://m.facebook.com/groups/305038979652609
https://m.facebook.com/groups/305274986299566
https://m.facebook.com/groups/305499662803760
https://m.facebook.com/groups/305994172815925
https://m.facebook.com/groups/307756142631724
https://m.facebook.com/groups/307977279302216
https://m.facebook.com/groups/316083091887584
https://m.facebook.com/groups/320259831348639
https://m.facebook.com/groups/323426324505151
https://m.facebook.com/groups/324436037747904
https://m.facebook.com/groups/326392814119097
https://m.facebook.com/groups/326509787405376
https://m.facebook.com/groups/328678307335796
https://m.facebook.com/groups/337352196413185
https://m.facebook.com/groups/337414702992888
https://m.facebook.com/groups/347530275390862
https://m.facebook.com/groups/348610525345456
https://m.facebook.com/groups/348828805201582
https://m.facebook.com/groups/350466018415365
https://m.facebook.com/groups/357266617731588
https://m.facebook.com/groups/360380164141373
https://m.facebook.com/groups/361082897335467
https://m.facebook.com/groups/365068986947503
https://m.facebook.com/groups/368673443189043
https://m.facebook.com/groups/368804246567620
https://m.facebook.com/groups/368952809789458
https://m.facebook.com/groups/369007233191252
https://m.facebook.com/groups/371148203044845
https://m.facebook.com/groups/374456612614043
https://m.facebook.com/groups/375969062513468
https://m.facebook.com/groups/380636065310751
https://m.facebook.com/groups/382920011865172
https://m.facebook.com/groups/383493785028988
https://m.facebook.com/groups/383516915066550
https://m.facebook.com/groups/390553364333803
https://m.facebook.com/groups/392321554221242
https://m.facebook.com/groups/395127040554575
https://m.facebook.com/groups/395236917158232
https://m.facebook.com/groups/397255247112402
https://m.facebook.com/groups/400228203440627
https://m.facebook.com/groups/401328833240533
https://m.facebook.com/groups/402957289771910
https://m.facebook.com/groups/405942952869265
https://m.facebook.com/groups/406904156135580
https://m.facebook.com/groups/408782239275085
https://m.facebook.com/groups/413483045364949
https://m.facebook.com/groups/415701008465516
https://m.facebook.com/groups/416703851733345
https://m.facebook.com/groups/418909904887863
https://m.facebook.com/groups/421231051227276
https://m.facebook.com/groups/422272437876405
https://m.facebook.com/groups/422656564489139
https://m.facebook.com/groups/422937531097068
https://m.facebook.com/groups/423511210998820
https://m.facebook.com/groups/429613563824639
https://m.facebook.com/groups/433625156687398
https://m.facebook.com/groups/435599483121256
https://m.facebook.com/groups/440147096046692
https://m.facebook.com/groups/444044945606770
https://m.facebook.com/groups/444532322234786
https://m.facebook.com/groups/448023588681224
https://m.facebook.com/groups/451558211556162
https://m.facebook.com/groups/451610231533159
https://m.facebook.com/groups/451852371582058
https://m.facebook.com/groups/466303256753096
https://m.facebook.com/groups/466559826810926
https://m.facebook.com/groups/468971666512389
https://m.facebook.com/groups/469417006469112
https://m.facebook.com/groups/470222646366948
https://m.facebook.com/groups/471387129687109
https://m.facebook.com/groups/475883945805522
https://m.facebook.com/groups/476403322439936
https://m.facebook.com/groups/484727278239271
https://m.facebook.com/groups/484930278206060
https://m.facebook.com/groups/486070081533123
https://m.facebook.com/groups/491826857516799
https://m.facebook.com/groups/496514047031891
https://m.facebook.com/groups/499693036717290
https://m.facebook.com/groups/503805846361730
https://m.facebook.com/groups/505140292941425
https://m.facebook.com/groups/509187562470812
https://m.facebook.com/groups/509566622514283
https://m.facebook.com/groups/509832632375626
https://m.facebook.com/groups/510324862326230
https://m.facebook.com/groups/510996542275321
https://m.facebook.com/groups/512844792147039
https://m.facebook.com/groups/514718321927556
https://m.facebook.com/groups/519302038131523
https://m.facebook.com/groups/520409154731017
https://m.facebook.com/groups/527360477387178
https://m.facebook.com/groups/528548213954491
https://m.facebook.com/groups/528932970486800
https://m.facebook.com/groups/529151983814886
https://m.facebook.com/groups/534146879948472
https://m.facebook.com/groups/542523205836167
https://m.facebook.com/groups/547409531980134
https://m.facebook.com/groups/547589755344918
https://m.facebook.com/groups/555173851261447
https://m.facebook.com/groups/555518594480211
https://m.facebook.com/groups/557886950972245
https://m.facebook.com/groups/559450940752346
https://m.facebook.com/groups/562302723880129
https://m.facebook.com/groups/562707737124049
https://m.facebook.com/groups/569219283099198
https://m.facebook.com/groups/574838792650166
https://m.facebook.com/groups/582091648506359
https://m.facebook.com/groups/590544437672731
https://m.facebook.com/groups/591029427575166
https://m.facebook.com/groups/595404710561071
https://m.facebook.com/groups/599866533434797
https://m.facebook.com/groups/601667526575639
https://m.facebook.com/groups/613189672135988
https://m.facebook.com/groups/613458778697263
https://m.facebook.com/groups/631664360216678
https://m.facebook.com/groups/643148339091121
https://m.facebook.com/groups/644348855594886
https://m.facebook.com/groups/650430778416286
https://m.facebook.com/groups/658371317513605
https://m.facebook.com/groups/675016435968960
https://m.facebook.com/groups/719653664764600
https://m.facebook.com/groups/721756454547136
https://m.facebook.com/groups/731016053620094
https://m.facebook.com/groups/762873007133833
https://m.facebook.com/groups/781368178579665
https://m.facebook.com/groups/790067287711192
https://m.facebook.com/groups/790334074350511
https://m.facebook.com/groups/791785487519723
https://m.facebook.com/groups/795154547242089
https://m.facebook.com/groups/802645626438307
https://m.facebook.com/groups/809333805763186
https://m.facebook.com/groups/81027994864
https://m.facebook.com/groups/812068608821855
https://m.facebook.com/groups/814685328610980
https://m.facebook.com/groups/816034561757606
https://m.facebook.com/groups/819048031557823
https://m.facebook.com/groups/819897808092540
https://m.facebook.com/groups/826397524064700
https://m.facebook.com/groups/829995677064258
https://m.facebook.com/groups/860696210630404
https://m.facebook.com/groups/869169119817420
https://m.facebook.com/groups/873149276028435
https://m.facebook.com/groups/891770940857744
https://m.facebook.com/groups/903624609669350
https://m.facebook.com/groups/913506485367181
https://m.facebook.com/groups/939030536129030
https://m.facebook.com/groups/adsfreeonline
https://m.facebook.com/groups/alberdiclasificados
https://m.facebook.com/groups/alguientieneyotengocba
https://m.facebook.com/groups/AlguienVendeYoVendoPunilla
https://m.facebook.com/groups/Allmultilevel
https://m.facebook.com/groups/alquilerescba
https://m.facebook.com/groups/AlquileresenVadelDique
https://m.facebook.com/groups/AutoEmpleoEnInternet
https://m.facebook.com/groups/autoshasta40000
https://m.facebook.com/groups/AUTOVENTACORDOBA
https://m.facebook.com/groups/buenobonitobaratomendoza
https://m.facebook.com/groups/buscodeptoencba
https://m.facebook.com/groups/buscotrabajodoytrabajo
https://m.facebook.com/groups/busquealogeneral
https://m.facebook.com/groups/busquealovehiculos
https://m.facebook.com/groups/cbavende
https://m.facebook.com/groups/celularesymascordoba
https://m.facebook.com/groups/clasificadoscbalavoz
https://m.facebook.com/groups/clasificadoscordoba
https://m.facebook.com/groups/ClasificadosCordobaCapital
https://m.facebook.com/groups/clasificadoscordobeses
https://m.facebook.com/groups/clasificadosdecordoba
https://m.facebook.com/groups/clasificadosdelavilla
https://m.facebook.com/groups/clasificadosgratis1
https://m.facebook.com/groups/ClasificadosNuevaCordoba
https://m.facebook.com/groups/ColombianosenCordoba2
https://m.facebook.com/groups/compra.venta.en.cba.arg
https://m.facebook.com/groups/comprar.y.vender.en.cordoba
https://m.facebook.com/groups/compravendecordoba
https://m.facebook.com/groups/compraventacarlospaz
https://m.facebook.com/groups/compraventacba
https://m.facebook.com/groups/compraventacordoba
https://m.facebook.com/groups/CompraVentaIntercambioCordobaCapital
https://m.facebook.com/groups/COMPRAVENTASSOLOLOMEJOR
https://m.facebook.com/groups/compraventaypermutasencordoba
https://m.facebook.com/groups/comprayventaCBA
https://m.facebook.com/groups/CompraYVentaCordoba
https://m.facebook.com/groups/comprayventadecosas
https://m.facebook.com/groups/CORDOBA.VENDETODO
https://m.facebook.com/groups/CordobaCapitalEmpleos
https://m.facebook.com/groups/cordobaclasificados
https://m.facebook.com/groups/cordobacompraryvender
https://m.facebook.com/groups/cordobacomprayvende
https://m.facebook.com/groups/cordobaenofertas
https://m.facebook.com/groups/cordobasivende
https://m.facebook.com/groups/CORDOBASUBASTAS
https://m.facebook.com/groups/cordobavende
https://m.facebook.com/groups/CordobaVendedeTodo
https://m.facebook.com/groups/cordobavendeotroca
https://m.facebook.com/groups/CORDOBAVENDEYCOMPRA
https://m.facebook.com/groups/CORDOBAYA
https://m.facebook.com/groups/cordoventas
https://m.facebook.com/groups/COVETRUEDOCBA
https://m.facebook.com/groups/danyvende
https://m.facebook.com/groups/dcordoba
https://m.facebook.com/groups/detodoclasificados
https://m.facebook.com/groups/elbancodeltrueque
https://m.facebook.com/groups/elkiosquitodebuenagentecba
https://m.facebook.com/groups/elmejorpostor
https://m.facebook.com/groups/elmultiganancias
https://m.facebook.com/groups/elnortevende
https://m.facebook.com/groups/elsurtambienexiste.elbolson
https://m.facebook.com/groups/exitoya
https://m.facebook.com/groups/ganarconinternet
https://m.facebook.com/groups/gimenezletras
https://m.facebook.com/groups/gitanean2
https://m.facebook.com/groups/gitaneando
https://m.facebook.com/groups/grupocordobacentro
https://m.facebook.com/groups/grupodeafiliados
https://m.facebook.com/groups/grupoparatodoloquenecesitesencordoba
https://m.facebook.com/groups/infocordoba
https://m.facebook.com/groups/isevende
https://m.facebook.com/groups/Kambalachando
https://m.facebook.com/groups/matiastisse
https://m.facebook.com/groups/megustaargentina
https://m.facebook.com/groups/mercadovirtualcomodoro
https://m.facebook.com/groups/motosrespuestospesonalizadas
https://m.facebook.com/groups/negociosserios
https://m.facebook.com/groups/NUEVAALTERNATIVACONMARYORIERODRIGUEZ
https://m.facebook.com/groups/nuevacordoba
https://m.facebook.com/groups/ofertaslocasdelasemana
https://m.facebook.com/groups/ofrezcocba
https://m.facebook.com/groups/OportunidadesDeNegocioEnCordobaCapital
https://m.facebook.com/groups/peq.emprendedores
https://m.facebook.com/groups/ProgresemosTodos
https://m.facebook.com/groups/proyectohctnm
https://m.facebook.com/groups/sergioale10
https://m.facebook.com/groups/sergioale13
https://m.facebook.com/groups/sergioale6
https://m.facebook.com/groups/sergioale7
https://m.facebook.com/groups/solocelus
https://m.facebook.com/groups/telocomproatelocambiox
https://m.facebook.com/groups/todosxsanmarcos
https://m.facebook.com/groups/tspelhogarylaconstruccion
https://m.facebook.com/groups/vehiculoscbaarg
https://m.facebook.com/groups/vendamostodoencordoba
https://m.facebook.com/groups/venderxface
https://m.facebook.com/groups/vendetuusado
https://m.facebook.com/groups/vendocordoba
https://m.facebook.com/groups/vendomivehiculo
https://m.facebook.com/groups/VENDOYACBACAP
https://m.facebook.com/groups/vendoyaencba
https://m.facebook.com/groups/ventadegaragecba
https://m.facebook.com/groups/VENTASCORD
https://m.facebook.com/groups/ventasdf
https://m.facebook.com/groups/ventasrapidascordoba
https://m.facebook.com/groups/villacarlospaz
https://m.facebook.com/groups/vivoennuevacordoba
https://m.facebook.com/groups/VM.Clasificados
https://m.facebook.com/groups/yoregaloturegalaselregala
https://m.facebook.com/groups/yovendotodo