https://www.facebook.com/Busco-alquilar-a-due%C3%B1o-directo-sin-gtia-418787408236956/?ref=br_rs
https://www.facebook.com/carmela.garcia.98478?ref=br_rs
https://www.facebook.com/groups/273328672743233/?ref=br_rs
https://www.facebook.com/groups/1430865983877498/?ref=br_rs
https://www.facebook.com/groups/939030536129030/?ref=br_rs
https://www.facebook.com/groups/320004804766910/?ref=br_rs
https://www.facebook.com/groups/163698007173643/?ref=br_rs
https://www.facebook.com/groups/1589326884657294/?ref=br_rs
https://www.facebook.com/Busco-casa-para-alquilar-961852103888626/?ref=br_rs
https://www.facebook.com/buscodepto.paraalquilar.5?ref=br_rs
https://www.facebook.com/groups/382920011865172/?ref=br_rs
https://www.facebook.com/groups/605976029478760/?ref=br_rs
https://www.facebook.com/groups/509832632375626/?ref=br_rs
https://www.facebook.com/groups/251672108318542/?ref=br_rs
https://www.facebook.com/groups/496514047031891/?ref=br_rs
https://www.facebook.com/groups/1615901511967928/?ref=br_rs
https://www.facebook.com/groups/1671558893068353/?ref=br_rs
https://www.facebook.com/groups/171102003094974/?ref=br_rs
https://www.facebook.com/groups/528548213954491/?ref=br_rs
https://www.facebook.com/groups/860696210630404/?ref=br_rs