{
  "runtimeTarget": {
    "name": ".NETCoreApp,Version=v3.1",
    "signature": ""
  },
  "compilationOptions": {},
  "targets": {
    ".NETCoreApp,Version=v3.1": {
      "Map/1.0.0": {
        "dependencies": {
          "AOC": "1.0.0",
          "Config.Net": "4.14.24",
          "Config.Net.Json": "4.14.24",
          "DeviceId": "5.1.1",
          "Leaf.xNet": "5.2.10",
          "Microsoft.Extensions.Configuration.Json": "3.1.7",
          "NHotkey": "2.1.0",
          "NHotkey.Wpf": "2.1.0",
          "Newtonsoft.Json": "12.0.3",
          "RadialMenu.WPF": "1.3.0",
          "SharpPcap": "5.1.0",
          "System.Drawing.Common": "4.7.0"
        },
        "runtime": {
          "Map.dll": {}
        }
      },
      "Castle.Core/4.4.0": {
        "dependencies": {
          "NETStandard.Library": "1.6.1",
          "System.Collections.Specialized": "4.3.0",
          "System.ComponentModel": "4.3.0",
          "System.ComponentModel.TypeConverter": "4.3.0",
          "System.Diagnostics.TraceSource": "4.3.0",
          "System.Dynamic.Runtime": "4.3.0",
          "System.Reflection": "4.3.0",
          "System.Reflection.Emit": "4.3.0",
          "System.Reflection.TypeExtensions": "4.3.0",
          "System.Xml.XmlDocument": "4.3.0"
        },
        "runtime": {
          "lib/netstandard1.5/Castle.Core.dll": {
            "assemblyVersion": "4.0.0.0",
            "fileVersion": "4.4.0.0"
          }
        }
      },
      "Config.Net/4.14.24": {
        "dependencies": {
          "Castle.Core": "4.4.0",
          "System.Configuration.ConfigurationManager": "4.7.0",
          "System.Text.Json": "4.7.1"
        },
        "runtime": {
          "lib/netstandard2.0/Config.Net.dll": {
            "assemblyVersion": "4.0.0.0",
            "fileVersion": "4.14.24.0"
          }
        }
      },
      "Config.Net.Json/4.14.24": {
        "dependencies": {
          "Config.Net": "4.14.24",
          "Newtonsoft.Json": "12.0.3"
        },
        "runtime": {
          "lib/netstandard2.0/Config.Net.Json.dll": {
            "assemblyVersion": "4.0.0.0",
            "fileVersion": "4.14.24.0"
          }
        }
      },
      "DeviceId/5.1.1": {
        "dependencies": {
          "Microsoft.DotNet.PlatformAbstractions": "3.1.3",
          "Microsoft.Win32.Registry": "4.7.0",
          "System.Management": "4.6.0",
          "System.Runtime.InteropServices.RuntimeInformation": "4.3.0",
          "System.Text.Json": "4.7.1"
        },
        "runtime": {
          "lib/netstandard2.0/DeviceId.dll": {
            "assemblyVersion": "5.1.1.0",
            "fileVersion": "5.1.1.0"
          }
        }
      },
      "Leaf.xNet/5.2.10": {
        "runtime": {
          "lib/netstandard2.0/Leaf.xNet.dll": {
            "assemblyVersion": "5.2.10.0",
            "fileVersion": "5.2.10.0"
          }
        }
      },
      "Microsoft.DotNet.PlatformAbstractions/3.1.3": {
        "runtime": {
          "lib/netstandard2.0/Microsoft.DotNet.PlatformAbstractions.dll": {
            "assemblyVersion": "3.1.3.0",
            "fileVersion": "3.100.320.12801"
          }
        }
      },
      "Microsoft.Extensions.Configuration/3.1.7": {
        "dependencies": {
          "Microsoft.Extensions.Configuration.Abstractions": "3.1.7"
        },
        "runtime": {
          "lib/netcoreapp3.1/Microsoft.Extensions.Configuration.dll": {
            "assemblyVersion": "3.1.7.0",
            "fileVersion": "3.100.720.37108"
          }
        }
      },
      "Microsoft.Extensions.Configuration.Abstractions/3.1.7": {
        "dependencies": {
          "Microsoft.Extensions.Primitives": "3.1.7"
        },
        "runtime": {
          "lib/netcoreapp3.1/Microsoft.Extensions.Configuration.Abstractions.dll": {
            "assemblyVersion": "3.1.7.0",
            "fileVersion": "3.100.720.37108"
          }
        }
      },
      "Microsoft.Extensions.Configuration.FileExtensions/3.1.7": {
        "dependencies": {
          "Microsoft.Extensions.Configuration": "3.1.7",
          "Microsoft.Extensions.FileProviders.Physical": "3.1.7"
        },
        "runtime": {
          "lib/netcoreapp3.1/Microsoft.Extensions.Configuration.FileExtensions.dll": {
            "assemblyVersion": "3.1.7.0",
            "fileVersion": "3.100.720.37108"
          }
        }
      },
      "Microsoft.Extensions.Configuration.Json/3.1.7": {
        "dependencies": {
          "Microsoft.Extensions.Configuration": "3.1.7",
          "Microsoft.Extensions.Configuration.FileExtensions": "3.1.7"
        },
        "runtime": {
          "lib/netcoreapp3.1/Microsoft.Extensions.Configuration.Json.dll": {
            "assemblyVersion": "3.1.7.0",
            "fileVersion": "3.100.720.37108"
          }
        }
      },
      "Microsoft.Extensions.FileProviders.Abstractions/3.1.7": {
        "dependencies": {
          "Microsoft.Extensions.Primitives": "3.1.7"
        },
        "runtime": {
          "lib/netcoreapp3.1/Microsoft.Extensions.FileProviders.Abstractions.dll": {
            "assemblyVersion": "3.1.7.0",
            "fileVersion": "3.100.720.37108"
          }
        }
      },
      "Microsoft.Extensions.FileProviders.Physical/3.1.7": {
        "dependencies": {
          "Microsoft.Extensions.FileProviders.Abstractions": "3.1.7",
          "Microsoft.Extensions.FileSystemGlobbing": "3.1.7"
        },
        "runtime": {
          "lib/netcoreapp3.1/Microsoft.Extensions.FileProviders.Physical.dll": {
            "assemblyVersion": "3.1.7.0",
            "fileVersion": "3.100.720.37108"
          }
        }
      },
      "Microsoft.Extensions.FileSystemGlobbing/3.1.7": {
        "runtime": {
          "lib/netstandard2.0/Microsoft.Extensions.FileSystemGlobbing.dll": {
            "assemblyVersion": "3.1.7.0",
            "fileVersion": "3.100.720.37108"
          }
        }
      },
      "Microsoft.Extensions.Primitives/3.1.7": {
        "runtime": {
          "lib/netcoreapp3.1/Microsoft.Extensions.Primitives.dll": {
            "assemblyVersion": "3.1.7.0",
            "fileVersion": "3.100.720.37108"
          }
        }
      },
      "Microsoft.NETCore.Platforms/3.1.0": {},
      "Microsoft.NETCore.Targets/1.1.0": {},
      "Microsoft.Win32.Primitives/4.3.0": {
        "dependencies": {
          "Microsoft.NETCore.Platforms": "3.1.0",
          "Microsoft.NETCore.Targets": "1.1.0",
          "System.Runtime": "4.3.0"
        }
      },
      "Microsoft.Win32.Registry/4.7.0": {
        "dependencies": {
          "System.Security.AccessControl": "4.7.0",
          "System.Security.Principal.Windows": "4.7.0"
        }
      },
      "Microsoft.Win32.SystemEvents/4.7.0": {
        "dependencies": {
          "Microsoft.NETCore.Platforms": "3.1.0"
        }
      },
      "NETStandard.Library/1.6.1": {
        "dependencies": {
          "Microsoft.NETCore.Platforms": "3.1.0",
          "Microsoft.Win32.Primitives": "4.3.0",
          "System.AppContext": "4.3.0",
          "System.Collections": "4.3.0",
          "System.Collections.Concurrent": "4.3.0",
          "System.Console": "4.3.0",
          "System.Diagnostics.Debug": "4.3.0",
          "System.Diagnostics.Tools": "4.3.0",
          "System.Diagnostics.Tracing": "4.3.0",
          "System.Globalization": "4.3.0",
          "System.Globalization.Calendars": "4.3.0",
          "System.IO": "4.3.0",
          "System.IO.Compression": "4.3.0",
          "System.IO.Compression.ZipFile": "4.3.0",
          "System.IO.FileSystem": "4.3.0",
          "System.IO.FileSystem.Primitives": "4.3.0",
          "System.Linq": "4.3.0",
          "System.Linq.Expressions": "4.3.0",
          "System.Net.Http": "4.3.0",
          "System.Net.Primitives": "4.3.0",
          "System.Net.Sockets": "4.3.0",
          "System.ObjectModel": "4.3.0",
          "System.Reflection": "4.3.0",
          "System.Reflection.Extensions": "4.3.0",
          "System.Reflection.Primitives": "4.3.0",
          "System.Resources.ResourceManager": "4.3.0",
          "System.Runtime": "4.3.0",
          "System.Runtime.Extensions": "4.3.0",
          "System.Runtime.Handles": "4.3.0",
          "System.Runtime.InteropServices": "4.3.0",
          "System.Runtime.InteropServices.RuntimeInformation": "4.3.0",
          "System.Runtime.Numerics": "4.3.0",
          "System.Security.Cryptography.Algorithms": "4.3.0",
          "System.Security.Cryptography.Encoding": "4.3.0",
          "System.Security.Cryptography.Primitives": "4.3.0",
          "System.Security.Cryptography.X509Certificates": "4.3.0",
          "System.Text.Encoding": "4.3.0",
          "System.Text.Encoding.Extensions": "4.3.0",
          "System.Text.RegularExpressions": "4.3.0",
          "System.Threading": "4.3.0",
          "System.Threading.Tasks": "4.3.0",
          "System.Threading.Timer": "4.3.0",
          "System.Xml.ReaderWriter": "4.3.0",
          "System.Xml.XDocument": "4.3.0"
        }
      },
      "Newtonsoft.Json/12.0.3": {
        "runtime": {
          "lib/netstandard2.0/Newtonsoft.Json.dll": {
            "assemblyVersion": "12.0.0.0",
            "fileVersion": "12.0.3.23909"
          }
        }
      },
      "NHotkey/2.1.0": {
        "runtime": {
          "lib/netcoreapp3.0/NHotkey.dll": {
            "assemblyVersion": "2.0.0.0",
            "fileVersion": "2.1.0.0"
          }
        }
      },
      "NHotkey.Wpf/2.1.0": {
        "dependencies": {
          "NHotkey": "2.1.0"
        },
        "runtime": {
          "lib/netcoreapp3.0/NHotkey.Wpf.dll": {
            "assemblyVersion": "2.0.0.0",
            "fileVersion": "2.1.0.0"
          }
        }
      },
      "PacketDotNet/1.0.3": {
        "dependencies": {
          "System.Runtime.CompilerServices.Unsafe": "4.6.0"
        },
        "runtime": {
          "lib/netstandard2.0/PacketDotNet.dll": {
            "assemblyVersion": "1.0.3.0",
            "fileVersion": "1.0.3.0"
          }
        }
      },
      "RadialMenu.WPF/1.3.0": {
        "runtime": {
          "lib/net46/RadialMenu.dll": {
            "assemblyVersion": "1.0.0.0",
            "fileVersion": "1.0.0.0"
          }
        }
      },
      "runtime.debian.8-x64.runtime.native.System.Security.Cryptography.OpenSsl/4.3.0": {},
      "runtime.fedora.23-x64.runtime.native.System.Security.Cryptography.OpenSsl/4.3.0": {},
      "runtime.fedora.24-x64.runtime.native.System.Security.Cryptography.OpenSsl/4.3.0": {},
      "runtime.native.System/4.3.0": {
        "dependencies": {
          "Microsoft.NETCore.Platforms": "3.1.0",
          "Microsoft.NETCore.Targets": "1.1.0"
        }
      },
      "runtime.native.System.IO.Compression/4.3.0": {
        "dependencies": {
          "Microsoft.NETCore.Platforms": "3.1.0",
          "Microsoft.NETCore.Targets": "1.1.0"
        }
      },
      "runtime.native.System.Net.Http/4.3.0": {
        "dependencies": {
          "Microsoft.NETCore.Platforms": "3.1.0",
          "Microsoft.NETCore.Targets": "1.1.0"
        }
      },
      "runtime.native.System.Security.Cryptography.Apple/4.3.0": {
        "dependencies": {
          "runtime.osx.10.10-x64.runtime.native.System.Security.Cryptography.Apple": "4.3.0"
        }
      },
      "runtime.native.System.Security.Cryptography.OpenSsl/4.3.0": {
        "dependencies": {
          "runtime.debian.8-x64.runtime.native.System.Security.Cryptography.OpenSsl": "4.3.0",
          "runtime.fedora.23-x64.runtime.native.System.Security.Cryptography.OpenSsl": "4.3.0",
          "runtime.fedora.24-x64.runtime.native.System.Security.Cryptography.OpenSsl": "4.3.0",
          "runtime.opensuse.13.2-x64.runtime.native.System.Security.Cryptography.OpenSsl": "4.3.0",
          "runtime.opensuse.42.1-x64.runtime.native.System.Security.Cryptography.OpenSsl": "4.3.0",
          "runtime.osx.10.10-x64.runtime.native.System.Security.Cryptography.OpenSsl": "4.3.0",
          "runtime.rhel.7-x64.runtime.native.System.Security.Cryptography.OpenSsl": "4.3.0",
          "runtime.ubuntu.14.04-x64.runtime.native.System.Security.Cryptography.OpenSsl": "4.3.0",
          "runtime.ubuntu.16.04-x64.runtime.native.System.Security.Cryptography.OpenSsl": "4.3.0",
          "runtime.ubuntu.16.10-x64.runtime.native.System.Security.Cryptography.OpenSsl": "4.3.0"
        }
      },
      "runtime.opensuse.13.2-x64.runtime.native.System.Security.Cryptography.OpenSsl/4.3.0": {},
      "runtime.opensuse.42.1-x64.runtime.native.System.Security.Cryptography.OpenSsl/4.3.0": {},
      "runtime.osx.10.10-x64.runtime.native.System.Security.Cryptography.Apple/4.3.0": {},
      "runtime.osx.10.10-x64.runtime.native.System.Security.Cryptography.OpenSsl/4.3.0": {},
      "runtime.rhel.7-x64.runtime.native.System.Security.Cryptography.OpenSsl/4.3.0": {},
      "runtime.ubuntu.14.04-x64.runtime.native.System.Security.Cryptography.OpenSsl/4.3.0": {},
      "runtime.ubuntu.16.04-x64.runtime.native.System.Security.Cryptography.OpenSsl/4.3.0": {},
      "runtime.ubuntu.16.10-x64.runtime.native.System.Security.Cryptography.OpenSsl/4.3.0": {},
      "SharpPcap/5.1.0": {
        "dependencies": {
          "PacketDotNet": "1.0.3"
        },
        "runtime": {
          "lib/netstandard2.0/SharpPcap.dll": {
            "assemblyVersion": "5.1.0.0",
            "fileVersion": "5.1.0.0"
          }
        }
      },
      "System.AppContext/4.3.0": {
        "dependencies": {
          "System.Runtime": "4.3.0"
        }
      },
      "System.Buffers/4.3.0": {
        "dependencies": {
          "System.Diagnostics.Debug": "4.3.0",
          "System.Diagnostics.Tracing": "4.3.0",
          "System.Resources.ResourceManager": "4.3.0",
          "System.Runtime": "4.3.0",
          "System.Threading": "4.3.0"
        }
      },
      "System.CodeDom/4.6.0": {},
      "System.Collections/4.3.0": {
        "dependencies": {
          "Microsoft.NETCore.Platforms": "3.1.0",
          "Microsoft.NETCore.Targets": "1.1.0",
          "System.Runtime": "4.3.0"
        }
      },
      "System.Collections.Concurrent/4.3.0": {
        "dependencies": {
          "System.Collections": "4.3.0",
          "System.Diagnostics.Debug": "4.3.0",
          "System.Diagnostics.Tracing": "4.3.0",
          "System.Globalization": "4.3.0",
          "System.Reflection": "4.3.0",
          "System.Resources.ResourceManager": "4.3.0",
          "System.Runtime": "4.3.0",
          "System.Runtime.Extensions": "4.3.0",
          "System.Threading": "4.3.0",
          "System.Threading.Tasks": "4.3.0"
        }
      },
      "System.Collections.NonGeneric/4.3.0": {
        "dependencies": {
          "System.Diagnostics.Debug": "4.3.0",
          "System.Globalization": "4.3.0",
          "System.Resources.ResourceManager": "4.3.0",
          "System.Runtime": "4.3.0",
          "System.Runtime.Extensions": "4.3.0",
          "System.Threading": "4.3.0"
        }
      },
      "System.Collections.Specialized/4.3.0": {
        "dependencies": {
          "System.Collections.NonGeneric": "4.3.0",
          "System.Globalization": "4.3.0",
          "System.Globalization.Extensions": "4.3.0",
          "System.Resources.ResourceManager": "4.3.0",
          "System.Runtime": "4.3.0",
          "System.Runtime.Extensions": "4.3.0",
          "System.Threading": "4.3.0"
        }
      },
      "System.ComponentModel/4.3.0": {
        "dependencies": {
          "System.Runtime": "4.3.0"
        }
      },
      "System.ComponentModel.Primitives/4.3.0": {
        "dependencies": {
          "System.ComponentModel": "4.3.0",
          "System.Resources.ResourceManager": "4.3.0",
          "System.Runtime": "4.3.0"
        }
      },
      "System.ComponentModel.TypeConverter/4.3.0": {
        "dependencies": {
          "System.Collections": "4.3.0",
          "System.Collections.NonGeneric": "4.3.0",
          "System.Collections.Specialized": "4.3.0",
          "System.ComponentModel": "4.3.0",
          "System.ComponentModel.Primitives": "4.3.0",
          "System.Globalization": "4.3.0",
          "System.Linq": "4.3.0",
          "System.Reflection": "4.3.0",
          "System.Reflection.Extensions": "4.3.0",
          "System.Reflection.Primitives": "4.3.0",
          "System.Reflection.TypeExtensions": "4.3.0",
          "System.Resources.ResourceManager": "4.3.0",
          "System.Runtime": "4.3.0",
          "System.Runtime.Extensions": "4.3.0",
          "System.Threading": "4.3.0"
        }
      },
      "System.Configuration.ConfigurationManager/4.7.0": {
        "dependencies": {
          "System.Security.Cryptography.ProtectedData": "4.7.0",
          "System.Security.Permissions": "4.7.0"
        }
      },
      "System.Console/4.3.0": {
        "dependencies": {
          "Microsoft.NETCore.Platforms": "3.1.0",
          "Microsoft.NETCore.Targets": "1.1.0",
          "System.IO": "4.3.0",
          "System.Runtime": "4.3.0",
          "System.Text.Encoding": "4.3.0"
        }
      },
      "System.Diagnostics.Debug/4.3.0": {
        "dependencies": {
          "Microsoft.NETCore.Platforms": "3.1.0",
          "Microsoft.NETCore.Targets": "1.1.0",
          "System.Runtime": "4.3.0"
        }
      },
      "System.Diagnostics.DiagnosticSource/4.3.0": {
        "dependencies": {
          "System.Collections": "4.3.0",
          "System.Diagnostics.Tracing": "4.3.0",
          "System.Reflection": "4.3.0",
          "System.Runtime": "4.3.0",
          "System.Threading": "4.3.0"
        }
      },
      "System.Diagnostics.Tools/4.3.0": {
        "dependencies": {
          "Microsoft.NETCore.Platforms": "3.1.0",
          "Microsoft.NETCore.Targets": "1.1.0",
          "System.Runtime": "4.3.0"
        }
      },
      "System.Diagnostics.TraceSource/4.3.0": {
        "dependencies": {
          "Microsoft.NETCore.Platforms": "3.1.0",
          "System.Collections": "4.3.0",
          "System.Diagnostics.Debug": "4.3.0",
          "System.Globalization": "4.3.0",
          "System.Resources.ResourceManager": "4.3.0",
          "System.Runtime": "4.3.0",
          "System.Runtime.Extensions": "4.3.0",
          "System.Threading": "4.3.0",
          "runtime.native.System": "4.3.0"
        }
      },
      "System.Diagnostics.Tracing/4.3.0": {
        "dependencies": {
          "Microsoft.NETCore.Platforms": "3.1.0",
          "Microsoft.NETCore.Targets": "1.1.0",
          "System.Runtime": "4.3.0"
        }
      },
      "System.Drawing.Common/4.7.0": {
        "dependencies": {
          "Microsoft.NETCore.Platforms": "3.1.0",
          "Microsoft.Win32.SystemEvents": "4.7.0"
        }
      },
      "System.Dynamic.Runtime/4.3.0": {
        "dependencies": {
          "System.Collections": "4.3.0",
          "System.Diagnostics.Debug": "4.3.0",
          "System.Linq": "4.3.0",
          "System.Linq.Expressions": "4.3.0",
          "System.ObjectModel": "4.3.0",
          "System.Reflection": "4.3.0",
          "System.Reflection.Emit": "4.3.0",
          "System.Reflection.Emit.ILGeneration": "4.3.0",
          "System.Reflection.Primitives": "4.3.0",
          "System.Reflection.TypeExtensions": "4.3.0",
          "System.Resources.ResourceManager": "4.3.0",
          "System.Runtime": "4.3.0",
          "System.Runtime.Extensions": "4.3.0",
          "System.Threading": "4.3.0"
        }
      },
      "System.Globalization/4.3.0": {
        "dependencies": {
          "Microsoft.NETCore.Platforms": "3.1.0",
          "Microsoft.NETCore.Targets": "1.1.0",
          "System.Runtime": "4.3.0"
        }
      },
      "System.Globalization.Calendars/4.3.0": {
        "dependencies": {
          "Microsoft.NETCore.Platforms": "3.1.0",
          "Microsoft.NETCore.Targets": "1.1.0",
          "System.Globalization": "4.3.0",
          "System.Runtime": "4.3.0"
        }
      },
      "System.Globalization.Extensions/4.3.0": {
        "dependencies": {
          "Microsoft.NETCore.Platforms": "3.1.0",
          "System.Globalization": "4.3.0",
          "System.Resources.ResourceManager": "4.3.0",
          "System.Runtime": "4.3.0",
          "System.Runtime.Extensions": "4.3.0",
          "System.Runtime.InteropServices": "4.3.0"
        }
      },
      "System.IO/4.3.0": {
        "dependencies": {
          "Microsoft.NETCore.Platforms": "3.1.0",
          "Microsoft.NETCore.Targets": "1.1.0",
          "System.Runtime": "4.3.0",
          "System.Text.Encoding": "4.3.0",
          "System.Threading.Tasks": "4.3.0"
        }
      },
      "System.IO.Compression/4.3.0": {
        "dependencies": {
          "Microsoft.NETCore.Platforms": "3.1.0",
          "System.Buffers": "4.3.0",
          "System.Collections": "4.3.0",
          "System.Diagnostics.Debug": "4.3.0",
          "System.IO": "4.3.0",
          "System.Resources.ResourceManager": "4.3.0",
          "System.Runtime": "4.3.0",
          "System.Runtime.Extensions": "4.3.0",
          "System.Runtime.Handles": "4.3.0",
          "System.Runtime.InteropServices": "4.3.0",
          "System.Text.Encoding": "4.3.0",
          "System.Threading": "4.3.0",
          "System.Threading.Tasks": "4.3.0",
          "runtime.native.System": "4.3.0",
          "runtime.native.System.IO.Compression": "4.3.0"
        }
      },
      "System.IO.Compression.ZipFile/4.3.0": {
        "dependencies": {
          "System.Buffers": "4.3.0",
          "System.IO": "4.3.0",
          "System.IO.Compression": "4.3.0",
          "System.IO.FileSystem": "4.3.0",
          "System.IO.FileSystem.Primitives": "4.3.0",
          "System.Resources.ResourceManager": "4.3.0",
          "System.Runtime": "4.3.0",
          "System.Runtime.Extensions": "4.3.0",
          "System.Text.Encoding": "4.3.0"
        }
      },
      "System.IO.FileSystem/4.3.0": {
        "dependencies": {
          "Microsoft.NETCore.Platforms": "3.1.0",
          "Microsoft.NETCore.Targets": "1.1.0",
          "System.IO": "4.3.0",
          "System.IO.FileSystem.Primitives": "4.3.0",
          "System.Runtime": "4.3.0",
          "System.Runtime.Handles": "4.3.0",
          "System.Text.Encoding": "4.3.0",
          "System.Threading.Tasks": "4.3.0"
        }
      },
      "System.IO.FileSystem.Primitives/4.3.0": {
        "dependencies": {
          "System.Runtime": "4.3.0"
        }
      },
      "System.Linq/4.3.0": {
        "dependencies": {
          "System.Collections": "4.3.0",
          "System.Diagnostics.Debug": "4.3.0",
          "System.Resources.ResourceManager": "4.3.0",
          "System.Runtime": "4.3.0",
          "System.Runtime.Extensions": "4.3.0"
        }
      },
      "System.Linq.Expressions/4.3.0": {
        "dependencies": {
          "System.Collections": "4.3.0",
          "System.Diagnostics.Debug": "4.3.0",
          "System.Globalization": "4.3.0",
          "System.IO": "4.3.0",
          "System.Linq": "4.3.0",
          "System.ObjectModel": "4.3.0",
          "System.Reflection": "4.3.0",
          "System.Reflection.Emit": "4.3.0",
          "System.Reflection.Emit.ILGeneration": "4.3.0",
          "System.Reflection.Emit.Lightweight": "4.3.0",
          "System.Reflection.Extensions": "4.3.0",
          "System.Reflection.Primitives": "4.3.0",
          "System.Reflection.TypeExtensions": "4.3.0",
          "System.Resources.ResourceManager": "4.3.0",
          "System.Runtime": "4.3.0",
          "System.Runtime.Extensions": "4.3.0",
          "System.Threading": "4.3.0"
        }
      },
      "System.Management/4.6.0": {
        "dependencies": {
          "Microsoft.NETCore.Platforms": "3.1.0",
          "Microsoft.Win32.Registry": "4.7.0",
          "System.CodeDom": "4.6.0"
        },
        "runtime": {
          "lib/netstandard2.0/System.Management.dll": {
            "assemblyVersion": "4.0.0.0",
            "fileVersion": "4.700.19.46214"
          }
        },
        "runtimeTargets": {
          "runtimes/win/lib/netcoreapp2.0/System.Management.dll": {
            "rid": "win",
            "assetType": "runtime",
            "assemblyVersion": "4.0.0.0",
            "fileVersion": "4.700.19.46214"
          }
        }
      },
      "System.Net.Http/4.3.0": {
        "dependencies": {
          "Microsoft.NETCore.Platforms": "3.1.0",
          "System.Collections": "4.3.0",
          "System.Diagnostics.Debug": "4.3.0",
          "System.Diagnostics.DiagnosticSource": "4.3.0",
          "System.Diagnostics.Tracing": "4.3.0",
          "System.Globalization": "4.3.0",
          "System.Globalization.Extensions": "4.3.0",
          "System.IO": "4.3.0",
          "System.IO.FileSystem": "4.3.0",
          "System.Net.Primitives": "4.3.0",
          "System.Resources.ResourceManager": "4.3.0",
          "System.Runtime": "4.3.0",
          "System.Runtime.Extensions": "4.3.0",
          "System.Runtime.Handles": "4.3.0",
          "System.Runtime.InteropServices": "4.3.0",
          "System.Security.Cryptography.Algorithms": "4.3.0",
          "System.Security.Cryptography.Encoding": "4.3.0",
          "System.Security.Cryptography.OpenSsl": "4.3.0",
          "System.Security.Cryptography.Primitives": "4.3.0",
          "System.Security.Cryptography.X509Certificates": "4.3.0",
          "System.Text.Encoding": "4.3.0",
          "System.Threading": "4.3.0",
          "System.Threading.Tasks": "4.3.0",
          "runtime.native.System": "4.3.0",
          "runtime.native.System.Net.Http": "4.3.0",
          "runtime.native.System.Security.Cryptography.OpenSsl": "4.3.0"
        }
      },
      "System.Net.Primitives/4.3.0": {
        "dependencies": {
          "Microsoft.NETCore.Platforms": "3.1.0",
          "Microsoft.NETCore.Targets": "1.1.0",
          "System.Runtime": "4.3.0",
          "System.Runtime.Handles": "4.3.0"
        }
      },
      "System.Net.Sockets/4.3.0": {
        "dependencies": {
          "Microsoft.NETCore.Platforms": "3.1.0",
          "Microsoft.NETCore.Targets": "1.1.0",
          "System.IO": "4.3.0",
          "System.Net.Primitives": "4.3.0",
          "System.Runtime": "4.3.0",
          "System.Threading.Tasks": "4.3.0"
        }
      },
      "System.ObjectModel/4.3.0": {
        "dependencies": {
          "System.Collections": "4.3.0",
          "System.Diagnostics.Debug": "4.3.0",
          "System.Resources.ResourceManager": "4.3.0",
          "System.Runtime": "4.3.0",
          "System.Threading": "4.3.0"
        }
      },
      "System.Reflection/4.3.0": {
        "dependencies": {
          "Microsoft.NETCore.Platforms": "3.1.0",
          "Microsoft.NETCore.Targets": "1.1.0",
          "System.IO": "4.3.0",
          "System.Reflection.Primitives": "4.3.0",
          "System.Runtime": "4.3.0"
        }
      },
      "System.Reflection.Emit/4.3.0": {
        "dependencies": {
          "System.IO": "4.3.0",
          "System.Reflection": "4.3.0",
          "System.Reflection.Emit.ILGeneration": "4.3.0",
          "System.Reflection.Primitives": "4.3.0",
          "System.Runtime": "4.3.0"
        }
      },
      "System.Reflection.Emit.ILGeneration/4.3.0": {
        "dependencies": {
          "System.Reflection": "4.3.0",
          "System.Reflection.Primitives": "4.3.0",
          "System.Runtime": "4.3.0"
        }
      },
      "System.Reflection.Emit.Lightweight/4.3.0": {
        "dependencies": {
          "System.Reflection": "4.3.0",
          "System.Reflection.Emit.ILGeneration": "4.3.0",
          "System.Reflection.Primitives": "4.3.0",
          "System.Runtime": "4.3.0"
        }
      },
      "System.Reflection.Extensions/4.3.0": {
        "dependencies": {
          "Microsoft.NETCore.Platforms": "3.1.0",
          "Microsoft.NETCore.Targets": "1.1.0",
          "System.Reflection": "4.3.0",
          "System.Runtime": "4.3.0"
        }
      },
      "System.Reflection.Primitives/4.3.0": {
        "dependencies": {
          "Microsoft.NETCore.Platforms": "3.1.0",
          "Microsoft.NETCore.Targets": "1.1.0",
          "System.Runtime": "4.3.0"
        }
      },
      "System.Reflection.TypeExtensions/4.3.0": {
        "dependencies": {
          "System.Reflection": "4.3.0",
          "System.Runtime": "4.3.0"
        }
      },
      "System.Resources.ResourceManager/4.3.0": {
        "dependencies": {
          "Microsoft.NETCore.Platforms": "3.1.0",
          "Microsoft.NETCore.Targets": "1.1.0",
          "System.Globalization": "4.3.0",
          "System.Reflection": "4.3.0",
          "System.Runtime": "4.3.0"
        }
      },
      "System.Runtime/4.3.0": {
        "dependencies": {
          "Microsoft.NETCore.Platforms": "3.1.0",
          "Microsoft.NETCore.Targets": "1.1.0"
        }
      },
      "System.Runtime.CompilerServices.Unsafe/4.6.0": {},
      "System.Runtime.Extensions/4.3.0": {
        "dependencies": {
          "Microsoft.NETCore.Platforms": "3.1.0",
          "Microsoft.NETCore.Targets": "1.1.0",
          "System.Runtime": "4.3.0"
        }
      },
      "System.Runtime.Handles/4.3.0": {
        "dependencies": {
          "Microsoft.NETCore.Platforms": "3.1.0",
          "Microsoft.NETCore.Targets": "1.1.0",
          "System.Runtime": "4.3.0"
        }
      },
      "System.Runtime.InteropServices/4.3.0": {
        "dependencies": {
          "Microsoft.NETCore.Platforms": "3.1.0",
          "Microsoft.NETCore.Targets": "1.1.0",
          "System.Reflection": "4.3.0",
          "System.Reflection.Primitives": "4.3.0",
          "System.Runtime": "4.3.0",
          "System.Runtime.Handles": "4.3.0"
        }
      },
      "System.Runtime.InteropServices.RuntimeInformation/4.3.0": {
        "dependencies": {
          "System.Reflection": "4.3.0",
          "System.Reflection.Extensions": "4.3.0",
          "System.Resources.ResourceManager": "4.3.0",
          "System.Runtime": "4.3.0",
          "System.Runtime.InteropServices": "4.3.0",
          "System.Threading": "4.3.0",
          "runtime.native.System": "4.3.0"
        }
      },
      "System.Runtime.Numerics/4.3.0": {
        "dependencies": {
          "System.Globalization": "4.3.0",
          "System.Resources.ResourceManager": "4.3.0",
          "System.Runtime": "4.3.0",
          "System.Runtime.Extensions": "4.3.0"
        }
      },
      "System.Security.AccessControl/4.7.0": {
        "dependencies": {
          "Microsoft.NETCore.Platforms": "3.1.0",
          "System.Security.Principal.Windows": "4.7.0"
        }
      },
      "System.Security.Cryptography.Algorithms/4.3.0": {
        "dependencies": {
          "Microsoft.NETCore.Platforms": "3.1.0",
          "System.Collections": "4.3.0",
          "System.IO": "4.3.0",
          "System.Resources.ResourceManager": "4.3.0",
          "System.Runtime": "4.3.0",
          "System.Runtime.Extensions": "4.3.0",
          "System.Runtime.Handles": "4.3.0",
          "System.Runtime.InteropServices": "4.3.0",
          "System.Runtime.Numerics": "4.3.0",
          "System.Security.Cryptography.Encoding": "4.3.0",
          "System.Security.Cryptography.Primitives": "4.3.0",
          "System.Text.Encoding": "4.3.0",
          "runtime.native.System.Security.Cryptography.Apple": "4.3.0",
          "runtime.native.System.Security.Cryptography.OpenSsl": "4.3.0"
        }
      },
      "System.Security.Cryptography.Cng/4.3.0": {
        "dependencies": {
          "Microsoft.NETCore.Platforms": "3.1.0",
          "System.IO": "4.3.0",
          "System.Resources.ResourceManager": "4.3.0",
          "System.Runtime": "4.3.0",
          "System.Runtime.Extensions": "4.3.0",
          "System.Runtime.Handles": "4.3.0",
          "System.Runtime.InteropServices": "4.3.0",
          "System.Security.Cryptography.Algorithms": "4.3.0",
          "System.Security.Cryptography.Encoding": "4.3.0",
          "System.Security.Cryptography.Primitives": "4.3.0",
          "System.Text.Encoding": "4.3.0"
        }
      },
      "System.Security.Cryptography.Csp/4.3.0": {
        "dependencies": {
          "Microsoft.NETCore.Platforms": "3.1.0",
          "System.IO": "4.3.0",
          "System.Reflection": "4.3.0",
          "System.Resources.ResourceManager": "4.3.0",
          "System.Runtime": "4.3.0",
          "System.Runtime.Extensions": "4.3.0",
          "System.Runtime.Handles": "4.3.0",
          "System.Runtime.InteropServices": "4.3.0",
          "System.Security.Cryptography.Algorithms": "4.3.0",
          "System.Security.Cryptography.Encoding": "4.3.0",
          "System.Security.Cryptography.Primitives": "4.3.0",
          "System.Text.Encoding": "4.3.0",
          "System.Threading": "4.3.0"
        }
      },
      "System.Security.Cryptography.Encoding/4.3.0": {
        "dependencies": {
          "Microsoft.NETCore.Platforms": "3.1.0",
          "System.Collections": "4.3.0",
          "System.Collections.Concurrent": "4.3.0",
          "System.Linq": "4.3.0",
          "System.Resources.ResourceManager": "4.3.0",
          "System.Runtime": "4.3.0",
          "System.Runtime.Extensions": "4.3.0",
          "System.Runtime.Handles": "4.3.0",
          "System.Runtime.InteropServices": "4.3.0",
          "System.Security.Cryptography.Primitives": "4.3.0",
          "System.Text.Encoding": "4.3.0",
          "runtime.native.System.Security.Cryptography.OpenSsl": "4.3.0"
        }
      },
      "System.Security.Cryptography.OpenSsl/4.3.0": {
        "dependencies": {
          "System.Collections": "4.3.0",
          "System.IO": "4.3.0",
          "System.Resources.ResourceManager": "4.3.0",
          "System.Runtime": "4.3.0",
          "System.Runtime.Extensions": "4.3.0",
          "System.Runtime.Handles": "4.3.0",
          "System.Runtime.InteropServices": "4.3.0",
          "System.Runtime.Numerics": "4.3.0",
          "System.Security.Cryptography.Algorithms": "4.3.0",
          "System.Security.Cryptography.Encoding": "4.3.0",
          "System.Security.Cryptography.Primitives": "4.3.0",
          "System.Text.Encoding": "4.3.0",
          "runtime.native.System.Security.Cryptography.OpenSsl": "4.3.0"
        }
      },
      "System.Security.Cryptography.Primitives/4.3.0": {
        "dependencies": {
          "System.Diagnostics.Debug": "4.3.0",
          "System.Globalization": "4.3.0",
          "System.IO": "4.3.0",
          "System.Resources.ResourceManager": "4.3.0",
          "System.Runtime": "4.3.0",
          "System.Threading": "4.3.0",
          "System.Threading.Tasks": "4.3.0"
        }
      },
      "System.Security.Cryptography.ProtectedData/4.7.0": {},
      "System.Security.Cryptography.X509Certificates/4.3.0": {
        "dependencies": {
          "Microsoft.NETCore.Platforms": "3.1.0",
          "System.Collections": "4.3.0",
          "System.Diagnostics.Debug": "4.3.0",
          "System.Globalization": "4.3.0",
          "System.Globalization.Calendars": "4.3.0",
          "System.IO": "4.3.0",
          "System.IO.FileSystem": "4.3.0",
          "System.IO.FileSystem.Primitives": "4.3.0",
          "System.Resources.ResourceManager": "4.3.0",
          "System.Runtime": "4.3.0",
          "System.Runtime.Extensions": "4.3.0",
          "System.Runtime.Handles": "4.3.0",
          "System.Runtime.InteropServices": "4.3.0",
          "System.Runtime.Numerics": "4.3.0",
          "System.Security.Cryptography.Algorithms": "4.3.0",
          "System.Security.Cryptography.Cng": "4.3.0",
          "System.Security.Cryptography.Csp": "4.3.0",
          "System.Security.Cryptography.Encoding": "4.3.0",
          "System.Security.Cryptography.OpenSsl": "4.3.0",
          "System.Security.Cryptography.Primitives": "4.3.0",
          "System.Text.Encoding": "4.3.0",
          "System.Threading": "4.3.0",
          "runtime.native.System": "4.3.0",
          "runtime.native.System.Net.Http": "4.3.0",
          "runtime.native.System.Security.Cryptography.OpenSsl": "4.3.0"
        }
      },
      "System.Security.Permissions/4.7.0": {
        "dependencies": {
          "System.Security.AccessControl": "4.7.0",
          "System.Windows.Extensions": "4.7.0"
        }
      },
      "System.Security.Principal.Windows/4.7.0": {},
      "System.Text.Encoding/4.3.0": {
        "dependencies": {
          "Microsoft.NETCore.Platforms": "3.1.0",
          "Microsoft.NETCore.Targets": "1.1.0",
          "System.Runtime": "4.3.0"
        }
      },
      "System.Text.Encoding.Extensions/4.3.0": {
        "dependencies": {
          "Microsoft.NETCore.Platforms": "3.1.0",
          "Microsoft.NETCore.Targets": "1.1.0",
          "System.Runtime": "4.3.0",
          "System.Text.Encoding": "4.3.0"
        }
      },
      "System.Text.Json/4.7.1": {
        "runtime": {
          "lib/netcoreapp3.0/System.Text.Json.dll": {
            "assemblyVersion": "4.0.1.1",
            "fileVersion": "4.700.20.6702"
          }
        }
      },
      "System.Text.RegularExpressions/4.3.0": {
        "dependencies": {
          "System.Runtime": "4.3.0"
        }
      },
      "System.Threading/4.3.0": {
        "dependencies": {
          "System.Runtime": "4.3.0",
          "System.Threading.Tasks": "4.3.0"
        }
      },
      "System.Threading.Tasks/4.3.0": {
        "dependencies": {
          "Microsoft.NETCore.Platforms": "3.1.0",
          "Microsoft.NETCore.Targets": "1.1.0",
          "System.Runtime": "4.3.0"
        }
      },
      "System.Threading.Tasks.Extensions/4.3.0": {
        "dependencies": {
          "System.Collections": "4.3.0",
          "System.Runtime": "4.3.0",
          "System.Threading.Tasks": "4.3.0"
        }
      },
      "System.Threading.Timer/4.3.0": {
        "dependencies": {
          "Microsoft.NETCore.Platforms": "3.1.0",
          "Microsoft.NETCore.Targets": "1.1.0",
          "System.Runtime": "4.3.0"
        }
      },
      "System.Windows.Extensions/4.7.0": {
        "dependencies": {
          "System.Drawing.Common": "4.7.0"
        }
      },
      "System.Xml.ReaderWriter/4.3.0": {
        "dependencies": {
          "System.Collections": "4.3.0",
          "System.Diagnostics.Debug": "4.3.0",
          "System.Globalization": "4.3.0",
          "System.IO": "4.3.0",
          "System.IO.FileSystem": "4.3.0",
          "System.IO.FileSystem.Primitives": "4.3.0",
          "System.Resources.ResourceManager": "4.3.0",
          "System.Runtime": "4.3.0",
          "System.Runtime.Extensions": "4.3.0",
          "System.Runtime.InteropServices": "4.3.0",
          "System.Text.Encoding": "4.3.0",
          "System.Text.Encoding.Extensions": "4.3.0",
          "System.Text.RegularExpressions": "4.3.0",
          "System.Threading.Tasks": "4.3.0",
          "System.Threading.Tasks.Extensions": "4.3.0"
        }
      },
      "System.Xml.XDocument/4.3.0": {
        "dependencies": {
          "System.Collections": "4.3.0",
          "System.Diagnostics.Debug": "4.3.0",
          "System.Diagnostics.Tools": "4.3.0",
          "System.Globalization": "4.3.0",
          "System.IO": "4.3.0",
          "System.Reflection": "4.3.0",
          "System.Resources.ResourceManager": "4.3.0",
          "System.Runtime": "4.3.0",
          "System.Runtime.Extensions": "4.3.0",
          "System.Text.Encoding": "4.3.0",
          "System.Threading": "4.3.0",
          "System.Xml.ReaderWriter": "4.3.0"
        }
      },
      "System.Xml.XmlDocument/4.3.0": {
        "dependencies": {
          "System.Collections": "4.3.0",
          "System.Diagnostics.Debug": "4.3.0",
          "System.Globalization": "4.3.0",
          "System.IO": "4.3.0",
          "System.Resources.ResourceManager": "4.3.0",
          "System.Runtime": "4.3.0",
          "System.Runtime.Extensions": "4.3.0",
          "System.Text.Encoding": "4.3.0",
          "System.Threading": "4.3.0",
          "System.Xml.ReaderWriter": "4.3.0"
        }
      },
      "AOC/1.0.0": {
        "dependencies": {
          "DeviceId": "5.1.1",
          "Newtonsoft.Json": "12.0.3",
          "SharpPcap": "5.1.0"
        },
        "runtime": {
          "AOC.dll": {}
        }
      }
    }
  },
  "libraries": {
    "Map/1.0.0": {
      "type": "project",
      "serviceable": false,
      "sha512": ""
    },
    "Castle.Core/4.4.0": {
      "type": "package",
      "serviceable": true,
      "sha512": "sha512-b5rRL5zeaau1y/5hIbI+6mGw3cwun16YjkHZnV9RRT5UyUIFsgLmNXJ0YnIN9p8Hw7K7AbG1q1UclQVU3DinAQ==",
      "path": "castle.core/4.4.0",
      "hashPath": "castle.core.4.4.0.nupkg.sha512"
    },
    "Config.Net/4.14.24": {
      "type": "package",
      "serviceable": true,
      "sha512": "sha512-w8dSGMCEyYue3ytuLkKsSqM2FflM9woRyKD9dlLRf7gieZr6Z8BJPtFObg3TCDQVisqT5Tpn9rd2K9ReviiR5g==",
      "path": "config.net/4.14.24",
      "hashPath": "config.net.4.14.24.nupkg.sha512"
    },
    "Config.Net.Json/4.14.24": {
      "type": "package",
      "serviceable": true,
      "sha512": "sha512-HgTLdaeONryXLTxXuylun18Z3WAvVHYChqvo1BDIvJICWm/X8zI6TNT09FF+RWYUmhfy6mXBIR51uU274d8vjw==",
      "path": "config.net.json/4.14.24",
      "hashPath": "config.net.json.4.14.24.nupkg.sha512"
    },
    "DeviceId/5.1.1": {
      "type": "package",
      "serviceable": true,
      "sha512": "sha512-763jlQlvPbZ0g7RQvIQaXp4z9+SxIZaiRt1KY80Q69e/XlEBJLtcILf+n8msux1FYy4bHhOSHrJJNX61WdCtXg==",
      "path": "deviceid/5.1.1",
      "hashPath": "deviceid.5.1.1.nupkg.sha512"
    },
    "Leaf.xNet/5.2.10": {
      "type": "package",
      "serviceable": true,
      "sha512": "sha512-Oze0nomQponksY0Cc4KtaqHCAqzaIeIaFXKz8m/F4gnRARtIjUlUYl6+jYETBqwChEFkz/0jH4iGS+M5dn8TFQ==",
      "path": "leaf.xnet/5.2.10",
      "hashPath": "leaf.xnet.5.2.10.nupkg.sha512"
    },
    "Microsoft.DotNet.PlatformAbstractions/3.1.3": {
      "type": "package",
      "serviceable": true,
      "sha512": "sha512-mJGAMML5g9tLvq3RL+YOR4EQG7cpYD67T7QMtVKK7k34LorCTL4e4Hhu0J9cvHL6lpGzITG6YRJ9Vqlf0qUKSg==",
      "path": "microsoft.dotnet.platformabstractions/3.1.3",
      "hashPath": "microsoft.dotnet.platformabstractions.3.1.3.nupkg.sha512"
    },
    "Microsoft.Extensions.Configuration/3.1.7": {
      "type": "package",
      "serviceable": true,
      "sha512": "sha512-JCVsQYNZNGeLXWMw6tkCZ8Wa2IQKF9AiLKeq9Ff2XvGJTMzhYEHAzF/FvHdeBBhPiOf+Kl1t6mdcHL93kUz6MA==",
      "path": "microsoft.extensions.configuration/3.1.7",
      "hashPath": "microsoft.extensions.configuration.3.1.7.nupkg.sha512"
    },
    "Microsoft.Extensions.Configuration.Abstractions/3.1.7": {
      "type": "package",
      "serviceable": true,
      "sha512": "sha512-WJEbrrIgly95D9rM8Gwr4w8sbYla6/iOcCZ0UE7+Qg/Q8NnQJwAJ60Lq1A26zbNE8Fm1fkbGU90LDl8e+BoRSQ==",
      "path": "microsoft.extensions.configuration.abstractions/3.1.7",
      "hashPath": "microsoft.extensions.configuration.abstractions.3.1.7.nupkg.sha512"
    },
    "Microsoft.Extensions.Configuration.FileExtensions/3.1.7": {
      "type": "package",
      "serviceable": true,
      "sha512": "sha512-MyT8ALBcE5vZ/cbkBhoo8ZFqj6AAGUrPXQlFdLAkxS11WO0vVxtJwVQVIbIM79zWI94ZkMq8Mw4E9MvuspDj9w==",
      "path": "microsoft.extensions.configuration.fileextensions/3.1.7",
      "hashPath": "microsoft.extensions.configuration.fileextensions.3.1.7.nupkg.sha512"
    },
    "Microsoft.Extensions.Configuration.Json/3.1.7": {
      "type": "package",
      "serviceable": true,
      "sha512": "sha512-BGaWgKBQPXeRlv8g6ZKTd6clFsd7p0GBwHBIU0zxI4iy4S6xjGzpWr6LOAbzEqP5Fo2QBgL8Niq2lZONcmGLZQ==",
      "path": "microsoft.extensions.configuration.json/3.1.7",
      "hashPath": "microsoft.extensions.configuration.json.3.1.7.nupkg.sha512"
    },
    "Microsoft.Extensions.FileProviders.Abstractions/3.1.7": {
      "type": "package",
      "serviceable": true,
      "sha512": "sha512-nasMSdDlIIBcKgGVHoZdFSmfUY1bI0zkvfZTsWLlEFcMCVD0fzcgsVlkeZTzPLJV0w7Uwq3okOgMWpU1nFEhxg==",
      "path": "microsoft.extensions.fileproviders.abstractions/3.1.7",
      "hashPath": "microsoft.extensions.fileproviders.abstractions.3.1.7.nupkg.sha512"
    },
    "Microsoft.Extensions.FileProviders.Physical/3.1.7": {
      "type": "package",
      "serviceable": true,
      "sha512": "sha512-mo21yJfL3oGCjC/rcwdbs2z4KGL9R5BvTfwYR31ueyg3l77i9oPCryMtlSZ4TvpI5duENNEpZyzcpaycqERdZQ==",
      "path": "microsoft.extensions.fileproviders.physical/3.1.7",
      "hashPath": "microsoft.extensions.fileproviders.physical.3.1.7.nupkg.sha512"
    },
    "Microsoft.Extensions.FileSystemGlobbing/3.1.7": {
      "type": "package",
      "serviceable": true,
      "sha512": "sha512-Cenv9mtZdSZ9u09rGYl3ejMB19gIOdRryXk/rYEzQsyrBTTuNzmRHwtHdy640P08DL1Rdu+0z/s2lpvFbZV8Hw==",
      "path": "microsoft.extensions.filesystemglobbing/3.1.7",
      "hashPath": "microsoft.extensions.filesystemglobbing.3.1.7.nupkg.sha512"
    },
    "Microsoft.Extensions.Primitives/3.1.7": {
      "type": "package",
      "serviceable": true,
      "sha512": "sha512-sa17s3vDAXTuIVGxuJcK713i0B0iaUoiwY4Sl2SLHhMqM8snznn0YVGiZAVkoKEUFWjvIg1Z/JNmAicBamI4mg==",
      "path": "microsoft.extensions.primitives/3.1.7",
      "hashPath": "microsoft.extensions.primitives.3.1.7.nupkg.sha512"
    },
    "Microsoft.NETCore.Platforms/3.1.0": {
      "type": "package",
      "serviceable": true,
      "sha512": "sha512-Y2oeN2j3gs7Rk7GOxhYWwSK1t1Y5W77D7egFsXLOYtstYxQH3uu6c78TYjRHm+SCTwJopX9S/0+NfTfUNwzZZg==",
      "path": "microsoft.netcore.platforms/3.1.0",
      "hashPath": "microsoft.netcore.platforms.3.1.0.nupkg.sha512"
    },
    "Microsoft.NETCore.Targets/1.1.0": {
      "type": "package",
      "serviceable": true,
      "sha512": "sha512-NiwGb4vj0cQijH/8u3WACXSQx7D3pBTQI1vLW+C5h4eNfVSt0YF25lx2s4akYrOgODJ/6840RVKrTZZEdeZflg==",
      "path": "microsoft.netcore.targets/1.1.0",
      "hashPath": "microsoft.netcore.targets.1.1.0.nupkg.sha512"
    },
    "Microsoft.Win32.Primitives/4.3.0": {
      "type": "package",
      "serviceable": true,
      "sha512": "sha512-RyGY+XWdzwQPFrsdKC6XRBMR+OrDUiMtNDzCjaRsiOL4K8gJ8fVKvGs/jhXzLv+8ZWz8DXW0a/pzlPmLP5H44A==",
      "path": "microsoft.win32.primitives/4.3.0",
      "hashPath": "microsoft.win32.primitives.4.3.0.nupkg.sha512"
    },
    "Microsoft.Win32.Registry/4.7.0": {
      "type": "package",
      "serviceable": true,
      "sha512": "sha512-/aPf+0hr1mVVfmA9uE0jFyKUOqMzpECKT8D9K8sW6CmINTS2nQ1o+8NbVZvp+bkZcl6dvF/I7iqqFjVGr9RuAw==",
      "path": "microsoft.win32.registry/4.7.0",
      "hashPath": "microsoft.win32.registry.4.7.0.nupkg.sha512"
    },
    "Microsoft.Win32.SystemEvents/4.7.0": {
      "type": "package",
      "serviceable": true,
      "sha512": "sha512-mtVirZr++rq+XCDITMUdnETD59XoeMxSpLRIII7JRI6Yj0LEDiO1pPn0ktlnIj12Ix8bfvQqQDMMIF9wC98oCA==",
      "path": "microsoft.win32.systemevents/4.7.0",
      "hashPath": "microsoft.win32.systemevents.4.7.0.nupkg.sha512"
    },
    "NETStandard.Library/1.6.1": {
      "type": "package",
      "serviceable": true,
      "sha512": "sha512-8iz4B27DnrFc4NirCIzeQUK3WvFgXtF1W3Wnm8rnO+jEpcD85ZBJP63G6ev8pZpOi0esoyqI9OhCuU7trOrN/A==",
      "path": "netstandard.library/1.6.1",
      "hashPath": "netstandard.library.1.6.1.nupkg.sha512"
    },
    "Newtonsoft.Json/12.0.3": {
      "type": "package",
      "serviceable": true,
      "sha512": "sha512-6mgjfnRB4jKMlzHSl+VD+oUc1IebOZabkbyWj2RiTgWwYPPuaK1H97G1sHqGwPlS5npiF5Q0OrxN1wni2n5QWg==",
      "path": "newtonsoft.json/12.0.3",
      "hashPath": "newtonsoft.json.12.0.3.nupkg.sha512"
    },
    "NHotkey/2.1.0": {
      "type": "package",
      "serviceable": true,
      "sha512": "sha512-zr6ngoY5OujU8zhp8DGZF4I10HSrHjOuiXw9LdXaplXdOJPxwbYPvIDacGtsTCnLLSZDTF+lwjDpdr+bnntRdw==",
      "path": "nhotkey/2.1.0",
      "hashPath": "nhotkey.2.1.0.nupkg.sha512"
    },
    "NHotkey.Wpf/2.1.0": {
      "type": "package",
      "serviceable": true,
      "sha512": "sha512-rDanPmRtx8c8/eKSqxhCXf6N9JanEAdIaW+FA9fRKda7TBVRNXXXPyU05s5O614KBhvm9a0YGjS9wfhqNPwi6A==",
      "path": "nhotkey.wpf/2.1.0",
      "hashPath": "nhotkey.wpf.2.1.0.nupkg.sha512"
    },
    "PacketDotNet/1.0.3": {
      "type": "package",
      "serviceable": true,
      "sha512": "sha512-as2yA4KwFRJNU8PxvddZO2SkhLPcoUtIGP/eGLMQEce483DKlE4GzqT28rj9iUso6jihvILD1iNw13TtUN1nGQ==",
      "path": "packetdotnet/1.0.3",
      "hashPath": "packetdotnet.1.0.3.nupkg.sha512"
    },
    "RadialMenu.WPF/1.3.0": {
      "type": "package",
      "serviceable": true,
      "sha512": "sha512-Q6Y6A8pE1rGu/tinNCJgGGlqm7Xu87/HsXx+AAVd5w7dOlcZPb9hPT0EyvHUz9IEiu8Lly/yJQB5uArCuK2RYA==",
      "path": "radialmenu.wpf/1.3.0",
      "hashPath": "radialmenu.wpf.1.3.0.nupkg.sha512"
    },
    "runtime.debian.8-x64.runtime.native.System.Security.Cryptography.OpenSsl/4.3.0": {
      "type": "package",
      "serviceable": true,
      "sha512": "sha512-BuRocDjztNUN0P/2RIrTiqq8FXL+me6+Bn8hyjhcEL0iiT+NRosxAC7Rkg3om2cOnsGXcMcaO9ohuL1eMNqdYg==",
      "path": "runtime.debian.8-x64.runtime.native.system.security.cryptography.openssl/4.3.0",
      "hashPath": "runtime.debian.8-x64.runtime.native.system.security.cryptography.openssl.4.3.0.nupkg.sha512"
    },
    "runtime.fedora.23-x64.runtime.native.System.Security.Cryptography.OpenSsl/4.3.0": {
      "type": "package",
      "serviceable": true,
      "sha512": "sha512-mpt4BUaVlerywe8rihlZZAOAilJYhulw+OSRXAFJDWKoh8lulvu+2q45eZuwMcyM5J3r5I0DUyqu1Wu4RZpuUA==",
      "path": "runtime.fedora.23-x64.runtime.native.system.security.cryptography.openssl/4.3.0",
      "hashPath": "runtime.fedora.23-x64.runtime.native.system.security.cryptography.openssl.4.3.0.nupkg.sha512"
    },
    "runtime.fedora.24-x64.runtime.native.System.Security.Cryptography.OpenSsl/4.3.0": {
      "type": "package",
      "serviceable": true,
      "sha512": "sha512-GvfwqafHRYBPRjWFyk2p79DjDvM2IHU94V1uaPQCwJeUGqhHU5lrDQ3mv9dfj6j0gXANLNnLAyfDu3vHyq6fPQ==",
      "path": "runtime.fedora.24-x64.runtime.native.system.security.cryptography.openssl/4.3.0",
      "hashPath": "runtime.fedora.24-x64.runtime.native.system.security.cryptography.openssl.4.3.0.nupkg.sha512"
    },
    "runtime.native.System/4.3.0": {
      "type": "package",
      "serviceable": true,
      "sha512": "sha512-SQFkSqz0QUBr1Wf+q+hr/rQjLMmh9TzhHm83c/QJ13ijBA04chkMpjrZZCG75MCCkq/7G75NeB5DYyg/YS4jWg==",
      "path": "runtime.native.system/4.3.0",
      "hashPath": "runtime.native.system.4.3.0.nupkg.sha512"
    },
    "runtime.native.System.IO.Compression/4.3.0": {
      "type": "package",
      "serviceable": true,
      "sha512": "sha512-n56by409jCuUtbZ+VjI3V6ZvV7LE2YSgl2bAJCm08DW+705K9xf2mt7sqHEurwTI0n0tBFVw8J+iZA0JzmFxYg==",
      "path": "runtime.native.system.io.compression/4.3.0",
      "hashPath": "runtime.native.system.io.compression.4.3.0.nupkg.sha512"
    },
    "runtime.native.System.Net.Http/4.3.0": {
      "type": "package",
      "serviceable": true,
      "sha512": "sha512-4HR4GbuSAyUd1nRLfpzqs9ACbj4qBT0gLj4lkvpSG+C5zZImVMjUdKZ4VgXas+jP3t/sVAZ1Eh3snh/SXwxZag==",
      "path": "runtime.native.system.net.http/4.3.0",
      "hashPath": "runtime.native.system.net.http.4.3.0.nupkg.sha512"
    },
    "runtime.native.System.Security.Cryptography.Apple/4.3.0": {
      "type": "package",
      "serviceable": true,
      "sha512": "sha512-8M/2MwbTfvF0hFp7L9ed61Zba5BC8q0A3tktaB4CrMWJoKCmBqq37cdlaMV80FUotl/P2WlTwVlpsIhC0wuAhA==",
      "path": "runtime.native.system.security.cryptography.apple/4.3.0",
      "hashPath": "runtime.native.system.security.cryptography.apple.4.3.0.nupkg.sha512"
    },
    "runtime.native.System.Security.Cryptography.OpenSsl/4.3.0": {
      "type": "package",
      "serviceable": true,
      "sha512": "sha512-/PYgPEOPqiyXlOp/lyh9IQnYhbbddTSkdfODPsquzffGkHGhAMSM1quSK8IgrKHWzFSnBv02wABBPOWOyvugaw==",
      "path": "runtime.native.system.security.cryptography.openssl/4.3.0",
      "hashPath": "runtime.native.system.security.cryptography.openssl.4.3.0.nupkg.sha512"
    },
    "runtime.opensuse.13.2-x64.runtime.native.System.Security.Cryptography.OpenSsl/4.3.0": {
      "type": "package",
      "serviceable": true,
      "sha512": "sha512-ptR+74S/krpHdaC7R9WrK0xOMZ7c/3ZrrjU/oNujRZfZxjyk7pj/pIjmyyjX9Y+LCpx/j+V16QdFjykvs8SZrA==",
      "path": "runtime.opensuse.13.2-x64.runtime.native.system.security.cryptography.openssl/4.3.0",
      "hashPath": "runtime.opensuse.13.2-x64.runtime.native.system.security.cryptography.openssl.4.3.0.nupkg.sha512"
    },
    "runtime.opensuse.42.1-x64.runtime.native.System.Security.Cryptography.OpenSsl/4.3.0": {
      "type": "package",
      "serviceable": true,
      "sha512": "sha512-pwUMXfhY9nkoKJoVEnEDrSTJOUxz3mkO1xQXjGvuiGg0LeSC1zvOe+iPORt1UcfWdsJozVxsny6861xsWj028g==",
      "path": "runtime.opensuse.42.1-x64.runtime.native.system.security.cryptography.openssl/4.3.0",
      "hashPath": "runtime.opensuse.42.1-x64.runtime.native.system.security.cryptography.openssl.4.3.0.nupkg.sha512"
    },
    "runtime.osx.10.10-x64.runtime.native.System.Security.Cryptography.Apple/4.3.0": {
      "type": "package",
      "serviceable": true,
      "sha512": "sha512-AS+Wdl20rcH0u/WJPzesIL0TKg78r5HuTZ0veDk9we0VUMU3H92B5tMflvfBOFoCXKRJWa1PvYznqirwL+rPIA==",
      "path": "runtime.osx.10.10-x64.runtime.native.system.security.cryptography.apple/4.3.0",
      "hashPath": "runtime.osx.10.10-x64.runtime.native.system.security.cryptography.apple.4.3.0.nupkg.sha512"
    },
    "runtime.osx.10.10-x64.runtime.native.System.Security.Cryptography.OpenSsl/4.3.0": {
      "type": "package",
      "serviceable": true,
      "sha512": "sha512-D+eg833XqqLWqMMT4DjeXqQ8LAFGtJxwDX3NsTtdHL34jDSy+TZI4KTfGyNw72pEWRCvoWUqEUS+JRllzxCqyw==",
      "path": "runtime.osx.10.10-x64.runtime.native.system.security.cryptography.openssl/4.3.0",
      "hashPath": "runtime.osx.10.10-x64.runtime.native.system.security.cryptography.openssl.4.3.0.nupkg.sha512"
    },
    "runtime.rhel.7-x64.runtime.native.System.Security.Cryptography.OpenSsl/4.3.0": {
      "type": "package",
      "serviceable": true,
      "sha512": "sha512-Opx+Dae6UiJqTyJk/Fj2dl4QgPiWNuvy3/kB+4EgW6/CKhqWAxhE4d9tTFSOhUV9FtV/0ZmjR7wn2bO4Fd2GfA==",
      "path": "runtime.rhel.7-x64.runtime.native.system.security.cryptography.openssl/4.3.0",
      "hashPath": "runtime.rhel.7-x64.runtime.native.system.security.cryptography.openssl.4.3.0.nupkg.sha512"
    },
    "runtime.ubuntu.14.04-x64.runtime.native.System.Security.Cryptography.OpenSsl/4.3.0": {
      "type": "package",
      "serviceable": true,
      "sha512": "sha512-G7I1EKVJ0S9ZcHind80LyZKZ3l0dS5SYA/eoleQp79edz9E5VF1uxLGrJOt1bsbFPc58+iHhNw+Yf4KpIh2BCA==",
      "path": "runtime.ubuntu.14.04-x64.runtime.native.system.security.cryptography.openssl/4.3.0",
      "hashPath": "runtime.ubuntu.14.04-x64.runtime.native.system.security.cryptography.openssl.4.3.0.nupkg.sha512"
    },
    "runtime.ubuntu.16.04-x64.runtime.native.System.Security.Cryptography.OpenSsl/4.3.0": {
      "type": "package",
      "serviceable": true,
      "sha512": "sha512-0gDyoaC+/6dn3ykntGWysnQ9Hqb5EVggaveo1POa8iaVcMvssMlhy9PJLa/pLZBpbyvChiOObRle7r8H1uZxzw==",
      "path": "runtime.ubuntu.16.04-x64.runtime.native.system.security.cryptography.openssl/4.3.0",
      "hashPath": "runtime.ubuntu.16.04-x64.runtime.native.system.security.cryptography.openssl.4.3.0.nupkg.sha512"
    },
    "runtime.ubuntu.16.10-x64.runtime.native.System.Security.Cryptography.OpenSsl/4.3.0": {
      "type": "package",
      "serviceable": true,
      "sha512": "sha512-Xx/fHNFH7uctn2fpjUSKJ+FdS135SzMxgM04HEsc4TVqFjVfZbqKNis7oXwSGaaXsvo81GwekE8jrZ3HSBgYpA==",
      "path": "runtime.ubuntu.16.10-x64.runtime.native.system.security.cryptography.openssl/4.3.0",
      "hashPath": "runtime.ubuntu.16.10-x64.runtime.native.system.security.cryptography.openssl.4.3.0.nupkg.sha512"
    },
    "SharpPcap/5.1.0": {
      "type": "package",
      "serviceable": true,
      "sha512": "sha512-INqQi8KGANmVIJyPS/iGdqbF6AA2030egIEbhT6p0CNryjC6+z8AdDEnSTmSQHj3veqf0SXfCB3JDe5NG4PNdQ==",
      "path": "sharppcap/5.1.0",
      "hashPath": "sharppcap.5.1.0.nupkg.sha512"
    },
    "System.AppContext/4.3.0": {
      "type": "package",
      "serviceable": true,
      "sha512": "sha512-Dyfi14Wf43/n4K3A7KIrTAE1lBrWVKHJgix+qh4f2saWY6sfuA2OYq+dkHqYtTHRLdkigp9psfNYNFePJQ83Tw==",
      "path": "system.appcontext/4.3.0",
      "hashPath": "system.appcontext.4.3.0.nupkg.sha512"
    },
    "System.Buffers/4.3.0": {
      "type": "package",
      "serviceable": true,
      "sha512": "sha512-bpD+HzeHI4xYutoecMaVgC+VNgzu7l9SN46kZsaCelYx0TNUqSVQr7zovgrVVNmoWIgzsarWtyk4Pq/Lwkt91A==",
      "path": "system.buffers/4.3.0",
      "hashPath": "system.buffers.4.3.0.nupkg.sha512"
    },
    "System.CodeDom/4.6.0": {
      "type": "package",
      "serviceable": true,
      "sha512": "sha512-ELdc1g5uyRVBiFK16SNtumd+k+4j2lcy+VIyl5W6EgsMKFRDsnIVH5HURLd9rWpYq8eqiFBjnMgVHNtBeP+ItQ==",
      "path": "system.codedom/4.6.0",
      "hashPath": "system.codedom.4.6.0.nupkg.sha512"
    },
    "System.Collections/4.3.0": {
      "type": "package",
      "serviceable": true,
      "sha512": "sha512-42VxHf23gYWsk8oY1fWjbdckUhDDFEjcYIudTduBooboiowwd+4dQM0rA9WXwNZYHaJL6SBRMs1LEEv4BUv46g==",
      "path": "system.collections/4.3.0",
      "hashPath": "system.collections.4.3.0.nupkg.sha512"
    },
    "System.Collections.Concurrent/4.3.0": {
      "type": "package",
      "serviceable": true,
      "sha512": "sha512-G9UiY3ILCG6o4gajBW1x7PCaDKNV5PyBEMmSP3E3Y7y6uIb8GhrE5JTclFnk87c8LKTdbgl6xar/AEGWO/LyDg==",
      "path": "system.collections.concurrent/4.3.0",
      "hashPath": "system.collections.concurrent.4.3.0.nupkg.sha512"
    },
    "System.Collections.NonGeneric/4.3.0": {
      "type": "package",
      "serviceable": true,
      "sha512": "sha512-XuZG89ztxYoZgf9dP/3DFHmjyayew8t6b6afhJK+Dj3SEku6HdtpqjxpD6L3Rwg1w9B744xQvA67uaz63AcnZQ==",
      "path": "system.collections.nongeneric/4.3.0",
      "hashPath": "system.collections.nongeneric.4.3.0.nupkg.sha512"
    },
    "System.Collections.Specialized/4.3.0": {
      "type": "package",
      "serviceable": true,
      "sha512": "sha512-x5n360NZdySNX3eciXHDYzZGWfJa5ozViA2FQB/yHjslyTMHN2GhPU/pkeV3reHkrvzgmkVh34RgVflnogpY2w==",
      "path": "system.collections.specialized/4.3.0",
      "hashPath": "system.collections.specialized.4.3.0.nupkg.sha512"
    },
    "System.ComponentModel/4.3.0": {
      "type": "package",
      "serviceable": true,
      "sha512": "sha512-FgFnJFyeaFL+ncmRhSKkJwKwoJCdlmkn4QYm4h6MaNzDFOl2FbTMveXOV2VF+0JqXoNo3GRTQk9SH7FTGegknQ==",
      "path": "system.componentmodel/4.3.0",
      "hashPath": "system.componentmodel.4.3.0.nupkg.sha512"
    },
    "System.ComponentModel.Primitives/4.3.0": {
      "type": "package",
      "serviceable": true,
      "sha512": "sha512-v0NSx/er8zSZsR688YrR+1p4q0ddC5Of0hz8BBAB0K/3Vww5+eDcOA4yOhkVaQK7HrVQh0EQb8z/I1Hpt/J9nQ==",
      "path": "system.componentmodel.primitives/4.3.0",
      "hashPath": "system.componentmodel.primitives.4.3.0.nupkg.sha512"
    },
    "System.ComponentModel.TypeConverter/4.3.0": {
      "type": "package",
      "serviceable": true,
      "sha512": "sha512-Jk1ZBtchH5WaqEOFvyLzTmVlNb411Py7TlP5QCDmwB4pmHsf7/pDJYAuHRzze+do2+uWJJmXZBz3IuAnoQ83FQ==",
      "path": "system.componentmodel.typeconverter/4.3.0",
      "hashPath": "system.componentmodel.typeconverter.4.3.0.nupkg.sha512"
    },
    "System.Configuration.ConfigurationManager/4.7.0": {
      "type": "package",
      "serviceable": true,
      "sha512": "sha512-/anOTeSZCNNI2zDilogWrZ8pNqCmYbzGNexUnNhjW8k0sHqEZ2nHJBp147jBV3hGYswu5lINpNg1vxR7bnqvVA==",
      "path": "system.configuration.configurationmanager/4.7.0",
      "hashPath": "system.configuration.configurationmanager.4.7.0.nupkg.sha512"
    },
    "System.Console/4.3.0": {
      "type": "package",
      "serviceable": true,
      "sha512": "sha512-hjQeRO+FNuA6T0sus/ellHP4qErwjTgm4GBsC4Kz65NV4P8LKUxKPUMTOUh/Bcf7Rv8VGNiyKz7OzzAQyVGJ0w==",
      "path": "system.console/4.3.0",
      "hashPath": "system.console.4.3.0.nupkg.sha512"
    },
    "System.Diagnostics.Debug/4.3.0": {
      "type": "package",
      "serviceable": true,
      "sha512": "sha512-ATKMfWNbi8MkvSk5mRu6Rb2I8DPtXf6smoN5f98XG6BzKMScFDbOdsxgSQ/VsUD1CZboe8wxW7DLWtForl5EBw==",
      "path": "system.diagnostics.debug/4.3.0",
      "hashPath": "system.diagnostics.debug.4.3.0.nupkg.sha512"
    },
    "System.Diagnostics.DiagnosticSource/4.3.0": {
      "type": "package",
      "serviceable": true,
      "sha512": "sha512-OKEv0rTLwQI+ET4cLTMtH/NkN/FJ/NRIEEAm6WzuwG68UYCFS0FVDoidy7tZ29eBUlPI50n1SCCa5BNOitwAMw==",
      "path": "system.diagnostics.diagnosticsource/4.3.0",
      "hashPath": "system.diagnostics.diagnosticsource.4.3.0.nupkg.sha512"
    },
    "System.Diagnostics.Tools/4.3.0": {
      "type": "package",
      "serviceable": true,
      "sha512": "sha512-QIgGwcWm4VQCYSDieGktMKicFUybKru1F+JGMxglEZAhrizJjW45niSL79gSFuYkwPHfXvc3qDOCSit59lkQyQ==",
      "path": "system.diagnostics.tools/4.3.0",
      "hashPath": "system.diagnostics.tools.4.3.0.nupkg.sha512"
    },
    "System.Diagnostics.TraceSource/4.3.0": {
      "type": "package",
      "serviceable": true,
      "sha512": "sha512-PXWAEqWXamctxvdYSlHY+HG0e++cVkg0FwiqtiOZ4Ziy31GD9uab2QAgkuDKUARcCdVq3DfruvdMnPfalEJbNw==",
      "path": "system.diagnostics.tracesource/4.3.0",
      "hashPath": "system.diagnostics.tracesource.4.3.0.nupkg.sha512"
    },
    "System.Diagnostics.Tracing/4.3.0": {
      "type": "package",
      "serviceable": true,
      "sha512": "sha512-a9DthgHznXM9saVTaN7/L3aMxmnLM1vHzZ6mS6yJz9cBw2I/ffBj+uvKh68mutLgGPnxuf5FVS6sZoBYzVol/w==",
      "path": "system.diagnostics.tracing/4.3.0",
      "hashPath": "system.diagnostics.tracing.4.3.0.nupkg.sha512"
    },
    "System.Drawing.Common/4.7.0": {
      "type": "package",
      "serviceable": true,
      "sha512": "sha512-v+XbyYHaZjDfn0ENmJEV1VYLgGgCTx1gnfOBcppowbpOAriglYgGCvFCPr2EEZyBvXlpxbEsTwkOlInl107ahA==",
      "path": "system.drawing.common/4.7.0",
      "hashPath": "system.drawing.common.4.7.0.nupkg.sha512"
    },
    "System.Dynamic.Runtime/4.3.0": {
      "type": "package",
      "serviceable": true,
      "sha512": "sha512-wZseFBO57ZqNsXnWV1ISpCDf+wlV22cUOg+TRa+MSXfn656SYiFq4DpVECxQfm+TDPC12rJm1mKXSmbl1+PPwQ==",
      "path": "system.dynamic.runtime/4.3.0",
      "hashPath": "system.dynamic.runtime.4.3.0.nupkg.sha512"
    },
    "System.Globalization/4.3.0": {
      "type": "package",
      "serviceable": true,
      "sha512": "sha512-uMKwiz+8EIOyyGmIY05TJt0iVj8NOtCYY2a2QFKUQvo2qVaIw7pVTeDtYd81A+/SRSaNQOFMCfmQXciMV4ZPdA==",
      "path": "system.globalization/4.3.0",
      "hashPath": "system.globalization.4.3.0.nupkg.sha512"
    },
    "System.Globalization.Calendars/4.3.0": {
      "type": "package",
      "serviceable": true,
      "sha512": "sha512-7h9ABWUVVAZogzi5NJrXTK4s+0w00o8nPJ5trcm1N3UyGCl3kAX8Zphm2nNtDh8s3Cma8LR9Ljor7sNztWZzRQ==",
      "path": "system.globalization.calendars/4.3.0",
      "hashPath": "system.globalization.calendars.4.3.0.nupkg.sha512"
    },
    "System.Globalization.Extensions/4.3.0": {
      "type": "package",
      "serviceable": true,
      "sha512": "sha512-aH886qjtZXy0YSgr8PZwsrngOojAq0lOrSvxxFAXfSNf4gNR1COeBJGFB3BI+RD4TyieBMwfEcrKW8zW7lDBNw==",
      "path": "system.globalization.extensions/4.3.0",
      "hashPath": "system.globalization.extensions.4.3.0.nupkg.sha512"
    },
    "System.IO/4.3.0": {
      "type": "package",
      "serviceable": true,
      "sha512": "sha512-oqYa0a6F+kSt1pbq0rlR4LOjlPQn5KjgLSMDQXXPyC0MkxpRV49nG3tU1jq+9n/6lIgwZiU+WJ7iVmW46wkROQ==",
      "path": "system.io/4.3.0",
      "hashPath": "system.io.4.3.0.nupkg.sha512"
    },
    "System.IO.Compression/4.3.0": {
      "type": "package",
      "serviceable": true,
      "sha512": "sha512-Yk4mW5nD0648RSaHaawtH6OCL0GJQwEolU+GiDQsdoKZ7pEFj8sxMpB/eXA5Iu8H1dSOsToZMYMcm5IlNjnKyw==",
      "path": "system.io.compression/4.3.0",
      "hashPath": "system.io.compression.4.3.0.nupkg.sha512"
    },
    "System.IO.Compression.ZipFile/4.3.0": {
      "type": "package",
      "serviceable": true,
      "sha512": "sha512-PrD/3AEVmySwfL2N9W/+6XJwmLC+qUiHg9pjJ0tCqCdSa8KfFZUkjIHS9Ilb+IG/f7ASdFGDLOvUpkFOovedew==",
      "path": "system.io.compression.zipfile/4.3.0",
      "hashPath": "system.io.compression.zipfile.4.3.0.nupkg.sha512"
    },
    "System.IO.FileSystem/4.3.0": {
      "type": "package",
      "serviceable": true,
      "sha512": "sha512-w+2qlgK3JwFArns4PQ70iPR3jerkmIhG4KVjSjTMo9a/S7rofGq4S3Fl9bfRyLroJ5/vLEvoMeSORqdPR8WG3A==",
      "path": "system.io.filesystem/4.3.0",
      "hashPath": "system.io.filesystem.4.3.0.nupkg.sha512"
    },
    "System.IO.FileSystem.Primitives/4.3.0": {
      "type": "package",
      "serviceable": true,
      "sha512": "sha512-vyVM9KEdFCzfXwtf0VKTiH0iRjXrw3Z1w+lWNesZwoRhDfPoFx9tUHolIwOTsL9L8+FEsKDtSbMImoRDrIiTtw==",
      "path": "system.io.filesystem.primitives/4.3.0",
      "hashPath": "system.io.filesystem.primitives.4.3.0.nupkg.sha512"
    },
    "System.Linq/4.3.0": {
      "type": "package",
      "serviceable": true,
      "sha512": "sha512-PIAn4g29nMju07G9JMYew8qgS5Kz7TaKhehuqqGGjgA6pQvWlYfOp/KgEEILre12vQjTSWjdBOaUp5AzGB7l0Q==",
      "path": "system.linq/4.3.0",
      "hashPath": "system.linq.4.3.0.nupkg.sha512"
    },
    "System.Linq.Expressions/4.3.0": {
      "type": "package",
      "serviceable": true,
      "sha512": "sha512-W+F1oSQi+Y6y20wl+9UfaAzceVRDttsAA1XtOWtlHy3+VTW/VV8FixVeYI5s8b6cLzNGOYuDIeieK+DPF1No3Q==",
      "path": "system.linq.expressions/4.3.0",
      "hashPath": "system.linq.expressions.4.3.0.nupkg.sha512"
    },
    "System.Management/4.6.0": {
      "type": "package",
      "serviceable": true,
      "sha512": "sha512-jMv+r1w45g87s+pgWo2GAJk+XV1WUWRGPkT7+wAWRWxvzqm97MRFlChTtMEndGgzKBHZ5dRlRYMVptmXZdbmdQ==",
      "path": "system.management/4.6.0",
      "hashPath": "system.management.4.6.0.nupkg.sha512"
    },
    "System.Net.Http/4.3.0": {
      "type": "package",
      "serviceable": true,
      "sha512": "sha512-pCOblwU52EC0Dl1cOQiRww/bFDmZOG1K/s8kPOXIRKyHi4ciWiQExrsX1u/tC0CoSI3WVV2y2RTNBvxKku/prg==",
      "path": "system.net.http/4.3.0",
      "hashPath": "system.net.http.4.3.0.nupkg.sha512"
    },
    "System.Net.Primitives/4.3.0": {
      "type": "package",
      "serviceable": true,
      "sha512": "sha512-t/TqIsZyLlCmbCi07ncRNv1JkCxCahg9u1L9o8yhUWOvH62rRgK/u4mEChkxrGlFrLnJh731Wwh6YmDKa7xipQ==",
      "path": "system.net.primitives/4.3.0",
      "hashPath": "system.net.primitives.4.3.0.nupkg.sha512"
    },
    "System.Net.Sockets/4.3.0": {
      "type": "package",
      "serviceable": true,
      "sha512": "sha512-ic6e5sx3dbvG9R4cS0syjTiezaQzH4NV5kQ71ulU4W0n1BJnH6yDyhv3mAo4Px+dl+VzAfAqFE67BagTqy4A8g==",
      "path": "system.net.sockets/4.3.0",
      "hashPath": "system.net.sockets.4.3.0.nupkg.sha512"
    },
    "System.ObjectModel/4.3.0": {
      "type": "package",
      "serviceable": true,
      "sha512": "sha512-Q9rGzljJdM72bZDrjkpWsOJFdw6CSur1ylCGalJMtLyztRwVWqEG7RgZ7nGTpJMKZZ3uVCxHDHZv3Ru8yGR/tw==",
      "path": "system.objectmodel/4.3.0",
      "hashPath": "system.objectmodel.4.3.0.nupkg.sha512"
    },
    "System.Reflection/4.3.0": {
      "type": "package",
      "serviceable": true,
      "sha512": "sha512-JqqhD4xoHKXmEPl0spFdtDj8Q1xZe8Ll2zMASyIOYenpaI3vq5pN/71J6DmqSWDRshicgrHigW6gSsRqQkk+kQ==",
      "path": "system.reflection/4.3.0",
      "hashPath": "system.reflection.4.3.0.nupkg.sha512"
    },
    "System.Reflection.Emit/4.3.0": {
      "type": "package",
      "serviceable": true,
      "sha512": "sha512-eGz0h8LJxJAOTr2TWTe8d68/ews4kneiDcQixt+RsyDln7Vtd+gyc0/U7NC99nL8oDP4c1l9oVsjjr0c5VplnQ==",
      "path": "system.reflection.emit/4.3.0",
      "hashPath": "system.reflection.emit.4.3.0.nupkg.sha512"
    },
    "System.Reflection.Emit.ILGeneration/4.3.0": {
      "type": "package",
      "serviceable": true,
      "sha512": "sha512-OBzZypjcgxxNdBeXlsvti6fnLi5kSxtS+MazVYJvJBoCEIaqXnBskMPjDiZ1TY+wu2z5gQlIhFpg1/StdZxcTw==",
      "path": "system.reflection.emit.ilgeneration/4.3.0",
      "hashPath": "system.reflection.emit.ilgeneration.4.3.0.nupkg.sha512"
    },
    "System.Reflection.Emit.Lightweight/4.3.0": {
      "type": "package",
      "serviceable": true,
      "sha512": "sha512-Mddc5+4qrAL0bTmMFq7kpce4PcG/b7Z8qsMgoucrQYFJVreJXEUsNgVIvpdrAvoZMpume5xfnr7dKdHLTP4SQQ==",
      "path": "system.reflection.emit.lightweight/4.3.0",
      "hashPath": "system.reflection.emit.lightweight.4.3.0.nupkg.sha512"
    },
    "System.Reflection.Extensions/4.3.0": {
      "type": "package",
      "serviceable": true,
      "sha512": "sha512-WLCM/hyE0SzXZkW0fk7AHGZFcNm/6RrYyNLS2aIWoXbp4YN3jzi1DpvdVIn04p0BPRW+jVw1plpEJRgyTdnbwQ==",
      "path": "system.reflection.extensions/4.3.0",
      "hashPath": "system.reflection.extensions.4.3.0.nupkg.sha512"
    },
    "System.Reflection.Primitives/4.3.0": {
      "type": "package",
      "serviceable": true,
      "sha512": "sha512-e5fWeINjfjvf56UqVxPO6ZnloXnuFxQ16tXFDqg0STWmqlnIwq9zF6yd+gIK4vtnedSXHIUSGGXuswpb8r69Yg==",
      "path": "system.reflection.primitives/4.3.0",
      "hashPath": "system.reflection.primitives.4.3.0.nupkg.sha512"
    },
    "System.Reflection.TypeExtensions/4.3.0": {
      "type": "package",
      "serviceable": true,
      "sha512": "sha512-Wli37R9/6SJHKkAGpRPCyDJrJAl7u+4dAFBf2mNR07e4o1Et9kb3qe9BRbozPvQm3UZaoKyg0uDhzkrV1Hy3CA==",
      "path": "system.reflection.typeextensions/4.3.0",
      "hashPath": "system.reflection.typeextensions.4.3.0.nupkg.sha512"
    },
    "System.Resources.ResourceManager/4.3.0": {
      "type": "package",
      "serviceable": true,
      "sha512": "sha512-8WvmZh1nE45m2qFa4Xmo/0U33T+7RFOLaAykAw4WXbe+1VzKt/bfZTv1rDI/Pibesl9nKYk8w9MgI2LZGQ6Y+Q==",
      "path": "system.resources.resourcemanager/4.3.0",
      "hashPath": "system.resources.resourcemanager.4.3.0.nupkg.sha512"
    },
    "System.Runtime/4.3.0": {
      "type": "package",
      "serviceable": true,
      "sha512": "sha512-koEhhHsQLjQVGlGxZpKmtod9pI1yyZPT1QSPpaoNOippCn51rLbYxiZ5w2lLRmw+Ml6yg3UrQQSLSvFGJ9uIqA==",
      "path": "system.runtime/4.3.0",
      "hashPath": "system.runtime.4.3.0.nupkg.sha512"
    },
    "System.Runtime.CompilerServices.Unsafe/4.6.0": {
      "type": "package",
      "serviceable": true,
      "sha512": "sha512-HxozeSlipUK7dAroTYwIcGwKDeOVpQnJlpVaOkBz7CM4TsE5b/tKlQBZecTjh6FzcSbxndYaxxpsBMz+wMJeyw==",
      "path": "system.runtime.compilerservices.unsafe/4.6.0",
      "hashPath": "system.runtime.compilerservices.unsafe.4.6.0.nupkg.sha512"
    },
    "System.Runtime.Extensions/4.3.0": {
      "type": "package",
      "serviceable": true,
      "sha512": "sha512-Pn8eE6PbsAv3aerYhnpKY5Vh7AkfjPrrxAoAj75uIss2THANJfZvAJTf4P1ssvlS3grm9XS4b7R2hmHeIV1JFg==",
      "path": "system.runtime.extensions/4.3.0",
      "hashPath": "system.runtime.extensions.4.3.0.nupkg.sha512"
    },
    "System.Runtime.Handles/4.3.0": {
      "type": "package",
      "serviceable": true,
      "sha512": "sha512-bnwZV763j1oKp86lLefFO4VH9N5hIClXCAOwGnS4xFdOWlVtKFZa/ThnkLJmJ0ss1dFLQzA8xTntX043U73gKw==",
      "path": "system.runtime.handles/4.3.0",
      "hashPath": "system.runtime.handles.4.3.0.nupkg.sha512"
    },
    "System.Runtime.InteropServices/4.3.0": {
      "type": "package",
      "serviceable": true,
      "sha512": "sha512-erfXMIKvJnaH6nuc3L9oMYXvXGSE/+YPAYHNXiBb3f82LxvXVaCZj0YUHXKue4w1k+Bv1naMj76mErGThF4WRA==",
      "path": "system.runtime.interopservices/4.3.0",
      "hashPath": "system.runtime.interopservices.4.3.0.nupkg.sha512"
    },
    "System.Runtime.InteropServices.RuntimeInformation/4.3.0": {
      "type": "package",
      "serviceable": true,
      "sha512": "sha512-hP2kLfv65yUcGlxfOtRIhCER00Q0VUj8VeJkSvYSQG/CN7oAD1BbToZtAtIh93KlddH7E3IEOOiWNjOD7N7eaA==",
      "path": "system.runtime.interopservices.runtimeinformation/4.3.0",
      "hashPath": "system.runtime.interopservices.runtimeinformation.4.3.0.nupkg.sha512"
    },
    "System.Runtime.Numerics/4.3.0": {
      "type": "package",
      "serviceable": true,
      "sha512": "sha512-dmL8IEb1fqsDQgr1EaP5E/bVQL7bNgfYu5MPqQ96kwkYhFuoBEnfRvVlD7gbKK2cJciMIIAMKl2/QVYM8OlA7A==",
      "path": "system.runtime.numerics/4.3.0",
      "hashPath": "system.runtime.numerics.4.3.0.nupkg.sha512"
    },
    "System.Security.AccessControl/4.7.0": {
      "type": "package",
      "serviceable": true,
      "sha512": "sha512-RkJViBzBrZoN8J6qHqkmx130GWU3ocWtsYBmXsIfjaYn0Ax3hgHuBYlO50VmQ3SjjwNpd4yYspy+I2qnDeq1rg==",
      "path": "system.security.accesscontrol/4.7.0",
      "hashPath": "system.security.accesscontrol.4.7.0.nupkg.sha512"
    },
    "System.Security.Cryptography.Algorithms/4.3.0": {
      "type": "package",
      "serviceable": true,
      "sha512": "sha512-dPomkXaay8cCnlkC6/hqV3fcs6Umgt0ug0foDMqzcwizlAItqLGsy1IIrMlmd3+yBOT1TB55W0wsgzN3yJ6tiw==",
      "path": "system.security.cryptography.algorithms/4.3.0",
      "hashPath": "system.security.cryptography.algorithms.4.3.0.nupkg.sha512"
    },
    "System.Security.Cryptography.Cng/4.3.0": {
      "type": "package",
      "serviceable": true,
      "sha512": "sha512-RweaTqG1hH+OpP6/W3B/LG6mRYuAPO0G8r/pI+i5s5dMAN+uHYWfaV/z+6cUKYrAYGQLpqGPXLa0XYZraJ7S0A==",
      "path": "system.security.cryptography.cng/4.3.0",
      "hashPath": "system.security.cryptography.cng.4.3.0.nupkg.sha512"
    },
    "System.Security.Cryptography.Csp/4.3.0": {
      "type": "package",
      "serviceable": true,
      "sha512": "sha512-AX7S7KPl1ZOd69/b03tnG7SotrCnU+P6Cj5k83omRIPNGO7CVRZ4k65+McxV87IovaKJ9wxNJ+TBDMlc18aHog==",
      "path": "system.security.cryptography.csp/4.3.0",
      "hashPath": "system.security.cryptography.csp.4.3.0.nupkg.sha512"
    },
    "System.Security.Cryptography.Encoding/4.3.0": {
      "type": "package",
      "serviceable": true,
      "sha512": "sha512-y2nCl5bMVA0Nxp0Eq0fJP8Z4WQ8WV9QXq+BLS58Cv4JggPGl8V/q2XedfE8F6FhKkgcvlDKzB9TevQc6x1ccDw==",
      "path": "system.security.cryptography.encoding/4.3.0",
      "hashPath": "system.security.cryptography.encoding.4.3.0.nupkg.sha512"
    },
    "System.Security.Cryptography.OpenSsl/4.3.0": {
      "type": "package",
      "serviceable": true,
      "sha512": "sha512-h8U8CRqcerb6Np3Os01VFCosC4foTlHfZmDWS6FLH2zKnX6A+IHVlxoAufxAGkFS4UIXS7pcImUojoEUpPve+Q==",
      "path": "system.security.cryptography.openssl/4.3.0",
      "hashPath": "system.security.cryptography.openssl.4.3.0.nupkg.sha512"
    },
    "System.Security.Cryptography.Primitives/4.3.0": {
      "type": "package",
      "serviceable": true,
      "sha512": "sha512-mHAxuFd6QK/O+sW7WZt2jfdU0SEygABLJROkZRJiTapHY1+JRLeXt9MFNxXCsgyunFeswk/1uHs7GdkSLCJw4g==",
      "path": "system.security.cryptography.primitives/4.3.0",
      "hashPath": "system.security.cryptography.primitives.4.3.0.nupkg.sha512"
    },
    "System.Security.Cryptography.ProtectedData/4.7.0": {
      "type": "package",
      "serviceable": true,
      "sha512": "sha512-ehYW0m9ptxpGWvE4zgqongBVWpSDU/JCFD4K7krxkQwSz/sFQjEXCUqpvencjy6DYDbn7Ig09R8GFffu8TtneQ==",
      "path": "system.security.cryptography.protecteddata/4.7.0",
      "hashPath": "system.security.cryptography.protecteddata.4.7.0.nupkg.sha512"
    },
    "System.Security.Cryptography.X509Certificates/4.3.0": {
      "type": "package",
      "serviceable": true,
      "sha512": "sha512-BzTkBlStbmPN5o6PBYeMmIS+CPl+ucFQ66AWUXM73NP3Zj4CP7OLUrfyziCFg4mEMI0RlaGdeTL+vFK6m244FA==",
      "path": "system.security.cryptography.x509certificates/4.3.0",
      "hashPath": "system.security.cryptography.x509certificates.4.3.0.nupkg.sha512"
    },
    "System.Security.Permissions/4.7.0": {
      "type": "package",
      "serviceable": true,
      "sha512": "sha512-dkOV6YYVBnYRa15/yv004eCGRBVADXw8qRbbNiCn/XpdJSUXkkUeIvdvFHkvnko4CdKMqG8yRHC4ox83LSlMsQ==",
      "path": "system.security.permissions/4.7.0",
      "hashPath": "system.security.permissions.4.7.0.nupkg.sha512"
    },
    "System.Security.Principal.Windows/4.7.0": {
      "type": "package",
      "serviceable": true,
      "sha512": "sha512-8woW00yHkttgsiQDY6iyAMqyi8LHRBQFzxmr9x2/X7C/O9HL7E2bXrTPc+xILkUF0I2Ar97wCytLO7VtbUyulg==",
      "path": "system.security.principal.windows/4.7.0",
      "hashPath": "system.security.principal.windows.4.7.0.nupkg.sha512"
    },
    "System.Text.Encoding/4.3.0": {
      "type": "package",
      "serviceable": true,
      "sha512": "sha512-rUhbI+UdVgjq/VpWOp6zsnxz6gwIiZg5nTVwq+lclP6O8ALXV45EzBI7Rki4glveF+A7M1Tuyqn0STHAMIuwsg==",
      "path": "system.text.encoding/4.3.0",
      "hashPath": "system.text.encoding.4.3.0.nupkg.sha512"
    },
    "System.Text.Encoding.Extensions/4.3.0": {
      "type": "package",
      "serviceable": true,
      "sha512": "sha512-o3fc/baox49Gj8TmhiESct0WPhGTLgnHy/H3cUyusHB5hbZ6+FIWegqiXI+J7W/bKhGFuvoW6RG7m7pFVEBQag==",
      "path": "system.text.encoding.extensions/4.3.0",
      "hashPath": "system.text.encoding.extensions.4.3.0.nupkg.sha512"
    },
    "System.Text.Json/4.7.1": {
      "type": "package",
      "serviceable": true,
      "sha512": "sha512-8kC+7DXbAsRPlMo3oeJA/8UoOqk2xB6hmWJX66RSxL0W8qdmx0mElUpMfLnv33U7MNtaeRQcN6avyZCcq3c/8w==",
      "path": "system.text.json/4.7.1",
      "hashPath": "system.text.json.4.7.1.nupkg.sha512"
    },
    "System.Text.RegularExpressions/4.3.0": {
      "type": "package",
      "serviceable": true,
      "sha512": "sha512-GJQxw4VkGkgwhJjqMWE/neIgcDrTSBMpU2iYBAQW903U9tKDofTXBW5zeJ1CRCAp3eusMGfti2U7SXro5vLR3w==",
      "path": "system.text.regularexpressions/4.3.0",
      "hashPath": "system.text.regularexpressions.4.3.0.nupkg.sha512"
    },
    "System.Threading/4.3.0": {
      "type": "package",
      "serviceable": true,
      "sha512": "sha512-hX7Sr3lL2zxkspW3xcjLB8okbjF/QAqvYp8IC77R8XcEHek0ocLztpjq3eMaDkpZPbL/kDRt6oI1Dli6uH9ksw==",
      "path": "system.threading/4.3.0",
      "hashPath": "system.threading.4.3.0.nupkg.sha512"
    },
    "System.Threading.Tasks/4.3.0": {
      "type": "package",
      "serviceable": true,
      "sha512": "sha512-7yTi2sylLYVHBJyKVtBulid9mbe5TxW5LEiRJ16zSr4V2BxIpfiVnADkCmpCrwMca+MdS4fl8xD0hvaGoWSuww==",
      "path": "system.threading.tasks/4.3.0",
      "hashPath": "system.threading.tasks.4.3.0.nupkg.sha512"
    },
    "System.Threading.Tasks.Extensions/4.3.0": {
      "type": "package",
      "serviceable": true,
      "sha512": "sha512-FT34GHNq8caR/YyvgH1Ut67O+BIgAns8M8FQX9G8ckELkWAct3OtHUan3Aa5hTNkUbyJ30qlk3Y4B3tQ1wEY8Q==",
      "path": "system.threading.tasks.extensions/4.3.0",
      "hashPath": "system.threading.tasks.extensions.4.3.0.nupkg.sha512"
    },
    "System.Threading.Timer/4.3.0": {
      "type": "package",
      "serviceable": true,
      "sha512": "sha512-S6P+njnsAeRzsBxttsY35y207rlvm59t8nidgU9bAzJzRuYYW5SB4IoVXk2v8EO1JvxC+UPnhy0KyjR+r72X8w==",
      "path": "system.threading.timer/4.3.0",
      "hashPath": "system.threading.timer.4.3.0.nupkg.sha512"
    },
    "System.Windows.Extensions/4.7.0": {
      "type": "package",
      "serviceable": true,
      "sha512": "sha512-CeWTdRNfRaSh0pm2gDTJFwVaXfTq6Xwv/sA887iwPTneW7oMtMlpvDIO+U60+3GWTB7Aom6oQwv5VZVUhQRdPQ==",
      "path": "system.windows.extensions/4.7.0",
      "hashPath": "system.windows.extensions.4.7.0.nupkg.sha512"
    },
    "System.Xml.ReaderWriter/4.3.0": {
      "type": "package",
      "serviceable": true,
      "sha512": "sha512-C44PE8lebxPQJAOkMnBA3FROhj87hkidWmOA9otRQ9PYNJkoNBUuQkVkXI/eVgBl7VcVwID8u4Q23tiHlpzJEQ==",
      "path": "system.xml.readerwriter/4.3.0",
      "hashPath": "system.xml.readerwriter.4.3.0.nupkg.sha512"
    },
    "System.Xml.XDocument/4.3.0": {
      "type": "package",
      "serviceable": true,
      "sha512": "sha512-YFfrPQJ+IGeFB3Qh5yjXDUudpg99nAUCSnGRXjy0OsktpcuWxAjjBWJ8iW45M3mWHT0OaGQWTd1oImU3yWLw4A==",
      "path": "system.xml.xdocument/4.3.0",
      "hashPath": "system.xml.xdocument.4.3.0.nupkg.sha512"
    },
    "System.Xml.XmlDocument/4.3.0": {
      "type": "package",
      "serviceable": true,
      "sha512": "sha512-arbSMUhkWji/xMA+ZFLRwFI80sd1TA2cN/zdsOsDq9DvGJNq2YBWJyo1jlOPPDUEEsXtcop/Jt06n/5h8fPidg==",
      "path": "system.xml.xmldocument/4.3.0",
      "hashPath": "system.xml.xmldocument.4.3.0.nupkg.sha512"
    },
    "AOC/1.0.0": {
      "type": "project",
      "serviceable": false,
      "sha512": ""
    }
  }
}