  __  __                  __   __  _
 |  \/  |   ___    _ __   \ \ / / | |__     __ _
 | |\/| |  / _ \  | '_ \   \ V /  | '_ \   / _` |
 | |  | | | (_) | | | | |   | |   | |_) | | (_| |
 |_|  |_|  \___/  |_| |_|   |_|   |_.__/   \__,_|

${application.title} ${application.version}
Powered by Spring Boot ${spring-boot.version}