%%MatrixMarket matrix coordinate real general
% File is created by mor4ansys: software to make a compact model from Ansys files.
% For mor4ansys info contact Evgenii Rudnyi at rudnyi@imtek.de.

5 9669 5
1 9646 1
2 9648 1
3 3373 1
4 4813 1
5 6268 1

