{
    "/js/admin/admin.js": "/js/admin/admin.js",
    "/css/admin/admin.css": "/css/admin/admin.css",
    "/css/app.css": "/css/app.css",
    "/js/app.js": "/js/app.js",
    "/flags/1x1/gb.svg": "/flags/1x1/gb.svg",
    "/flags/4x3/gb.svg": "/flags/4x3/gb.svg",
    "/flags/1x1/ua.svg": "/flags/1x1/ua.svg",
    "/flags/4x3/ua.svg": "/flags/4x3/ua.svg",
    "/flags/1x1/ru.svg": "/flags/1x1/ru.svg",
    "/flags/4x3/ru.svg": "/flags/4x3/ru.svg"
}
