<svg version="1.1" xmlns="http://www.w3.org/2000/svg" xmlns:xlink="http://www.w3.org/1999/xlink" x="0px" y="0px" width="1920px"
	 height="756.8px" viewBox="-780 -278.4 1920 756.8" enable-background="new -780 -278.4 1920 756.8" xml:space="preserve">
<g id="Layer_1">
	<g>
		<path fill="#F4EFD7" d="M-530.905,99.996c0-95.332,33.108-185.438,93.232-253.711c62.692-71.197,146.911-110.409,237.127-110.409
			h761.091c90.216,0,174.432,39.211,237.132,110.409c60.119,68.274,93.229,158.379,93.229,253.711
			c0,95.339-33.11,185.442-93.229,253.716c-62.7,71.2-146.916,110.411-237.132,110.411h-761.091
			c-90.216,0-174.434-39.211-237.127-110.411C-497.797,285.439-530.905,195.335-530.905,99.996z M728.168,99.996
			c0-111.046-75.196-201.382-167.623-201.382h-761.091c-92.427,0-167.618,90.336-167.618,201.382s75.191,201.389,167.618,201.389
			h761.091C652.972,301.386,728.168,211.042,728.168,99.996z"/>
		<g>
			<defs>
				<path id="SVGID_1_" d="M-530.905,99.996c0-95.332,33.108-185.438,93.232-253.711c62.692-71.197,146.911-110.409,237.127-110.409
					h761.091c90.216,0,174.432,39.211,237.132,110.409c60.119,68.274,93.229,158.379,93.229,253.711
					c0,95.339-33.11,185.442-93.229,253.716c-62.7,71.2-146.916,110.411-237.132,110.411h-761.091
					c-90.216,0-174.434-39.211-237.127-110.411C-497.797,285.439-530.905,195.335-530.905,99.996z M728.168,99.996
					c0-111.046-75.196-201.382-167.623-201.382h-761.091c-92.427,0-167.618,90.336-167.618,201.382s75.191,201.389,167.618,201.389
					h761.091C652.972,301.386,728.168,211.042,728.168,99.996z"/>
			</defs>
			<clipPath id="SVGID_2_">
				<use xlink:href="#SVGID_1_"  overflow="visible"/>
			</clipPath>
			<g clip-path="url(#SVGID_2_)">
				<polygon fill="#EE3A3D" points="-339.07,5.246 -370.903,-13.209 -376.534,-3.483 -344.71,14.967 				"/>
				<polygon fill="#EE3A3D" points="-325.31,-10.911 -354.946,-35.189 -361.673,-25.781 -332.028,-1.503 				"/>
				<polygon fill="#EE3A3D" points="-312.482,-26.331 -340.095,-53.041 -347.566,-44.259 -319.952,-17.553 				"/>
				<polygon fill="#EE3A3D" points="-300.585,-39.947 -324.826,-67.61 -333.284,-60.203 -309.034,-32.541 				"/>
				
					<rect x="-319.975" y="-69.867" transform="matrix(0.6091 0.7931 -0.7931 0.6091 -168.8361 214.0654)" fill="#EE3A3D" width="36.784" height="11.239"/>
				
					<rect x="-304.306" y="-82.881" transform="matrix(0.5146 0.8574 -0.8574 0.5146 -205.0339 207.6473)" fill="#EE3A3D" width="36.786" height="11.234"/>
				<polygon fill="#EE3A3D" points="-254.381,-75.953 -270.648,-108.941 -280.729,-103.966 -264.458,-70.978 				"/>
				
					<rect x="-266.061" y="-104.552" transform="matrix(0.3835 0.9236 -0.9236 0.3835 -244.0667 167.737)" fill="#EE3A3D" width="36.79" height="11.237"/>
				<polygon fill="#EE3A3D" points="-217.778,-90.251 -230.249,-124.86 -240.824,-121.056 -228.353,-86.448 				"/>
				
					<rect x="-301.469" y="-251.297" transform="matrix(0.3389 0.9408 -0.9408 0.3389 -410.4839 109.3875)" fill="#EE3A3D" width="36.785" height="27.821"/>
				<polygon fill="#EE3A3D" points="-322.159,-198.632 -337.297,-232.159 -362.652,-220.707 -347.504,-187.185 				"/>
				<polygon fill="#EE3A3D" points="-376.534,-172.101 -401.179,-199.406 -421.825,-180.759 -397.171,-153.456 				"/>
				
					<rect x="-463.271" y="-141.899" transform="matrix(0.7829 0.6222 -0.6222 0.7829 -176.2312 249.0069)" fill="#EE3A3D" width="36.786" height="27.817"/>
				<polygon fill="#EE3A3D" points="-455.465,-83.56 -488.032,-100.654 -500.959,-76.021 -468.383,-58.926 				"/>
				<polygon fill="#EE3A3D" points="-480.924,-32.402 -514.987,-46.281 -525.481,-20.515 -491.414,-6.642 				"/>
			</g>
			<g clip-path="url(#SVGID_2_)">
				<polygon fill="#EE3A3D" points="-339.07,204.897 -370.903,223.349 -376.534,213.628 -344.71,195.176 				"/>
				<polygon fill="#EE3A3D" points="-325.31,221.056 -354.946,245.334 -361.673,235.925 -332.028,211.647 				"/>
				<polygon fill="#EE3A3D" points="-312.482,236.475 -340.095,263.186 -347.566,254.401 -319.952,227.698 				"/>
				<polygon fill="#EE3A3D" points="-300.585,250.089 -324.826,277.752 -333.284,270.348 -309.034,242.683 				"/>
				
					<rect x="-319.975" y="268.773" transform="matrix(0.6091 -0.7931 0.7931 0.6091 -335.4985 -131.924)" fill="#EE3A3D" width="36.784" height="11.239"/>
				<polygon fill="#EE3A3D" points="-271.631,274.527 -290.561,306.069 -300.195,300.283 -281.265,268.742 				"/>
				
					<rect x="-285.948" y="294.48" transform="matrix(0.4422 -0.8969 0.8969 0.4422 -418.4033 -72.5803)" fill="#EE3A3D" width="36.785" height="11.241"/>
				<polygon fill="#EE3A3D" points="-235.423,294.245 -249.531,328.223 -259.908,323.909 -245.801,289.931 				"/>
				
					<rect x="-247.694" y="310.174" transform="matrix(0.339 -0.9408 0.9408 0.339 -448.6597 -6.9853)" fill="#EE3A3D" width="36.786" height="11.24"/>
				
					<rect x="-301.472" y="433.616" transform="matrix(0.3388 -0.9408 0.9408 0.3388 -608.209 29.5536)" fill="#EE3A3D" width="36.79" height="27.821"/>
				<polygon fill="#EE3A3D" points="-322.159,408.775 -337.297,442.303 -362.652,430.849 -347.504,397.322 				"/>
				<polygon fill="#EE3A3D" points="-376.534,382.246 -401.179,409.544 -421.825,390.897 -397.171,363.598 				"/>
				<polygon fill="#EE3A3D" points="-421.825,337.572 -450.624,360.463 -467.931,338.685 -439.127,315.794 				"/>
				<polygon fill="#EE3A3D" points="-455.465,293.699 -488.032,310.794 -500.959,286.161 -468.383,269.07 				"/>
				<polygon fill="#EE3A3D" points="-480.924,242.542 -514.987,256.426 -525.481,230.659 -491.414,216.784 				"/>
			</g>
			<g clip-path="url(#SVGID_2_)">
				<polygon fill="#EE3A3D" points="696.73,5.246 728.56,-13.209 734.191,-3.483 702.372,14.967 				"/>
				<polygon fill="#EE3A3D" points="682.97,-10.911 712.609,-35.189 719.333,-25.781 689.69,-1.503 				"/>
				<polygon fill="#EE3A3D" points="670.142,-26.331 697.758,-53.041 705.228,-44.259 677.612,-17.553 				"/>
				
					<rect x="656.201" y="-55.696" transform="matrix(-0.6591 0.752 -0.752 -0.6591 1081.5753 -590.3985)" fill="#EE3A3D" width="36.784" height="11.241"/>
				<polygon fill="#EE3A3D" points="643.58,-53.084 665.988,-82.256 674.905,-75.412 652.499,-46.239 				"/>
				<polygon fill="#EE3A3D" points="629.293,-64.383 648.221,-95.924 657.857,-90.145 638.923,-58.599 				"/>
				<polygon fill="#EE3A3D" points="612.039,-75.953 628.31,-108.941 638.389,-103.966 622.117,-70.978 				"/>
				
					<rect x="586.933" y="-104.554" transform="matrix(-0.3834 0.9236 -0.9236 -0.3834 746.0405 -695.9348)" fill="#EE3A3D" width="36.79" height="11.24"/>
				<polygon fill="#EE3A3D" points="575.438,-90.251 587.909,-124.86 598.484,-121.056 586.013,-86.448 				"/>
				<polygon fill="#EE3A3D" points="621.419,-224.797 633.88,-259.405 660.056,-249.976 647.586,-215.368 				"/>
				<polygon fill="#EE3A3D" points="679.82,-198.632 694.954,-232.159 720.312,-220.707 705.167,-187.185 				"/>
				<polygon fill="#EE3A3D" points="734.191,-172.101 758.843,-199.406 779.488,-180.759 754.828,-153.456 				"/>
				<polygon fill="#EE3A3D" points="779.488,-127.435 808.281,-150.323 825.591,-128.545 796.787,-105.657 				"/>
				
					<rect x="817.48" y="-93.7" transform="matrix(-0.8854 0.4648 -0.4648 -0.8854 1538.9038 -538.9121)" fill="#EE3A3D" width="36.783" height="27.82"/>
				<polygon fill="#EE3A3D" points="838.583,-32.402 872.648,-46.281 883.141,-20.515 849.071,-6.642 				"/>
			</g>
			<g clip-path="url(#SVGID_2_)">
				<polygon fill="#EE3A3D" points="696.73,204.897 728.56,223.349 734.191,213.628 702.372,195.176 				"/>
				<polygon fill="#EE3A3D" points="682.97,221.056 712.609,245.334 719.333,235.925 689.69,211.647 				"/>
				<polygon fill="#EE3A3D" points="670.142,236.475 697.758,263.186 705.228,254.401 677.612,227.698 				"/>
				<polygon fill="#EE3A3D" points="658.243,250.089 682.488,277.752 690.944,270.348 666.693,242.683 				"/>
				
					<rect x="640.849" y="268.772" transform="matrix(-0.6092 -0.793 0.793 -0.6092 843.2188 964.3516)" fill="#EE3A3D" width="36.786" height="11.241"/>
				<polygon fill="#EE3A3D" points="629.293,274.527 648.221,306.069 657.857,300.283 638.923,268.742 				"/>
				
					<rect x="606.82" y="294.481" transform="matrix(-0.4423 -0.8969 0.8969 -0.4423 632.6073 993.5682)" fill="#EE3A3D" width="36.787" height="11.239"/>
				<polygon fill="#EE3A3D" points="593.086,294.245 607.191,328.223 617.571,323.909 603.463,289.931 				"/>
				
					<rect x="568.567" y="310.174" transform="matrix(-0.339 -0.9408 0.9408 -0.339 488.851 975.0528)" fill="#EE3A3D" width="36.786" height="11.24"/>
				<polygon fill="#EE3A3D" points="621.419,434.934 633.88,469.547 660.056,460.118 647.586,425.509 				"/>
				<polygon fill="#EE3A3D" points="679.82,408.775 694.954,442.303 720.312,430.849 705.167,397.322 				"/>
				<polygon fill="#EE3A3D" points="734.191,382.246 758.843,409.544 779.488,390.897 754.828,363.598 				"/>
				<polygon fill="#EE3A3D" points="779.488,337.572 808.281,360.463 825.591,338.685 796.787,315.794 				"/>
				
					<rect x="817.48" y="276.02" transform="matrix(-0.8854 -0.4648 0.4648 -0.8854 1441.2358 935.1233)" fill="#EE3A3D" width="36.783" height="27.82"/>
				<polygon fill="#EE3A3D" points="838.583,242.542 872.648,256.426 883.141,230.659 849.071,216.784 				"/>
			</g>
		</g>
		<path fill="#6E7C7D" d="M-510.565,99.996c0-189.558,139.074-343.779,310.018-343.779h761.091
			c170.944,0,310.018,154.221,310.018,343.779c0,189.565-139.073,343.784-310.018,343.784h-761.091
			C-371.491,443.781-510.565,289.562-510.565,99.996z M748.511,99.996c0-122.261-84.322-221.725-187.966-221.725h-761.091
			c-103.647,0-187.964,99.464-187.964,221.725s84.317,221.73,187.964,221.73h761.091
			C664.189,321.727,748.511,222.257,748.511,99.996z"/>
		<path fill="#F5EFDB" d="M-453.607,99.996v-1.477l8.138,0.042v1.435c0,12.927,0.786,25.92,2.333,38.63l-8.082,0.983
			C-452.797,126.575-453.607,113.251-453.607,99.996z M-450.841,57.452c1.792-13.64,4.474-27.228,7.978-40.397l7.86,2.091
			c-3.41,12.831-6.026,26.075-7.771,39.367L-450.841,57.452z M-443.615,180.077l7.885-2.018
			c3.326,12.995,7.531,25.821,12.494,38.115l-7.541,3.046C-435.881,206.592-440.195,193.423-443.615,180.077z M-429.663-21.961
			c5.293-12.746,11.478-25.158,18.375-36.887l7.014,4.123c-6.713,11.41-12.72,23.483-17.871,35.883L-429.663-21.961z
			 M-412.779,256.287l7.056-4.053c6.694,11.65,14.22,22.832,22.378,33.232l-6.402,5.022
			C-398.145,279.782-405.892,268.276-412.779,256.287z M-387.913-92.815c8.675-10.812,18.144-20.962,28.159-30.154l5.504,5.991
			c-9.709,8.917-18.897,18.76-27.312,29.253L-387.913-92.815z M-361.927,320.948l5.574-5.932
			c9.813,9.223,20.322,17.624,31.24,24.972l-4.544,6.748C-340.937,339.146-351.795,330.467-361.927,320.948z M-327.206-148.376
			c11.6-7.611,23.822-14.223,36.335-19.642l3.237,7.464c-12.085,5.24-23.897,11.624-35.107,18.981L-327.206-148.376z
			 M-293.553,366.834l3.326-7.426c12.193,5.462,24.871,9.832,37.685,12.983l-1.948,7.899
			C-267.774,377.022-280.917,372.494-293.553,366.834z M-251.611-180.98c13.426-3.121,27.218-5.012,40.992-5.622l0.362,8.126
			c-13.28,0.593-26.574,2.416-39.515,5.419L-251.611-180.98z M-213.601,386.446l0.466-8.122c4.182,0.24,8.416,0.36,12.588,0.36
			h27.856v8.138h-27.856C-204.875,386.823-209.268,386.696-213.601,386.446z M-169.761-178.687v-8.136h40.684v8.136H-169.761z
			 M-132.008,386.823v-8.138h40.684v8.138H-132.008z M-88.391-178.687v-8.136h40.684v8.136H-88.391z M-50.64,386.823v-8.138h40.686
			v8.138H-50.64z M-7.023-178.687v-8.136h40.686v8.136H-7.023z M30.73,386.823v-8.138h40.684v8.138H30.73z M74.347-178.687v-8.136
			h40.684v8.136H74.347z M112.1,386.823v-8.138h62.292v8.138H112.1z M155.715-178.687v-8.136h40.686v8.136H155.715z
			 M215.076,386.823v-8.138h40.684v8.138H215.076z M237.085-178.687v-8.136h40.684v8.136H237.085z M296.446,386.823v-8.138h40.684
			v8.138H296.446z M318.453-178.687v-8.136h40.686v8.136H318.453z M377.814,386.823v-8.138h40.684v8.138H377.814z M399.823-178.687
			v-8.136h40.684v8.136H399.823z M459.184,386.823v-8.138h40.684v8.138H459.184z M481.193-178.687v-8.136h40.684v8.136H481.193z
			 M540.552,386.823v-8.138h19.993c6.762,0,13.581-0.317,20.268-0.941l0.758,8.098c-6.939,0.652-14.011,0.981-21.025,0.981H540.552z
			 M562.523-178.678l0.075-8.136c13.804,0.122,27.646,1.519,41.142,4.149l-1.557,7.988
			C589.179-177.21,575.833-178.56,562.523-178.678z M620.012,370.41c12.687-3.601,25.217-8.411,37.236-14.296l3.575,7.31
			c-12.452,6.097-25.435,11.076-38.586,14.816L620.012,370.41z M640.456-163.516l2.977-7.574
			c12.702,4.989,25.144,11.187,36.987,18.419l-4.236,6.943C664.742-152.713,652.72-158.699,640.456-163.516z M691.461,335.564
			c10.688-7.708,20.932-16.427,30.448-25.92l5.748,5.758c-9.824,9.801-20.4,18.8-31.433,26.762L691.461,335.564z M708.457-122.136
			l5.32-6.162c10.295,8.896,20.07,18.765,29.06,29.337l-6.2,5.271C727.918-103.95,718.439-113.518,708.457-122.136z
			 M748.033,279.309c7.87-10.636,15.086-22.025,21.451-33.839l7.162,3.857c-6.543,12.158-13.971,23.869-22.072,34.82
			L748.033,279.309z M760.262-61.349l6.898-4.311c7.218,11.549,13.729,23.791,19.351,36.389l-7.433,3.316
			C773.612-38.209,767.28-50.118,760.262-61.349z M786.04,208.954c4.646-12.426,8.519-25.353,11.516-38.421l7.931,1.816
			c-3.076,13.419-7.054,26.694-11.824,39.456L786.04,208.954z M792.913,11.683l7.809-2.289c3.836,13.085,6.863,26.605,8.987,40.185
			l-8.042,1.256C799.598,37.603,796.653,24.434,792.913,11.683z M803.977,130.924c1.284-13.223,1.731-26.806,1.362-40.124
			l8.131-0.228c0.39,13.642-0.078,27.58-1.395,41.135L803.977,130.924z"/>
		<g>
			<rect x="69.65" y="-253.979" fill="#F4EFD7" width="56.97" height="144.429"/>
			<g>
				<rect x="112.378" y="-244.258" fill="#3C2A34" width="14.242" height="13.609"/>
				<rect x="98.136" y="-230.649" fill="#3C2A34" width="14.242" height="13.614"/>
				<rect x="83.892" y="-217.035" fill="#3C2A34" width="14.244" height="13.609"/>
				<rect x="83.892" y="-244.258" fill="#3C2A34" width="14.244" height="13.609"/>
				<rect x="112.378" y="-217.035" fill="#3C2A34" width="14.242" height="13.609"/>
				<rect x="69.65" y="-203.426" fill="#3C2A34" width="14.242" height="13.614"/>
				<rect x="69.65" y="-230.649" fill="#3C2A34" width="14.242" height="13.614"/>
				<rect x="98.136" y="-203.426" fill="#3C2A34" width="14.242" height="13.614"/>
				<rect x="83.892" y="-189.812" fill="#3C2A34" width="14.244" height="13.609"/>
				<rect x="112.378" y="-189.812" fill="#3C2A34" width="14.242" height="13.609"/>
				<rect x="69.65" y="-176.203" fill="#3C2A34" width="14.242" height="13.616"/>
				<rect x="98.136" y="-176.203" fill="#3C2A34" width="14.242" height="13.616"/>
				<rect x="83.892" y="-162.587" fill="#3C2A34" width="14.244" height="13.609"/>
				<rect x="112.378" y="-162.587" fill="#3C2A34" width="14.242" height="13.609"/>
				<rect x="83.892" y="-135.364" fill="#3C2A34" width="14.244" height="13.609"/>
				<rect x="112.378" y="-135.364" fill="#3C2A34" width="14.242" height="13.609"/>
				<rect x="69.65" y="-148.978" fill="#3C2A34" width="14.242" height="13.613"/>
				<rect x="98.136" y="-148.978" fill="#3C2A34" width="14.242" height="13.613"/>
			</g>
		</g>
	</g>
</g>
</svg>