{
  "$schema": "http://cyclonedx.org/schema/bom-1.4.schema.json",
  "bomFormat": "CycloneDX",
  "specVersion": "1.4",
  "serialNumber": "urn:uuid:3e671687-395b-41f5-a30f-a58921a69b79",
  "version": 1,
  "metadata": {
    "timestamp": "2021-09-01T10:50:42.051979+00:00",
    "tools": [
      {
        "vendor": "CycloneDX",
        "name": "cyclonedx-python-lib",
        "version": "VERSION",
        "externalReferences": [
          {
            "type": "build-system",
            "url": "https://github.com/CycloneDX/cyclonedx-python-lib/actions"
          },
          {
            "type": "distribution",
            "url": "https://pypi.org/project/cyclonedx-python-lib/"
          },
          {
            "type": "documentation",
            "url": "https://cyclonedx.github.io/cyclonedx-python-lib/"
          },
          {
            "type": "issue-tracker",
            "url": "https://github.com/CycloneDX/cyclonedx-python-lib/issues"
          },
          {
            "type": "license",
            "url": "https://github.com/CycloneDX/cyclonedx-python-lib/blob/main/LICENSE"
          },
          {
            "type": "release-notes",
            "url": "https://github.com/CycloneDX/cyclonedx-python-lib/blob/main/CHANGELOG.md"
          },
          {
            "type": "vcs",
            "url": "https://github.com/CycloneDX/cyclonedx-python-lib"
          },
          {
            "type": "website",
            "url": "https://cyclonedx.org"
          }
        ]
      }
    ],
    "component": {
      "type": "library",
      "bom-ref": "17e3b199-dc0b-42ef-bfdd-1fa81a1e3eda",
      "name": "cyclonedx-python-lib",
      "version": "1.0.0"
    }
  },
  "services": [
    {
      "bom-ref": "my-specific-bom-ref-for-my-first-service",
      "provider": {
        "contact": [
          {
            "email": "paul.horton@owasp.org",
            "name": "Paul Horton"
          },
          {
            "email": "someone@somewhere.tld",
            "name": "A N Other",
            "phone": "+44 (0)1234 567890"
          }
        ],
        "name": "CycloneDX",
        "url": [
          "https://cyclonedx.org"
        ]
      },
      "group": "a-group",
      "name": "my-first-service",
      "version": "1.2.3",
      "description": "Description goes here",
      "endpoints": [
        "/api/thing/1",
        "/api/thing/2"
      ],
      "authenticated": false,
      "x-trust-boundary": true,
      "data": [
        {
          "classification": "public",
          "flow": "outbound"
        }
      ],
      "licenses": [
        {
          "expression": "Commercial"
        }
      ],
      "externalReferences": [
        {
          "comment": "No comment",
          "hashes": [
            {
              "alg": "SHA-256",
              "content": "806143ae5bfb6a3c6e736a764057db0e6a0e05e338b5630894a5f779cabb4f9b"
            }
          ],
          "type": "distribution",
          "url": "https://cyclonedx.org"
        }
      ],
      "releaseNotes": {
        "aliases": [
          "First Test Release"
        ],
        "description": "This release is a test release",
        "featuredImage": "https://cyclonedx.org/theme/assets/images/CycloneDX-Twitter-Card.png",
        "notes": [
          {
            "locale": "en-GB",
            "text": {
              "content": "U29tZSBzaW1wbGUgcGxhaW4gdGV4dA==",
              "contentType": "text/plain; charset=UTF-8",
              "encoding": "base64"
            }
          },
          {
            "locale": "en-US",
            "text": {
              "content": "U29tZSBzaW1wbGUgcGxhaW4gdGV4dA==",
              "contentType": "text/plain; charset=UTF-8",
              "encoding": "base64"
            }
          }
        ],
        "properties": [
          {
            "name": "key1",
            "value": "val1"
          },
          {
            "name": "key2",
            "value": "val2"
          }
        ],
        "resolves": [
          {
            "description": "Apache Log4j2 2.0-beta9 through 2.12.1 and 2.13.0 through 2.15.0 JNDI features...",
            "id": "CVE-2021-44228",
            "name": "Apache Log3Shell",
            "references": [
              "https://logging.apache.org/log4j/2.x/security.html",
              "https://central.sonatype.org/news/20211213_log4shell_help"
            ],
            "source": {
              "name": "NVD",
              "url": "https://nvd.nist.gov/vuln/detail/CVE-2021-44228"
            },
            "type": "security"
          }
        ],
        "socialImage": "https://cyclonedx.org/cyclonedx-icon.png",
        "tags": [
          "test",
          "alpha"
        ],
        "timestamp": "2021-12-31T10:00:00+00:00",
        "title": "Release Notes Title",
        "type": "major"
      },
      "properties": [
        {
          "name": "key1",
          "value": "val1"
        },
        {
          "name": "key2",
          "value": "val2"
        }
      ]
    },
    {
      "bom-ref": "be2c6502-7e9a-47db-9a66-e34f729810a3",
      "name": "my-second-service"
    }
  ],
  "dependencies": [
    {
      "ref": "17e3b199-dc0b-42ef-bfdd-1fa81a1e3eda"
    },
    {
      "ref": "my-specific-bom-ref-for-my-first-service"
    },
    {
      "ref": "be2c6502-7e9a-47db-9a66-e34f729810a3"
    }
  ]
}