{
  "$schema": "http://cyclonedx.org/schema/bom-1.4.schema.json",
  "bomFormat": "CycloneDX",
  "specVersion": "1.4",
  "serialNumber": "urn:uuid:3e671687-395b-41f5-a30f-a58921a69b79",
  "version": 1,
  "metadata": {
    "timestamp": "2021-09-01T10:50:42.051979+00:00",
    "tools": [
      {
        "vendor": "CycloneDX",
        "name": "cyclonedx-python-lib",
        "version": "VERSION",
        "externalReferences": [
          {
            "type": "build-system",
            "url": "https://github.com/CycloneDX/cyclonedx-python-lib/actions"
          },
          {
            "type": "distribution",
            "url": "https://pypi.org/project/cyclonedx-python-lib/"
          },
          {
            "type": "documentation",
            "url": "https://cyclonedx.github.io/cyclonedx-python-lib/"
          },
          {
            "type": "issue-tracker",
            "url": "https://github.com/CycloneDX/cyclonedx-python-lib/issues"
          },
          {
            "type": "license",
            "url": "https://github.com/CycloneDX/cyclonedx-python-lib/blob/main/LICENSE"
          },
          {
            "type": "release-notes",
            "url": "https://github.com/CycloneDX/cyclonedx-python-lib/blob/main/CHANGELOG.md"
          },
          {
            "type": "vcs",
            "url": "https://github.com/CycloneDX/cyclonedx-python-lib"
          },
          {
            "type": "website",
            "url": "https://cyclonedx.org"
          }
        ]
      }
    ]
  },
  "components": [
    {
      "type": "library",
      "bom-ref": "pkg:pypi/setuptools@50.3.2?extension=tar.gz",
      "author": "Test Author",
      "name": "setuptools",
      "version": "50.3.2",
      "licenses": [
        {
          "expression": "MIT License"
        }
      ],
      "purl": "pkg:pypi/setuptools@50.3.2?extension=tar.gz"
    }
  ],
  "dependencies": [
    {
      "ref": "pkg:pypi/setuptools@50.3.2?extension=tar.gz"
    }
  ],
  "vulnerabilities": [
    {
      "bom-ref": "my-vuln-ref-1",
      "id": "CVE-2018-7489",
      "source": {
        "name": "NVD",
        "url": "https://nvd.nist.gov/vuln/detail/CVE-2018-7489"
      },
      "references": [
        {
          "id": "SOME-OTHER-ID",
          "source": {
            "name": "OSS Index",
            "url": "https://ossindex.sonatype.org/component/pkg:pypi/setuptools"
          }
        }
      ],
      "ratings": [
        {
          "source": {
            "name": "NVD",
            "url": "https://nvd.nist.gov/vuln/detail/CVE-2018-7489"
          },
          "score": 9.8,
          "severity": "critical",
          "method": "CVSSv3",
          "vector": "AN/AC:L/PR:N/UI:N/S:U/C:H/I:H/A:H",
          "justification": "Some justification"
        },
        {
          "source": {
            "name": "OWASP",
            "url": "https://owasp.org"
          },
          "score": 2.7,
          "severity": "low",
          "method": "CVSSv3",
          "vector": "AV:L/AC:H/PR:N/UI:R/S:C/C:L/I:N/A:N",
          "justification": "Some other justification"
        }
      ],
      "cwes": [
        22,
        33
      ],
      "description": "A description here",
      "detail": "Some detail here",
      "recommendation": "Upgrade",
      "advisories": [
        {
          "url": "https://nvd.nist.gov/vuln/detail/CVE-2018-7489"
        },
        {
          "url": "http://www.securitytracker.com/id/1040693"
        }
      ],
      "created": "2021-09-01T10:50:42.051979+00:00",
      "published": "2021-09-02T10:50:42.051979+00:00",
      "updated": "2021-09-03T10:50:42.051979+00:00",
      "credits": {
        "organizations": [
          {
            "name": "CycloneDX",
            "url": [
              "https://cyclonedx.org"
            ],
            "contact": [
              {
                "name": "Paul Horton",
                "email": "paul.horton@owasp.org"
              },
              {
                "name": "A N Other",
                "email": "someone@somewhere.tld",
                "phone": "+44 (0)1234 567890"
              }
            ]
          }
        ],
        "individuals": [
          {
            "name": "A N Other",
            "email": "someone@somewhere.tld",
            "phone": "+44 (0)1234 567890"
          }
        ]
      },
      "tools": [
        {
          "vendor": "CycloneDX",
          "name": "cyclonedx-python-lib"
        }
      ],
      "analysis": {
        "state": "exploitable",
        "justification": "requires_environment",
        "response": [
          "can_not_fix"
        ],
        "detail": "Some extra detail"
      },
      "affects": [
        {
          "ref": "pkg:pypi/setuptools@50.3.2?extension=tar.gz",
          "versions": [
            {
              "range": "49.0.0 - 54.0.0",
              "status": "affected"
            }
          ]
        }
      ],
      "properties": [
        {
          "name": "key1",
          "value": "val1"
        },
        {
          "name": "key2",
          "value": "val2"
        }
      ]
    }
  ]
}