{
  "$schema": "http://cyclonedx.org/schema/bom-1.5.schema.json",
  "bomFormat": "CycloneDX",
  "specVersion": "1.5",
  "serialNumber": "urn:uuid:3e671687-395b-41f5-a30f-a58921a69b79",
  "version": 1,
  "metadata": {
    "timestamp": "2021-09-01T10:50:42.051979+00:00",
    "tools": [
      {
        "vendor": "CycloneDX",
        "name": "cyclonedx-python-lib",
        "version": "VERSION",
        "externalReferences": [
          {
            "type": "build-system",
            "url": "https://github.com/CycloneDX/cyclonedx-python-lib/actions"
          },
          {
            "type": "distribution",
            "url": "https://pypi.org/project/cyclonedx-python-lib/"
          },
          {
            "type": "documentation",
            "url": "https://cyclonedx.github.io/cyclonedx-python-lib/"
          },
          {
            "type": "issue-tracker",
            "url": "https://github.com/CycloneDX/cyclonedx-python-lib/issues"
          },
          {
            "type": "license",
            "url": "https://github.com/CycloneDX/cyclonedx-python-lib/blob/main/LICENSE"
          },
          {
            "type": "release-notes",
            "url": "https://github.com/CycloneDX/cyclonedx-python-lib/blob/main/CHANGELOG.md"
          },
          {
            "type": "vcs",
            "url": "https://github.com/CycloneDX/cyclonedx-python-lib"
          },
          {
            "type": "website",
            "url": "https://cyclonedx.org"
          }
        ]
      }
    ]
  },
  "components": [
    {
      "type": "library",
      "bom-ref": "pkg:pypi/setuptools@50.3.2?extension=tar.gz",
      "author": "Test Author",
      "name": "setuptools",
      "version": "50.3.2",
      "licenses": [
        {
          "expression": "MIT License"
        }
      ],
      "purl": "pkg:pypi/setuptools@50.3.2?extension=tar.gz"
    }
  ],
  "dependencies": [
    {
      "ref": "pkg:pypi/setuptools@50.3.2?extension=tar.gz"
    }
  ]
}
