{
  "$schema": "http://cyclonedx.org/schema/bom-1.3a.schema.json",
  "bomFormat": "CycloneDX",
  "specVersion": "1.3",
  "serialNumber": "urn:uuid:3e671687-395b-41f5-a30f-a58921a69b79",
  "version": 1,
  "metadata": {
    "timestamp": "2021-09-01T10:50:42.051979+00:00",
    "tools": [
      {
        "vendor": "CycloneDX",
        "name": "cyclonedx-python-lib",
        "version": "VERSION"
      }
    ]
  },
  "components": [
    {
      "type": "library",
      "bom-ref": "pkg:pypi/setuptools@50.3.2?extension=tar.gz",
      "author": "Test Author",
      "name": "setuptools",
      "version": "50.3.2",
      "licenses": [
        {
          "expression": "MIT License"
        }
      ],
      "cpe": "cpe:2.3:a:python:setuptools:50.3.2:*:*:*:*:*:*:*",
      "purl": "pkg:pypi/setuptools@50.3.2?extension=tar.gz"
    }
  ],
  "dependencies": [
    {
      "ref": "pkg:pypi/setuptools@50.3.2?extension=tar.gz"
    }
  ]
}