<svg width="100" height="100" viewBox="0 0 100 100" fill="none" xmlns="http://www.w3.org/2000/svg">
<path d="M50 100C77.6142 100 100 77.6142 100 50C100 22.3858 77.6142 0 50 0C22.3858 0 0 22.3858 0 50C0 77.6142 22.3858 100 50 100Z" fill="#FFD05B"/>
<path d="M82.4413 75.1969H17.5594C16.3783 75.1969 15.5122 74.252 15.5122 73.1496V26.8504C15.5122 25.6693 16.4571 24.8032 17.5594 24.8032H82.4413C83.6224 24.8032 84.4886 25.748 84.4886 26.8504V73.0709C84.4886 74.252 83.5437 75.1969 82.4413 75.1969Z" fill="white"/>
<path d="M80.5512 28.7402H19.3701V71.3386H80.5512V28.7402Z" fill="#84DBFF"/>
<path d="M58.8189 57.5591L45.9055 44.6457L19.3701 71.1024H58.8189V57.5591Z" fill="#2B3B4E"/>
<path d="M80.63 57.5591L67.6378 44.6457L41.1812 71.1024H80.63V57.5591Z" fill="#324A5E"/>
<path d="M33.3072 57.2441L25.1183 49.0551L19.6064 54.567V71.1024L33.3072 57.2441Z" fill="#324A5E"/>
<path d="M57.2439 44.0157C59.8532 44.0157 61.9683 41.9006 61.9683 39.2913C61.9683 36.6821 59.8532 34.5669 57.2439 34.5669C54.6347 34.5669 52.5195 36.6821 52.5195 39.2913C52.5195 41.9006 54.6347 44.0157 57.2439 44.0157Z" fill="white"/>
<path d="M32.756 33.1496C32.5198 33.0709 32.2835 33.0709 32.1261 33.0709C32.0473 33.0709 31.8898 33.0709 31.8111 33.0709C31.7324 33.0709 31.5749 33.0709 31.4961 33.0709H31.1812C31.1024 33.0709 30.945 33.1496 30.8662 33.1496C30.7875 33.1496 30.63 33.2283 30.5513 33.2283C30.4725 33.3071 30.315 33.3071 30.2363 33.3858C30.1576 33.4646 30.0001 33.4646 29.9213 33.5433C29.8426 33.622 29.6851 33.7008 29.6064 33.7795C29.5276 33.8583 29.4489 33.937 29.3702 34.0157C29.2914 34.0945 29.2127 34.1732 29.1339 34.3307C29.0552 34.4094 29.0552 34.4882 28.9765 34.5669C28.8977 34.4882 28.819 34.4882 28.6615 34.4882C28.504 34.4882 28.4253 34.4094 28.2678 34.4094C28.1103 34.4094 28.0316 34.4094 27.8741 34.4094C27.7166 34.4094 27.6379 34.4882 27.4804 34.4882C27.3229 34.4882 27.2442 34.5669 27.1654 34.6457C27.0867 34.7244 26.9292 34.8031 26.8505 34.8819C26.7717 34.9606 26.693 35.0394 26.6143 35.1181L26.9292 35.0394C27.008 35.0394 27.1654 34.9606 27.2442 34.9606C27.3229 34.9606 27.4804 34.9606 27.5591 34.9606C27.6379 34.9606 27.7954 34.9606 27.8741 34.9606C28.0316 34.9606 28.2678 35.0394 28.4253 35.1181C28.504 35.1968 28.5828 35.1968 28.6615 35.2756L28.7402 35.3543L28.819 35.4331L29.1339 35.8268L29.3702 35.2756C29.3702 35.1968 29.4489 35.1181 29.4489 35.0394C29.5276 34.9606 29.5276 34.8819 29.6064 34.8031C29.6851 34.7244 29.6851 34.6457 29.7639 34.5669C29.8426 34.4882 29.9213 34.4094 30.0001 34.4094C30.1576 34.252 30.315 34.1732 30.4725 34.0945C30.5513 34.0157 30.63 34.0157 30.7087 33.937C30.7875 33.8583 30.8662 33.8583 30.945 33.8583C31.0237 33.8583 31.1024 33.7795 31.2599 33.7795L31.5749 33.7008C31.6536 33.7008 31.8111 33.622 31.8898 33.622L32.2048 33.5433L32.5198 33.4646C32.5985 33.4646 32.756 33.4646 32.8347 33.3858C33.0709 33.3858 33.3072 33.3071 33.4646 33.3071C33.1497 33.2283 32.9135 33.1496 32.756 33.1496Z" fill="#54C0EB"/>
<path d="M34.3307 37.0079C34.0945 36.9291 33.8583 36.9291 33.7008 36.9291C33.622 36.9291 33.4646 36.9291 33.3858 36.9291C33.3071 36.9291 33.1496 36.9291 33.0709 36.9291H32.7559C32.6772 36.9291 32.5197 37.0079 32.4409 37.0079C32.3622 37.0079 32.2047 37.0866 32.126 37.0866C32.0472 37.1654 31.8898 37.1654 31.811 37.2441C31.7323 37.3228 31.5748 37.3228 31.4961 37.4016C31.4173 37.4803 31.2598 37.5591 31.1811 37.6378C31.1024 37.7165 31.0236 37.7953 30.9449 37.874C30.8661 37.9528 30.7874 38.0315 30.7087 38.189C30.6299 38.2677 30.6299 38.3465 30.5512 38.4252C30.4724 38.3465 30.3937 38.3465 30.2362 38.3465C30.0787 38.3465 30 38.2677 29.8425 38.2677C29.685 38.2677 29.6063 38.2677 29.4488 38.2677C29.2913 38.2677 29.2126 38.3465 29.0551 38.3465C28.8976 38.3465 28.8189 38.4252 28.7401 38.5039C28.6614 38.5827 28.5039 38.6614 28.4252 38.7402C28.3464 38.8189 28.2677 38.8976 28.189 38.9764L28.5039 38.8976C28.5827 38.8976 28.7401 38.8189 28.8189 38.8189C28.8976 38.8189 29.0551 38.8189 29.1338 38.8189C29.2126 38.8189 29.3701 38.8189 29.4488 38.8189C29.6063 38.8189 29.8425 38.8976 30 38.9764C30.0787 39.0551 30.1575 39.0551 30.2362 39.1339L30.3149 39.2126L30.3937 39.2913L30.7087 39.685L30.9449 39.1339C30.9449 39.0551 31.0236 38.9764 31.0236 38.8976C31.1024 38.8189 31.1024 38.7402 31.1811 38.6614C31.2598 38.5827 31.2598 38.5039 31.3386 38.4252C31.4173 38.3465 31.4961 38.2677 31.5748 38.2677C31.7323 38.1102 31.8898 38.0315 32.0472 37.9528C32.126 37.874 32.2047 37.874 32.2835 37.7953C32.3622 37.7165 32.4409 37.7165 32.5197 37.7165C32.5984 37.7165 32.6772 37.6378 32.8346 37.6378L33.1496 37.5591C33.2283 37.5591 33.3858 37.4803 33.4646 37.4803L33.7795 37.4016L34.0945 37.3228C34.1732 37.3228 34.3307 37.3228 34.4094 37.2441C34.6457 37.2441 34.8819 37.1654 35.0394 37.1654C34.7244 37.0866 34.5669 37.0079 34.3307 37.0079Z" fill="#54C0EB"/>
<path d="M41.2599 33.1496C41.0237 33.0709 40.7875 33.0709 40.63 33.0709C40.5512 33.0709 40.3938 33.0709 40.315 33.0709C40.2363 33.0709 40.0788 33.0709 40.0001 33.0709H39.6851C39.6064 33.0709 39.4489 33.1496 39.3701 33.1496C39.2914 33.1496 39.1339 33.2283 39.0552 33.2283C38.9764 33.3071 38.819 33.3071 38.7402 33.3858C38.6615 33.4646 38.504 33.4646 38.4253 33.5433C38.3465 33.622 38.189 33.7008 38.1103 33.7795C38.0316 33.8583 37.9528 33.937 37.8741 34.0157C37.7953 34.0945 37.7166 34.1732 37.6379 34.3307C37.5591 34.4094 37.5591 34.4882 37.4804 34.5669C37.4016 34.4882 37.3229 34.4882 37.1654 34.4882C37.0079 34.4882 36.9292 34.4094 36.7717 34.4094C36.6142 34.4094 36.5355 34.4094 36.378 34.4094C36.2205 34.4094 36.1418 34.4882 35.9843 34.4882C35.8268 34.4882 35.7481 34.5669 35.6693 34.6457C35.5906 34.7244 35.4331 34.8031 35.3544 34.8819C35.2756 34.9606 35.1969 35.0394 35.1182 35.1181L35.4331 35.0394C35.5119 35.0394 35.6693 34.9606 35.7481 34.9606C35.8268 34.9606 35.9843 34.9606 36.063 34.9606C36.1418 34.9606 36.2993 34.9606 36.378 34.9606C36.5355 34.9606 36.7717 35.0394 36.9292 35.1181C37.0079 35.1968 37.0867 35.1968 37.1654 35.2756L37.2441 35.3543L37.3229 35.4331L37.6379 35.8268L37.8741 35.2756C37.8741 35.1968 37.9528 35.1181 37.9528 35.0394C38.0316 34.9606 38.0316 34.8819 38.1103 34.8031C38.189 34.7244 38.189 34.6457 38.2678 34.5669C38.3465 34.4882 38.4253 34.4094 38.504 34.4094C38.6615 34.252 38.819 34.1732 38.9764 34.0945C39.0552 34.0157 39.1339 34.0157 39.2127 33.937C39.2914 33.8583 39.3701 33.8583 39.4489 33.8583C39.5276 33.8583 39.6064 33.7795 39.7638 33.7795L40.0788 33.7008C40.1575 33.7008 40.315 33.622 40.3938 33.622L40.7087 33.5433L41.0237 33.4646C41.1024 33.4646 41.2599 33.4646 41.3386 33.3858C41.5749 33.3858 41.8111 33.3071 41.9686 33.3071C41.6536 33.2283 41.4174 33.1496 41.2599 33.1496Z" fill="#54C0EB"/>
</svg>
