<svg width="30" height="30" viewBox="0 0 30 30" fill="none" xmlns="http://www.w3.org/2000/svg">
<g clip-path="url(#clip0)">
<path d="M5.29004 9.1338C5.29004 9.3765 5.48674 9.57326 5.7295 9.57326H18.9741C19.2169 9.57326 19.4136 9.3765 19.4136 9.1338C19.4136 8.8911 19.2169 8.69434 18.9741 8.69434H5.7295C5.4868 8.69434 5.29004 8.8911 5.29004 9.1338Z" fill="#933EC5"/>
<path d="M5.7295 11.8106H18.9741C19.2169 11.8106 19.4136 11.6138 19.4136 11.3711C19.4136 11.1284 19.2169 10.9316 18.9741 10.9316H5.7295C5.48674 10.9316 5.29004 11.1284 5.29004 11.3711C5.29004 11.6138 5.4868 11.8106 5.7295 11.8106Z" fill="#933EC5"/>
<path d="M15.1093 7.33498C15.3521 7.33498 15.5488 7.13822 15.5488 6.89552C15.5488 6.65282 15.3521 6.45605 15.1093 6.45605H9.59376C9.351 6.45605 9.1543 6.65282 9.1543 6.89552C9.1543 7.13822 9.351 7.33498 9.59376 7.33498H15.1093Z" fill="#933EC5"/>
<path d="M5.7295 14.0488H18.9741C19.2169 14.0488 19.4136 13.8521 19.4136 13.6094C19.4136 13.3667 19.2169 13.1699 18.9741 13.1699H5.7295C5.48674 13.1699 5.29004 13.3667 5.29004 13.6094C5.29004 13.8521 5.4868 14.0488 5.7295 14.0488Z" fill="#933EC5"/>
<path d="M5.7295 16.2862H18.9741C19.2169 16.2862 19.4136 16.0894 19.4136 15.8467C19.4136 15.604 19.2169 15.4072 18.9741 15.4072H5.7295C5.48674 15.4072 5.29004 15.604 5.29004 15.8467C5.29004 16.0894 5.4868 16.2862 5.7295 16.2862Z" fill="#933EC5"/>
<path d="M5.7295 18.5235H18.9741C19.2169 18.5235 19.4136 18.3267 19.4136 18.084C19.4136 17.8413 19.2169 17.6445 18.9741 17.6445H5.7295C5.48674 17.6445 5.29004 17.8413 5.29004 18.084C5.29004 18.3267 5.4868 18.5235 5.7295 18.5235Z" fill="#933EC5"/>
<path d="M5.7295 20.7618H18.9741C19.2169 20.7618 19.4136 20.565 19.4136 20.3223C19.4136 20.0796 19.2169 19.8828 18.9741 19.8828H5.7295C5.48674 19.8828 5.29004 20.0796 5.29004 20.3223C5.29004 20.565 5.4868 20.7618 5.7295 20.7618Z" fill="#933EC5"/>
<path d="M5.7295 22.9991H18.9741C19.2169 22.9991 19.4136 22.8023 19.4136 22.5596C19.4136 22.3169 19.2169 22.1201 18.9741 22.1201H5.7295C5.48674 22.1201 5.29004 22.3169 5.29004 22.5596C5.29004 22.8023 5.4868 22.9991 5.7295 22.9991Z" fill="#933EC5"/>
<path d="M5.7295 25.2373H18.9741C19.2169 25.2373 19.4136 25.0406 19.4136 24.7979C19.4136 24.5552 19.2169 24.3584 18.9741 24.3584H5.7295C5.48674 24.3584 5.29004 24.5552 5.29004 24.7979C5.29004 25.0406 5.4868 25.2373 5.7295 25.2373Z" fill="#933EC5"/>
<path d="M1.01861 28.6755C1.01861 29.4058 1.61277 30 2.3431 30H11.3262C11.569 30 11.7657 29.8032 11.7657 29.5605C11.7657 29.3178 11.569 29.1211 11.3262 29.1211H2.34304C2.09741 29.1211 1.89749 28.9212 1.89749 28.6755V6.73466H6.42872C7.15905 6.73466 7.75321 6.1405 7.75321 5.41017V0.87893H22.3601C22.6057 0.87893 22.8057 1.0788 22.8057 1.32449V28.6756C22.8057 28.9213 22.6058 29.1211 22.3601 29.1211H13.377C13.1343 29.1211 12.9376 29.3179 12.9376 29.5606C12.9376 29.8033 13.1343 30.0001 13.377 30.0001H22.3602C23.0905 30.0001 23.6846 29.4059 23.6846 28.6756V1.32449C23.6846 0.594157 23.0904 0 22.3601 0H7.31375C7.19292 0 7.08194 0.0497474 7.00296 0.128734L1.14723 5.98446C1.06303 6.06872 1.01855 6.18216 1.01855 6.29519V28.6755H1.01861ZM6.42878 5.85573H2.51901C3.15119 5.22354 6.2435 2.13117 6.87428 1.50039V5.41017C6.87428 5.65586 6.67441 5.85573 6.42878 5.85573Z" fill="#933EC5"/>
<path d="M28.5415 15.4392C28.7842 15.4392 28.9809 15.2424 28.9809 14.9997V6.8957C28.9809 6.85199 28.974 6.80529 28.9595 6.76034C28.9593 6.75987 28.9592 6.75935 28.9591 6.75888C28.1377 4.25229 28.5729 5.58041 27.6079 2.63541C27.4895 2.27434 27.1675 2.04102 26.7876 2.04102C26.4076 2.04102 26.0857 2.27434 25.9673 2.63541C25.0021 5.58111 25.4375 4.25223 24.6161 6.75888C24.6159 6.75935 24.6159 6.75987 24.6157 6.76034C24.6013 6.80493 24.5942 6.85169 24.5942 6.8957V27.8064C24.5942 29.0159 25.5782 29.9998 26.7876 29.9998C27.997 29.9998 28.9809 29.0159 28.9809 27.8064C28.9809 27.3878 28.9809 17.6556 28.9809 17.0506C28.9809 16.8079 28.7842 16.6111 28.5415 16.6111C28.2987 16.6111 28.102 16.8079 28.102 17.0506V24.3577H27.227V7.33516H28.102V14.9997C28.102 15.2424 28.2987 15.4392 28.5415 15.4392ZM26.7876 2.95469L27.2017 4.21859H26.3734L26.7876 2.95469ZM28.102 27.8064C28.102 28.5312 27.5124 29.1209 26.7876 29.1209C26.0628 29.1209 25.4732 28.5312 25.4732 27.8064V27.051H28.1019V27.8064H28.102ZM28.102 25.2366V26.172H25.4732V25.2366H28.102ZM26.3481 24.3577H25.4732V7.33516H26.3481V24.3577ZM25.6402 6.45623L26.0854 5.09752H27.4898L27.9351 6.45623C27.1046 6.45623 26.4706 6.45623 25.6402 6.45623Z" fill="#933EC5"/>
</g>
<defs>
<clipPath id="clip0">
<rect width="30" height="30" fill="white"/>
</clipPath>
</defs>
</svg>
