<svg width="30" height="30" viewBox="0 0 30 30" fill="none" xmlns="http://www.w3.org/2000/svg">
<path d="M29.8954 16.7783L25.9535 8.33646C25.8379 8.10009 25.5873 7.96088 25.3256 7.98765H21.9768C21.5914 7.98765 21.2791 8.3 21.2791 8.68533C21.2791 9.07065 21.5914 9.383 21.9768 9.383H24.8721L28.1163 16.3598H24.1396C22.3365 16.3509 20.6967 17.403 19.9535 19.0458C19.4152 20.1758 18.2748 20.8952 17.0233 20.8947H12.9767C11.7251 20.8952 10.5849 20.1758 10.0465 19.0458C9.30328 17.403 7.66349 16.3509 5.86044 16.3598H1.95348L5.79066 9.383H8.02324C8.40857 9.383 8.72092 9.07065 8.72092 8.68533C8.72092 8.3 8.40857 7.98765 8.02324 7.98765H5.37208C5.11996 7.96375 4.87632 8.0856 4.74418 8.3016L0.139549 16.7435C0.058824 16.8151 0.00881359 16.915 0 17.0226V25.7087C0.0555523 27.6638 1.63746 29.2304 3.59301 29.2668H26.407C28.3626 29.2304 29.9444 27.6638 30 25.7087V17.0226C29.9867 16.9335 29.9507 16.8494 29.8954 16.7783ZM28.6046 25.7086C28.5504 26.8933 27.5924 27.8361 26.407 27.8714H3.59301C2.40758 27.8361 1.44957 26.8934 1.39535 25.7086V17.7551H5.86044C7.11203 17.7546 8.25233 18.474 8.79069 19.604C9.5339 21.2468 11.1737 22.2989 12.9767 22.29H17.0233C18.8263 22.2989 20.4661 21.2468 21.2093 19.604C21.7476 18.474 22.888 17.7546 24.1396 17.7551H28.6046V25.7086Z" fill="#2ABF4B"/>
<path d="M14.5118 16.8836C14.7592 17.1533 15.1785 17.1714 15.4482 16.9238C15.4622 16.911 15.4756 16.8975 15.4885 16.8836L20.2326 12.1045C20.4638 11.7962 20.4014 11.3589 20.0931 11.1277C19.845 10.9417 19.5039 10.9417 19.2559 11.1277L15.6977 14.6859V1.4301C15.6977 1.04477 15.3854 0.732422 15 0.732422C14.6147 0.732422 14.3024 1.04477 14.3024 1.4301V14.6859L10.7442 11.1278C10.4359 10.8966 9.99867 10.9591 9.76744 11.2673C9.58142 11.5154 9.58142 11.8565 9.76744 12.1045L14.5118 16.8836Z" fill="#2ABF4B"/>
</svg>
