<svg width="30" height="30" viewBox="0 0 30 30" fill="none" xmlns="http://www.w3.org/2000/svg">
<path d="M29.5161 0H0.483871C0.216655 0 0 0.216655 0 0.483871V27.5806C0.00165386 28.9163 1.08375 29.9983 2.41935 30H27.5806C28.9163 29.9983 29.9983 28.9163 30 27.5806V0.483871C30 0.216655 29.7833 0 29.5161 0ZM29.0323 0.967742V4.83871H0.967742V0.967742H29.0323ZM27.5806 29.0323H2.41935C1.61771 29.0323 0.967742 28.3823 0.967742 27.5806V5.80645H29.0323V27.5806C29.0323 28.3823 28.3823 29.0323 27.5806 29.0323Z" fill="#2ABF4B"/>
<path d="M3.38716 4.3544C4.18881 4.3544 4.83877 3.70443 4.83877 2.90278C4.83877 2.10114 4.18881 1.45117 3.38716 1.45117C2.58551 1.45117 1.93555 2.10114 1.93555 2.90278C1.93555 3.70443 2.58551 4.3544 3.38716 4.3544ZM3.38716 2.41891C3.65438 2.41891 3.87103 2.63557 3.87103 2.90278C3.87103 3.17 3.65438 3.38666 3.38716 3.38666C3.11994 3.38666 2.90329 3.17 2.90329 2.90278C2.90329 2.63557 3.11994 2.41891 3.38716 2.41891Z" fill="#2ABF4B"/>
<path d="M6.77437 4.3544C7.57601 4.3544 8.22598 3.70443 8.22598 2.90278C8.22598 2.10114 7.57601 1.45117 6.77437 1.45117C5.97272 1.45117 5.32275 2.10114 5.32275 2.90278C5.32275 3.70443 5.97272 4.3544 6.77437 4.3544ZM6.77437 2.41891C7.04158 2.41891 7.25824 2.63557 7.25824 2.90278C7.25824 3.17 7.04158 3.38666 6.77437 3.38666C6.50715 3.38666 6.2905 3.17 6.2905 2.90278C6.2905 2.63557 6.50715 2.41891 6.77437 2.41891Z" fill="#2ABF4B"/>
<path d="M10.1611 4.3544C10.9627 4.3544 11.6127 3.70443 11.6127 2.90278C11.6127 2.10114 10.9627 1.45117 10.1611 1.45117C9.35944 1.45117 8.70947 2.10114 8.70947 2.90278C8.70947 3.70443 9.35944 4.3544 10.1611 4.3544ZM10.1611 2.41891C10.4283 2.41891 10.645 2.63557 10.645 2.90278C10.645 3.17 10.4283 3.38666 10.1611 3.38666C9.89387 3.38666 9.67721 3.17 9.67721 2.90278C9.67721 2.63557 9.89387 2.41891 10.1611 2.41891Z" fill="#2ABF4B"/>
<path d="M18.0418 13.085C17.7856 13.0082 17.5161 13.1537 17.4393 13.4096L16.3385 17.0807L15.435 15.2678C15.3441 15.1152 15.1796 15.0216 15.002 15.0216C14.8245 15.0216 14.6598 15.1152 14.5689 15.2678L13.6607 17.0807L12.5599 13.411C12.4831 13.1551 12.2136 13.0098 11.9574 13.0864C11.7016 13.1632 11.556 13.4327 11.6328 13.6889L13.0844 18.5276C13.1414 18.7178 13.3086 18.8541 13.5064 18.8711C13.7042 18.8881 13.8925 18.7828 13.9811 18.6051L14.9996 16.5659L16.0158 18.6034C16.098 18.7683 16.2669 18.8721 16.4512 18.8711C16.4652 18.8718 16.4789 18.8718 16.4928 18.8711C16.6906 18.8541 16.8578 18.718 16.9148 18.5281L18.3664 13.6893C18.4037 13.5662 18.3905 13.433 18.3298 13.3196C18.2688 13.2062 18.1651 13.1218 18.0418 13.085Z" fill="#2ABF4B"/>
<path d="M25.7839 13.085C25.5278 13.0082 25.2582 13.1537 25.1814 13.4096L24.0807 17.0807L23.1772 15.2678C23.0862 15.1152 22.9218 15.0216 22.7441 15.0216C22.5667 15.0216 22.402 15.1152 22.3111 15.2678L21.4029 17.0807L20.3021 13.411C20.2253 13.1551 19.9557 13.0098 19.6996 13.0864C19.4438 13.1632 19.2982 13.4327 19.375 13.6889L20.8266 18.5276C20.8835 18.7178 21.0508 18.8541 21.2486 18.8711C21.4463 18.8881 21.6346 18.7828 21.7232 18.6051L22.7418 16.5659L23.7579 18.6034C23.8402 18.7683 24.0091 18.8721 24.1934 18.8711C24.2073 18.8718 24.221 18.8718 24.235 18.8711C24.4327 18.8541 24.6 18.718 24.6569 18.5281L26.1085 13.6893C26.1459 13.5662 26.1326 13.433 26.0719 13.3196C26.011 13.2062 25.9072 13.1218 25.7839 13.085Z" fill="#2ABF4B"/>
<path d="M10.3 13.085C10.0439 13.0082 9.77435 13.1537 9.69757 13.4096L8.59681 17.0807L7.69333 15.2678C7.60237 15.1152 7.43793 15.0216 7.26025 15.0216C7.08282 15.0216 6.91814 15.1152 6.82718 15.2678L5.91898 17.0807L4.81822 13.411C4.74143 13.1551 4.47185 13.0098 4.21574 13.0864C3.95987 13.1632 3.81433 13.4327 3.89111 13.6889L5.34273 18.5276C5.39967 18.7178 5.56694 18.8541 5.7647 18.8711C5.96245 18.8881 6.15075 18.7828 6.23935 18.6051L7.25789 16.5659L8.27643 18.6034C8.35841 18.7676 8.52616 18.8711 8.7095 18.8711C8.72344 18.8718 8.73715 18.8718 8.75109 18.8711C8.94884 18.8541 9.11612 18.718 9.17306 18.5281L10.6247 13.6893C10.662 13.5662 10.6488 13.433 10.588 13.3196C10.5271 13.2062 10.4234 13.1218 10.3 13.085Z" fill="#2ABF4B"/>
</svg>
