<svg width="30" height="30" viewBox="0 0 30 30" fill="none" xmlns="http://www.w3.org/2000/svg">
<g clip-path="url(#clip0)">
<path d="M23.8518 22.0906C23.7428 21.9816 23.5916 21.9189 23.4375 21.9189C23.2834 21.9189 23.1322 21.9816 23.0232 22.0906C22.9143 22.1996 22.8516 22.3508 22.8516 22.5049C22.8516 22.659 22.9143 22.8102 23.0232 22.9191C23.1322 23.0287 23.2834 23.0908 23.4375 23.0908C23.5916 23.0908 23.7428 23.0287 23.8518 22.9191C23.9607 22.8102 24.0234 22.659 24.0234 22.5049C24.0234 22.3508 23.9607 22.1997 23.8518 22.0906Z" fill="#2E68B2"/>
<path d="M27.6562 0.000976562H2.34375C1.05141 0.000976562 0 1.05238 0 2.34473V20.748C0 22.0404 1.05141 23.0918 2.34375 23.0918H11.543V26.033C9.8243 26.2005 8.47658 27.6531 8.47658 29.415C8.47658 29.7386 8.73891 30.0009 9.06252 30.0009H20.9375C21.2612 30.0009 21.5235 29.7386 21.5235 29.415C21.5235 27.6133 20.114 26.1354 18.3399 26.024V23.0918H21.0743C21.3979 23.0918 21.6602 22.8295 21.6602 22.5058C21.6602 22.1822 21.3979 21.9199 21.0743 21.9199H2.34375C1.69758 21.9199 1.17188 21.3942 1.17188 20.748V2.34473C1.17188 1.69855 1.69758 1.17285 2.34375 1.17285H27.6562C28.3024 1.17285 28.8281 1.69855 28.8281 2.34473V20.748C28.8281 21.3942 28.3024 21.9199 27.6562 21.9199H25.4688C25.1452 21.9199 24.8828 22.1822 24.8828 22.5058C24.8828 22.8295 25.1452 23.0918 25.4688 23.0918H27.6562C28.9486 23.0918 30 22.0404 30 20.748V2.34473C30 1.05232 28.9486 0.000976562 27.6562 0.000976562ZM12.7148 23.0918H17.168V26.0166H12.7148V23.0918ZM18.125 27.1885C19.15 27.1885 20.0155 27.8847 20.2734 28.8291H9.72662C9.98443 27.8847 10.8499 27.1885 11.875 27.1885H18.125Z" fill="#2E68B2"/>
<path d="M15.3557 20.2156C15.2467 20.1066 15.0955 20.0439 14.9414 20.0439C14.7873 20.0439 14.6361 20.1066 14.5271 20.2156C14.4182 20.3246 14.3555 20.4758 14.3555 20.6299C14.3555 20.7846 14.4182 20.9352 14.5271 21.0441C14.6361 21.1537 14.7873 21.2158 14.9414 21.2158C15.0955 21.2158 15.2467 21.1537 15.3557 21.0441C15.4646 20.9352 15.5273 20.7846 15.5273 20.6299C15.5273 20.4758 15.4646 20.3246 15.3557 20.2156Z" fill="#2E68B2"/>
<path d="M8.56635 10.7412L11.4372 7.87036C11.6661 7.64155 11.6661 7.27053 11.4373 7.04172C11.2085 6.81292 10.8374 6.81292 10.6086 7.04172L7.32346 10.3268C7.09465 10.5556 7.09465 10.9267 7.32346 11.1555L10.6086 14.4406C10.723 14.5551 10.8729 14.6123 11.0229 14.6123C11.1728 14.6123 11.3228 14.5551 11.4372 14.4406C11.666 14.2118 11.666 13.8408 11.4372 13.612L8.56635 10.7412Z" fill="#2E68B2"/>
<path d="M22.6765 10.3268L19.3914 7.04172C19.1626 6.81292 18.7916 6.81292 18.5627 7.04172C18.3339 7.27053 18.3339 7.64155 18.5627 7.87042L21.4336 10.7412L18.5627 13.612C18.334 13.8408 18.334 14.2118 18.5628 14.4406C18.6772 14.5551 18.8272 14.6123 18.9771 14.6123C19.127 14.6123 19.277 14.5551 19.3914 14.4406L22.6765 11.1555C22.9053 10.9267 22.9053 10.5557 22.6765 10.3268Z" fill="#2E68B2"/>
<path d="M16.029 7.12172C15.7165 7.03782 15.3952 7.2235 15.3114 7.53604L13.5572 14.0828C13.4735 14.3954 13.659 14.7166 13.9715 14.8004C14.0223 14.814 14.0734 14.8205 14.1236 14.8205C14.3823 14.8205 14.619 14.6479 14.6892 14.3861L16.4434 7.83938C16.5272 7.52672 16.3416 7.20551 16.029 7.12172Z" fill="#2E68B2"/>
<path d="M27.0703 2.34863H17.7539C17.4303 2.34863 17.168 2.61096 17.168 2.93457C17.168 3.25818 17.4303 3.52051 17.7539 3.52051H26.4844V18.1689H3.51562V3.52051H12.5098C12.8334 3.52051 13.0957 3.25818 13.0957 2.93457C13.0957 2.61096 12.8334 2.34863 12.5098 2.34863H2.92969C2.60607 2.34863 2.34375 2.61096 2.34375 2.93457V18.7549C2.34375 19.0785 2.60607 19.3408 2.92969 19.3408H27.0703C27.3939 19.3408 27.6562 19.0785 27.6562 18.7549V2.93457C27.6562 2.61096 27.3939 2.34863 27.0703 2.34863Z" fill="#2E68B2"/>
<path d="M15.5314 2.52031C15.4225 2.41133 15.2713 2.34863 15.1172 2.34863C14.9631 2.34863 14.8119 2.41133 14.7029 2.52031C14.5939 2.6293 14.5312 2.78047 14.5312 2.93457C14.5312 3.08867 14.5939 3.23984 14.7029 3.34941C14.8119 3.4584 14.9631 3.52051 15.1172 3.52051C15.2713 3.52051 15.4225 3.4584 15.5314 3.34941C15.6404 3.23984 15.7031 3.08926 15.7031 2.93457C15.7031 2.78047 15.6404 2.6293 15.5314 2.52031Z" fill="#2E68B2"/>
</g>
<defs>
<clipPath id="clip0">
<rect width="30" height="30" fill="white"/>
</clipPath>
</defs>
</svg>
