<?xml version="1.0" standalone="no"?>
<!DOCTYPE svg PUBLIC "-//W3C//DTD SVG 1.1//EN" "http://www.w3.org/Graphics/SVG/1.1/DTD/svg11.dtd" >
<svg xmlns="http://www.w3.org/2000/svg">
<metadata>
<json>
<![CDATA[
{
	"fontFamily": "iconfont",
	"fontURL": "http://xpeedstudio.com",
	"designer": "xpeedstudio",
	"license": "CO",
	"description": "Copy prohibited\nFont generated by IcoMoon.",
	"copyright": "CO",
	"version": "Version 1.0",
	"majorVersion": 0,
	"fontId": "iconfont",
	"psName": "iconfont",
	"subFamily": "Regular",
	"fullName": "iconfont"
}
]]>
</json>
</metadata>
<defs>
<font id="iconfont" horiz-adv-x="1024">
<font-face units-per-em="1024" ascent="960" descent="-64" />
<missing-glyph horiz-adv-x="1024" />
<glyph unicode="&#x20;" horiz-adv-x="512" d="" />
<glyph unicode="&#xf123;" glyph-name="alert" data-tags="alert" horiz-adv-x="964" d="M0 117.201v43.369l189.862 163.84v256.361c0 68.748 21.846 129.787 65.536 183.115s98.625 87.060 164.804 101.195v59.753h125.289v-59.753c65.536-14.135 120.151-47.867 163.84-101.195s65.855-114.367 66.5-183.115v-256.361l187.934-163.84v-43.369h-963.765zM412.491 33.353c0 19.275 6.746 35.979 20.239 50.116s30.198 20.884 50.116 20.239c19.918-0.645 36.623-7.391 50.116-20.239s20.239-29.557 20.239-50.116c0-20.558-6.746-36.942-20.239-49.152s-30.198-18.631-50.116-19.275c-19.918-0.645-36.623 5.783-50.116 19.275s-20.239 29.877-20.239 49.152z" />
<glyph unicode="&#xf124;" glyph-name="search" data-tags="search" d="M484.667 905.446c-241.796 0-438.762-196.965-438.762-438.763 0-241.794 196.966-439.143 438.762-439.143 103.28 0 198.263 36.191 273.332 96.285l182.764-182.667c9.221-8.841 21.538-13.717 34.314-13.585 12.776 0.127 24.995 5.257 34.036 14.282 9.040 9.031 14.185 21.236 14.331 34.011 0.151 12.776-4.71 25.103-13.541 34.338l-182.76 182.76c60.143 75.186 96.383 170.32 96.383 273.718 0 241.798-197.061 438.763-438.86 438.763zM484.667 807.921c189.091 0 341.238-152.147 341.238-341.238s-152.147-341.619-341.238-341.619c-189.090 0-341.238 152.527-341.238 341.619s152.147 341.238 341.238 341.238z" />
<glyph unicode="&#xf125;" glyph-name="bookmark" data-tags="bookmark" horiz-adv-x="878" d="M706.037 930.464h-534.587c-35.054-0.493-68.483-14.861-92.963-39.956s-38.016-58.87-37.641-93.925v-764.898c-0.094-15.28 4.289-30.245 12.609-43.059 8.319-12.807 20.21-22.901 34.202-29.030 13.285-6.276 28.146-8.426 42.665-6.173s28.029 8.806 38.787 18.812l250.441 221.886c5.72 4.557 12.816 7.036 20.129 7.036s14.41-2.48 20.129-7.036l250.441-221.886c10.822-9.896 24.324-16.377 38.813-18.622 14.497-2.253 29.33-0.168 42.642 5.983 13.992 6.129 25.878 16.223 34.202 29.030 8.316 12.815 12.698 27.78 12.61 43.059v764.898c0.183 17.515-3.109 34.893-9.684 51.128s-16.304 31.005-28.621 43.456c-12.317 12.451-26.99 22.335-43.154 29.080s-33.505 10.218-51.021 10.217z" />
<glyph unicode="&#xf126;" glyph-name="hamburger" data-tags="hamburger" horiz-adv-x="1536" d="M0 780.19v170.667h1536v-170.667h-1536zM0 353.524h1536v170.667h-1536v-170.667zM0-73.143h1536v170.667h-1536v-170.667z" />
<glyph unicode="&#xf127;" glyph-name="right-open" data-tags="right-open" horiz-adv-x="512" d="M42.14 130.56l283.136 304.64-283.136 308.224c-31.061 31.062-31.061 59.734 0 86.016 31.061 31.061 59.733 31.061 86.016 0l344.064-347.648c28.672-31.062 28.672-60.928 0-89.6l-344.064-347.648c-26.283-31.062-54.955-31.062-86.016 0-31.061 26.282-31.061 54.954 0 86.016z" />
</font></defs></svg>