<svg width="30" height="30" viewBox="0 0 30 30" fill="none" xmlns="http://www.w3.org/2000/svg">
<g clip-path="url(#clip0)">
<path d="M21.875 23.75H25.625C25.97 23.75 26.25 23.47 26.25 23.125V8.12502C26.25 7.78002 25.97 7.5 25.625 7.5H21.875C21.53 7.5 21.25 7.78002 21.25 8.12502V23.125C21.2501 23.4701 21.53 23.75 21.875 23.75ZM22.5 8.75004H25.0001V22.5001H22.5V8.75004Z" fill="#2E68B2"/>
<path d="M29.375 26.25H3.75V0.62502C3.75 0.28002 3.46998 0 3.12498 0C2.77998 0 2.50002 0.28002 2.50002 0.62502V26.25H0.62502C0.28002 26.25 0 26.53 0 26.875C0 27.22 0.28002 27.5 0.62502 27.5H2.50002V29.375C2.50002 29.72 2.78004 30.0001 3.12504 30.0001C3.47004 30.0001 3.75 29.72 3.75 29.375V27.5H29.375C29.72 27.5 30 27.22 30 26.875C30 26.53 29.72 26.25 29.375 26.25Z" fill="#2E68B2"/>
<path d="M14.375 23.75H18.125C18.47 23.75 18.7501 23.47 18.7501 23.125V1.87502C18.7501 1.53002 18.47 1.25 18.125 1.25H14.375C14.03 1.25 13.75 1.53002 13.75 1.87502V23.125C13.7501 23.47 14.03 23.75 14.375 23.75ZM15 2.50004H17.5001V22.5H15V2.50004Z" fill="#2E68B2"/>
<path d="M6.87502 23.75H10.625C10.97 23.75 11.25 23.47 11.25 23.125V11.875C11.25 11.53 10.97 11.25 10.625 11.25H6.87502C6.53002 11.25 6.25 11.53 6.25 11.875V23.125C6.25006 23.4701 6.53002 23.75 6.87502 23.75ZM7.50004 12.5H10.0001V22.5001H7.50004V12.5Z" fill="#2E68B2"/>
</g>
<defs>
<clipPath id="clip0">
<rect width="30" height="30" fill="white"/>
</clipPath>
</defs>
</svg>
