<?xml version="1.0" encoding="UTF-8"?>
<svg width="288px" height="133px" viewBox="0 0 288 133" version="1.1" xmlns="http://www.w3.org/2000/svg" xmlns:xlink="http://www.w3.org/1999/xlink">
  <!-- Generator: Sketch 62 (91390) - https://sketch.com -->
  <title>illustration/desktop/signup-1</title>
  <desc>Created with Sketch.</desc>
  <defs>
    <path d="M276.511305,61.9128253 L278.921458,64.2736664 C279.007426,64.3578754 279.111429,64.4219479 279.225167,64.4609332 C279.627801,64.5989416 280.053285,64.3973951 280.183641,64.0138829 L281.780144,59.3169354 C281.808145,59.2345539 281.820582,59.1488818 281.818265,59.0636564 C280.213345,60.2321222 278.432896,61.1964866 276.511305,61.9128253 L276.511305,61.9128253 Z M282.477216,58.5647201 C282.594759,58.8781033 282.605228,59.2252083 282.494824,59.5500181 L280.898322,64.2469657 C280.63449,65.0231646 279.774007,65.4307651 278.976378,65.1573669 C278.755729,65.0817362 278.554736,64.9579117 278.388828,64.7953986 L275.72755,62.1885708 C275.243811,62.3487709 274.751758,62.4934837 274.251899,62.6220514 C274.22593,62.6283015 274.199947,62.6316576 274.173948,62.631541 C274.09477,62.6311857 274.01722,62.6001622 273.959642,62.5437619 L269.011466,57.6968263 C268.934893,57.6218197 268.904249,57.5128711 268.931541,57.410549 C269.062794,56.9209171 269.21053,56.4389314 269.374073,55.9650992 L266.712798,53.3582612 C266.546891,53.195748 266.42048,52.9988675 266.343269,52.7827325 C266.064161,52.0014237 266.480275,51.1585459 267.272687,50.9001122 L272.067741,49.3362742 C272.399336,49.2281296 272.753691,49.2383843 273.07362,49.353522 C277.19953,44.3241251 283.527881,41.2191902 290.445846,41.25 C290.613066,41.2509809 290.748999,41.3841321 290.75,41.547931 C290.781453,48.3243538 287.611664,54.5232263 282.477216,58.5647201 L282.477216,58.5647201 Z M269.655581,55.1973703 C270.386882,53.3150952 271.37139,51.5710741 272.564262,49.9989913 C272.477256,49.996721 272.389795,50.0089035 272.305693,50.0363323 L267.510638,51.6001702 C267.119115,51.7278597 266.913359,52.1446381 267.05425,52.5390341 C267.094049,52.6504451 267.15946,52.7523201 267.245428,52.8365291 L269.655581,55.1973703 L269.655581,55.1973703 Z M289.993932,41.9905991 C280.505783,42.1405668 272.246296,48.3918015 269.726997,57.3542539 L274.30936,61.8428613 C283.45941,59.374614 289.840836,51.2843291 289.993932,41.9905991 Z M282.138149,49.6856516 C280.961496,48.5330728 280.961496,46.6643734 282.138149,45.5117946 C283.314802,44.3592158 285.222534,44.3592158 286.399187,45.5117946 C287.575841,46.6643734 287.575841,48.5330728 286.399187,49.6856516 C285.222534,50.8382304 283.314802,50.8382304 282.138149,49.6856516 Z M282.670779,49.1639195 C283.553269,50.0283536 284.984068,50.0283536 285.866558,49.1639195 C286.749048,48.2994854 286.749048,46.8979608 285.866558,46.0335267 C284.984068,45.1690926 283.553269,45.1690926 282.670779,46.0335267 C281.788289,46.8979608 281.788289,48.2994854 282.670779,49.1639195 Z M271.219239,60.9028923 C271.36632,61.0469647 271.36632,61.2805521 271.219239,61.4246245 L268.55609,64.0332851 C268.409008,64.1773575 268.170542,64.1773575 268.02346,64.0332851 C267.876378,63.8892128 267.876378,63.6556253 268.02346,63.511553 L270.686609,60.9028923 C270.833691,60.75882 271.072157,60.75882 271.219239,60.9028923 Z M268.55609,59.337696 C268.703172,59.4817683 268.703172,59.7153557 268.55609,59.8594281 L265.892941,62.4680887 C265.745859,62.6121611 265.507393,62.6121611 265.360311,62.4680887 C265.21323,62.3240164 265.21323,62.0904289 265.360311,61.9463566 L268.02346,59.337696 C268.170542,59.1936236 268.409008,59.1936236 268.55609,59.337696 Z M272.817128,63.511553 C272.96421,63.6556253 272.96421,63.8892128 272.817128,64.0332851 L270.153979,66.6419457 C270.006898,66.7860181 269.768431,66.7860181 269.621349,66.6419457 C269.474268,66.4978734 269.474268,66.264286 269.621349,66.1202136 L272.284498,63.511553 C272.43158,63.3674806 272.670046,63.3674806 272.817128,63.511553 Z" id="path-1"></path>
  </defs>
  <g id="modal-checkout-AW-" stroke="none" stroke-width="1" fill="none" fill-rule="evenodd">
    <g id="Experiment/signup" transform="translate(-707.000000, -202.000000)">
      <g id="illustration/desktop/signup-1" transform="translate(703.000000, 198.000000)">
        <path d="M259,89 C260.104569,89 261,88.1045695 261,87 C261,85.8954305 260.104569,85 259,85 C257.895431,85 257,85.8954305 257,87 C257,88.1045695 257.895431,89 259,89 Z M259,90 C257.343146,90 256,88.6568542 256,87 C256,85.3431458 257.343146,84 259,84 C260.656854,84 262,85.3431458 262,87 C262,88.6568542 260.656854,90 259,90 Z" id="Oval" fill="#FF9500" fill-rule="nonzero"></path>
        <polygon id="Path" fill="#FF9500" fill-rule="evenodd" points="9.61569258 56 9.61569258 51 10.6156926 51 10.6156926 56 15.6156926 56 15.6156926 57 10.6156926 57 10.6156926 62 9.61569258 62 9.61569258 57 4.61569258 57 4.61569258 56"></polygon>
        <polygon id="Path" fill="#FF9500" fill-rule="evenodd" points="286.545455 80.5454545 286.545455 76 287.454545 76 287.454545 80.5454545 292 80.5454545 292 81.4545455 287.454545 81.4545455 287.454545 86 286.545455 86 286.545455 81.4545455 282 81.4545455 282 80.5454545"></polygon>
        <path d="M15,80 C16.1045695,80 17,79.1045695 17,78 C17,76.8954305 16.1045695,76 15,76 C13.8954305,76 13,76.8954305 13,78 C13,79.1045695 13.8954305,80 15,80 Z M15,81 C13.3431458,81 12,79.6568542 12,78 C12,76.3431458 13.3431458,75 15,75 C16.6568542,75 18,76.3431458 18,78 C18,79.6568542 16.6568542,81 15,81 Z" id="Oval" fill="#FF9500" fill-rule="nonzero"></path>
        <path d="M274.467113,117.023097 L273.144033,116.259216 L273.522356,115.603942 L274.845436,116.367823 L275.609317,115.044742 L276.264592,115.423065 L275.500711,116.746146 L276.823792,117.510027 L276.445469,118.165301 L275.122388,117.40142 L274.358507,118.724501 L273.703232,118.346178 L274.467113,117.023097 L274.467113,117.023097 Z M256.824093,111.114639 C255.838928,109.784095 255.688543,107.916193 256.586399,106.36106 C257.172729,105.345506 258.098084,104.650397 259.127709,104.342626 L265.475523,98.5833073 L268.604037,98 L267.70131,101.074204 L263.192332,105.165163 C264.388086,105.855062 267.200538,107.478433 271.629687,110.035275 L271.614356,106.158393 C271.614356,103.805685 272.278235,101.863838 273.386133,100.313928 C273.775553,99.7691442 274.19354,99.3119672 274.612924,98.9385959 C274.868369,98.7111767 275.071013,98.560218 275.194157,98.481905 L275.42525,98.334942 L275.64155,98.5019234 C275.762002,98.5949106 275.963015,98.7703891 276.217656,99.0269673 C276.637496,99.4500023 277.056393,99.9510455 277.447109,100.528855 C278.532098,102.133384 279.196926,104.013322 279.232402,106.152169 L279.227264,114.857041 C280.169276,116.186068 280.292804,118.018126 279.413861,119.540502 C278.517921,121.092314 276.822508,121.902949 275.170511,121.710779 C273.93927,122.124815 272.593371,122.033025 271.431174,121.420041 C271.420716,121.41577 267.348978,119.066291 259.21596,114.371603 C259.161708,114.33986 259.13203,114.323146 259.1025,114.306097 C257.991505,113.664664 257.207755,112.615037 256.886623,111.385319 C256.863227,111.295729 256.842376,111.205463 256.824093,111.114639 L256.824093,111.114639 Z M258.043106,112.21322 C258.386566,112.800835 258.876993,113.295517 259.483717,113.64581 C259.518378,113.665821 259.553272,113.685281 259.588391,113.704186 C259.598295,113.709518 263.646492,116.047431 271.732982,120.717926 C272.32633,121.036751 272.968641,121.196548 273.610971,121.201612 L258.222345,112.316985 C258.154404,112.27705 258.118188,112.25685 258.082223,112.236086 C258.069127,112.228525 258.056088,112.220903 258.043106,112.21322 Z M262.501561,104.765937 L267.036341,100.651569 L267.528385,98.9759298 L265.823144,99.2938699 L260.454763,104.164557 C261.127257,104.181635 261.802196,104.360992 262.422232,104.71897 C262.448876,104.734352 262.47532,104.750009 262.501561,104.765937 L262.501561,104.765937 Z M272.397869,110.47873 C274.093582,111.457633 276.00782,112.562711 278.140582,113.793963 C278.17333,113.81287 278.20216,113.83597 278.226794,113.862207 C278.305324,113.917225 278.381421,113.974576 278.455052,114.034115 C278.457275,108.793107 278.459422,106.163604 278.461492,106.145606 C278.422576,104.147234 277.807524,102.41957 276.807159,100.940185 C276.443828,100.402876 276.054817,99.9375791 275.666751,99.5465599 C275.560214,99.4392127 275.465273,99.3486294 275.3846,99.27502 C275.310828,99.3337739 275.225238,99.4054807 275.129888,99.4903694 C274.750984,99.8277023 274.370684,100.243659 274.015034,100.741199 C272.994164,102.16936 272.380779,103.963504 272.380779,106.157368 L272.397869,110.47873 L272.397869,110.47873 Z M277.011749,103.992696 C277.015126,103.787127 277.171773,103.623446 277.36163,103.627103 C277.551486,103.63076 277.702656,103.800371 277.699279,104.00594 L277.624486,108.557912 C277.621108,108.763481 277.464461,108.927162 277.274605,108.923505 C277.084749,108.919848 276.933578,108.750237 276.936956,108.544668 L277.011749,103.992696 Z M262.041015,105.379257 C260.379744,104.420121 258.230398,105.026863 257.241673,106.739383 C256.252949,108.451904 256.802169,110.616663 258.46344,111.575798 C258.505674,111.600182 258.54831,111.623607 258.591329,111.64607 C258.604819,111.653114 263.77844,114.641294 274.112192,120.610609 C275.800144,121.434188 277.814272,120.797778 278.758586,119.162178 C279.7029,117.526579 279.246983,115.464088 277.733533,114.448346 C277.723117,114.441355 272.553747,111.453815 262.225423,105.485725 C262.124854,105.428851 262.083249,105.40364 262.041015,105.379257 Z" id="Shape" fill="#FF9500" fill-rule="nonzero"></path>
        <mask id="mask-2" fill="white">
          <use xlink:href="#path-1"></use>
        </mask>
        <use id="rocket" fill="#FF9500" fill-rule="nonzero" xlink:href="#path-1"></use>
        <path d="M257.404273,17.5825748 L257.364793,17.9582058 L248.414096,17.0174496 L249.354852,8.06675258 L249.809447,8.11453244 L223.497282,5.34901253 C222.948023,5.29128305 222.455962,5.68974669 222.398232,6.23900596 L217.79898,49.9979694 C217.74125,50.5472286 218.139714,51.0392902 218.688973,51.0970197 L252.502718,54.6509875 C253.051977,54.7087169 253.544038,54.3102533 253.601768,53.760994 L257.404273,17.5825748 Z M257.253294,16.9409786 C257.233956,16.9106076 257.212904,16.881166 257.190181,16.8528033 L250.485348,8.48381134 C250.439769,8.42691895 250.388495,8.37564831 250.332628,8.33060211 L249.513146,16.1274562 L257.253294,16.9409786 L257.253294,16.9409786 Z M223.601811,4.35449064 L249.913975,7.12001054 C250.445112,7.17583526 250.93186,7.44176995 251.265779,7.85856834 L257.970611,16.2275604 C258.299993,16.6386952 258.453861,17.1631837 258.398795,17.6871033 L254.59629,53.8655225 C254.480831,54.9640411 253.496708,55.7609683 252.398189,55.6455094 L218.584445,52.0915416 C217.485926,51.9760827 216.688999,50.9919594 216.804458,49.8934409 L221.40371,6.1344775 C221.519169,5.03595895 222.503292,4.23903168 223.601811,4.35449064 Z M231.773049,41.4116204 L241.718268,42.4569051 C241.429621,45.2032014 238.969313,47.1955196 236.223016,46.9068722 C233.47672,46.6182248 231.484402,44.1579168 231.773049,41.4116204 Z M229.704858,37.1722117 C228.740423,37.0708455 228.336245,35.8435353 228.474396,34.5291143 C228.612548,33.2146932 229.263065,32.098236 230.2275,32.1996022 C231.191936,32.3009684 231.596113,33.5282786 231.457962,34.8426996 C231.319811,36.1571207 230.669293,37.2735779 229.704858,37.1722117 Z M244.622687,38.7401386 C243.658251,38.6387724 243.254074,37.4114622 243.392225,36.0970412 C243.530376,34.7826202 244.180894,33.6661629 245.145329,33.7675292 C246.109764,33.8688954 246.513942,35.0962056 246.375791,36.4106266 C246.237639,37.7250476 245.587122,38.8415049 244.622687,38.7401386 Z" id="Shape" fill="#212121" fill-rule="nonzero"></path>
        <path d="M91,29 L91,45 L209,45 L209,29 L91,29 Z M90,28 L210,28 L210,46 L90,46 L90,28 Z" id="Rectangle" fill="#E0E0E0" fill-rule="nonzero"></path>
        <path d="M91,49 L91,65 L209,65 L209,49 L91,49 Z M90,48 L210,48 L210,66 L90,66 L90,48 Z" id="Rectangle" fill="#E0E0E0" fill-rule="nonzero"></path>
        <path d="M91,69 L91,85 L209,85 L209,69 L91,69 Z M90,68 L210,68 L210,86 L90,86 L90,68 Z" id="Rectangle" fill="#E0E0E0" fill-rule="nonzero"></path>
        <path d="M91,89 L91,105 L209,105 L209,89 L91,89 Z M90,88 L210,88 L210,106 L90,106 L90,88 Z" id="Rectangle" fill="#E0E0E0" fill-rule="nonzero"></path>
        <path d="M201,40.9473684 C203.180071,40.9473684 204.947368,39.1800714 204.947368,37 C204.947368,34.8199286 203.180071,33.0526316 201,33.0526316 C198.819929,33.0526316 197.052632,34.8199286 197.052632,37 C197.052632,39.1800714 198.819929,40.9473684 201,40.9473684 Z M201,42 C198.238576,42 196,39.7614237 196,37 C196,34.2385763 198.238576,32 201,32 C203.761424,32 206,34.2385763 206,37 C206,39.7614237 203.761424,42 201,42 Z" id="circle" fill="#F23030" fill-rule="nonzero"></path>
        <path d="M201,60.9473684 C203.180071,60.9473684 204.947368,59.1800714 204.947368,57 C204.947368,54.8199286 203.180071,53.0526316 201,53.0526316 C198.819929,53.0526316 197.052632,54.8199286 197.052632,57 C197.052632,59.1800714 198.819929,60.9473684 201,60.9473684 Z M201,62 C198.238576,62 196,59.7614237 196,57 C196,54.2385763 198.238576,52 201,52 C203.761424,52 206,54.2385763 206,57 C206,59.7614237 203.761424,62 201,62 Z" id="circle" fill="#3D99F5" fill-rule="nonzero"></path>
        <path d="M201,80.9473684 C203.180071,80.9473684 204.947368,79.1800714 204.947368,77 C204.947368,74.8199286 203.180071,73.0526316 201,73.0526316 C198.819929,73.0526316 197.052632,74.8199286 197.052632,77 C197.052632,79.1800714 198.819929,80.9473684 201,80.9473684 Z M201,82 C198.238576,82 196,79.7614237 196,77 C196,74.2385763 198.238576,72 201,72 C203.761424,72 206,74.2385763 206,77 C206,79.7614237 203.761424,82 201,82 Z" id="circle" fill="#FFB400" fill-rule="nonzero"></path>
        <path d="M201,100.947368 C203.180071,100.947368 204.947368,99.1800714 204.947368,97 C204.947368,94.8199286 203.180071,93.0526316 201,93.0526316 C198.819929,93.0526316 197.052632,94.8199286 197.052632,97 C197.052632,99.1800714 198.819929,100.947368 201,100.947368 Z M201,102 C198.238576,102 196,99.7614237 196,97 C196,94.2385763 198.238576,92 201,92 C203.761424,92 206,94.2385763 206,97 C206,99.7614237 203.761424,102 201,102 Z" id="circle" fill="#0FC0C5" fill-rule="nonzero"></path>
        <path d="M94.5263158,31 L101.48871,31 C101.629253,31 101.763958,31.0533997 101.862815,31.1483025 L103.847789,33.0538775 C103.945303,33.1474907 104,33.2738736 104,33.405575 L104,42.5 C104,42.7761424 103.76436,43 103.473684,43 L94.5263158,43 C94.2356396,43 94,42.7761424 94,42.5 L94,31.5 C94,31.2238576 94.2356396,31 94.5263158,31 Z" id="file" fill="#F23030" fill-rule="evenodd"></path>
        <path d="M94.5263158,51 L101.48871,51 C101.629253,51 101.763958,51.0533997 101.862815,51.1483025 L103.847789,53.0538775 C103.945303,53.1474907 104,53.2738736 104,53.405575 L104,62.5 C104,62.7761424 103.76436,63 103.473684,63 L94.5263158,63 C94.2356396,63 94,62.7761424 94,62.5 L94,51.5 C94,51.2238576 94.2356396,51 94.5263158,51 Z" id="file" fill="#3D99F5" fill-rule="evenodd"></path>
        <path d="M94.5263158,71 L101.48871,71 C101.629253,71 101.763958,71.0533997 101.862815,71.1483025 L103.847789,73.0538775 C103.945303,73.1474907 104,73.2738736 104,73.405575 L104,82.5 C104,82.7761424 103.76436,83 103.473684,83 L94.5263158,83 C94.2356396,83 94,82.7761424 94,82.5 L94,71.5 C94,71.2238576 94.2356396,71 94.5263158,71 Z" id="file" fill="#FFB400" fill-rule="evenodd"></path>
        <path d="M94.5263158,91 L101.48871,91 C101.629253,91 101.763958,91.0533997 101.862815,91.1483025 L103.847789,93.0538775 C103.945303,93.1474907 104,93.2738736 104,93.405575 L104,102.5 C104,102.776142 103.76436,103 103.473684,103 L94.5263158,103 C94.2356396,103 94,102.776142 94,102.5 L94,91.5 C94,91.2238576 94.2356396,91 94.5263158,91 Z" id="file" fill="#0FC0C5" fill-rule="evenodd"></path>
        <path d="M28.7059117,43.214854 L28.5388893,42.4290754 L28.1157778,42.5190106 C27.9154823,42.5615847 27.7157215,42.4201953 27.6695995,42.2032085 C27.6234776,41.9862218 27.7484599,41.7758061 27.9487554,41.733232 L28.3718669,41.6432968 L28.0378221,40.0717397 L35.8956079,38.4015158 L36.2296526,39.9730729 L36.6527642,39.8831378 C36.8530597,39.8405637 37.0528205,39.9819531 37.0989424,40.1989398 C37.1450644,40.4159266 37.020082,40.6263423 36.8197866,40.6689164 L36.396675,40.7588515 L36.5636974,41.5446301 L36.986809,41.4546949 C37.1871044,41.4121208 37.3868652,41.5535102 37.4329872,41.770497 C37.4791092,41.9874837 37.3541268,42.1978994 37.1538314,42.2404735 L36.7307198,42.3304087 C36.7307198,42.3304087 36.1092462,44.9263478 33.3028941,45.5228563 C30.4965421,46.1193649 28.8729341,44.0006326 28.8729341,44.0006326 L28.4498226,44.0905677 C28.2495271,44.1331418 28.0497663,43.9917524 28.0036443,43.7747657 C27.9575224,43.5577789 28.0825047,43.3473632 28.2828002,43.3047891 L28.7059117,43.214854 L28.7059117,43.214854 Z M29.4916903,43.0478316 L35.7779189,41.7116525 L35.6108965,40.9258739 L29.3246679,42.262053 L29.4916903,43.0478316 L29.4916903,43.0478316 Z M29.7927502,43.8051196 C29.9822262,43.9799322 30.2020648,44.1481553 30.4495806,44.2970252 C31.2299609,44.7663898 32.1196707,44.953078 33.1358717,44.7370778 C34.1520728,44.5210776 34.8889302,43.9886518 35.4109353,43.2424566 C35.5765014,43.0057835 35.7089115,42.7626877 35.8109037,42.5259216 L29.7927502,43.8051196 L29.7927502,43.8051196 Z M29.1576455,41.4762745 L35.4438741,40.1400953 L35.2768517,39.3543168 L28.9906231,40.6904959 L29.1576455,41.4762745 Z M21.2475376,19.192014 C21.1109525,19.0172141 21.1419318,18.7647867 21.3167317,18.6282016 C21.4915316,18.4916165 21.743959,18.5225957 21.880544,18.6973956 L23.6415969,20.9511692 C23.778182,21.1259691 23.7472027,21.3783965 23.5724028,21.5149815 C23.397603,21.6515666 23.1451755,21.6205874 23.0085905,21.4457875 L21.2475376,19.192014 Z M32.2135417,16.5010491 C32.2672209,16.2858073 32.4852244,16.1548349 32.7004662,16.2085141 C32.915708,16.2621933 33.0466804,16.4801968 32.9930013,16.6954386 L32.3008918,19.4706479 C32.2472126,19.6858897 32.0292091,19.8168621 31.8139673,19.763183 C31.5987254,19.7095038 31.467753,19.4915003 31.5214322,19.2762585 L32.2135417,16.5010491 Z M26.4235311,16.5977398 C26.3774091,16.380753 26.5159224,16.1674613 26.7329092,16.1213393 C26.9498959,16.0752174 27.1631877,16.2137307 27.2093096,16.4307174 L27.7437813,18.9452088 C27.7899032,19.1621956 27.65139,19.3754874 27.4344032,19.4216093 C27.2174164,19.4677313 27.0041247,19.329218 26.9580027,19.1122312 L26.4235311,16.5977398 Z M17.716191,23.3344714 C17.5316508,23.2113643 17.4818493,22.9619668 17.6049565,22.7774265 C17.7280636,22.5928862 17.9774611,22.5430847 18.1620014,22.6661919 L20.402727,24.1609836 C20.5872673,24.2840908 20.6370687,24.5334883 20.5139615,24.7180286 C20.3908544,24.9025689 20.1414569,24.9523703 19.9569166,24.8292632 L17.716191,23.3344714 Z M16.4046299,28.3234497 C16.1829857,28.3142655 16.0107528,28.1271422 16.019937,27.905498 C16.0291211,27.6838539 16.2162445,27.511621 16.4378887,27.5208051 L19.0246689,27.6279922 C19.2463131,27.6371764 19.418546,27.8242997 19.4093618,28.0459439 C19.4001777,28.2675881 19.2130543,28.439821 18.9914102,28.4306368 L16.4046299,28.3234497 Z M41.4476298,23.0003958 L39.1280853,24.1504544 C38.9293388,24.2489953 38.6883397,24.1677627 38.5897988,23.9690162 C38.4912578,23.7702697 38.5724905,23.5292706 38.771237,23.4307296 L41.0907814,22.280671 C41.2895279,22.1821301 41.530527,22.2633627 41.629068,22.4621092 C41.7276089,22.6608557 41.6463763,22.9018548 41.4476298,23.0003958 Z M37.2248543,18.6142574 C37.3433681,18.4267342 37.5914601,18.3707909 37.7789834,18.4893047 C37.9665067,18.6078184 38.0224499,18.8559105 37.9039362,19.0434337 L36.4649181,21.3203791 C36.3464043,21.5079024 36.0983123,21.5638457 35.910789,21.4453319 C35.7232658,21.3268181 35.6673225,21.0787261 35.7858363,20.8912028 L37.2248543,18.6142574 Z M27.713644,39.3193656 C26.7950209,34.9975835 23.0232837,35.7992909 21.8421968,30.2427139 C21.0018457,26.2891727 23.7854648,22.0861598 28.1252,21.1637206 C32.4649352,20.2412814 36.7174171,22.9487248 37.5577683,26.9022661 C38.7388552,32.4588431 34.967118,33.2605506 35.8857412,37.5823327 L27.713644,39.3193656 Z M34.9680901,36.9561052 C34.8070944,35.5527793 35.1030182,34.4484694 35.8399389,32.8941851 C35.8823439,32.8047462 36.0523096,32.4497541 36.094299,32.3611918 C36.9946716,30.4621612 37.2282303,29.2157319 36.7719897,27.0692885 C36.0155002,23.5102852 32.1558874,21.1282518 28.2922224,21.9494991 C24.4285573,22.7707465 21.8714859,26.5166883 22.6279754,30.0756915 C23.084216,32.222135 23.8045511,33.2658079 25.3994877,34.6344441 C25.4738684,34.6982712 25.7735281,34.9534414 25.848645,35.0179002 C27.15404,36.1380768 27.8735431,37.0265511 28.2972504,38.374036 L34.9680901,36.9561052 Z M26.7146859,24.6932327 C26.9012004,24.5731376 27.1497566,24.6269812 27.2698517,24.8134957 C27.3899468,25.0000102 27.3361032,25.2485663 27.1495887,25.3686615 C25.8444255,26.2090451 24.9679507,27.6142769 24.7701353,29.1877001 C24.7424635,29.4078018 24.5416034,29.5637971 24.3215017,29.5361252 C24.1014,29.5084534 23.9454047,29.3075933 23.9730766,29.0874916 C24.2003945,27.2794053 25.2085831,25.6629996 26.7146859,24.6932327 Z" id="Shape" fill="#FF9500" fill-rule="nonzero"></path>
        <path d="M69.3985152,61.8195501 L69.4379956,62.1951811 L60.4872986,63.1359373 L59.5465424,54.1852402 L60.0011374,54.1374604 L33.6889731,56.9029803 C33.1397138,56.9607098 32.7412502,57.4527714 32.7989797,58.0020306 L37.3982321,101.760994 C37.4559616,102.310253 37.9480232,102.708717 38.4972824,102.650987 L72.3110269,99.0970197 C72.8602862,99.0392902 73.2587498,98.5472286 73.2010203,97.9979694 L69.3985152,61.8195501 Z M69.1174402,61.2233646 C69.0922105,61.1976779 69.0654971,61.1732567 69.0373739,61.1502381 L60.7390464,54.3581418 C60.6826344,54.3119691 60.6218207,54.2724794 60.5578096,54.2400328 L61.377292,62.0368869 L69.1174402,61.2233646 L69.1174402,61.2233646 Z M33.5844447,55.9084584 L59.8966089,53.1429385 C60.4277457,53.0871138 60.9591478,53.2460366 61.3724269,53.5843013 L69.6707544,60.3763976 C70.0784178,60.7100659 70.337971,61.1911021 70.3930371,61.7150217 L74.1955422,97.8934409 C74.3110012,98.9919594 73.5140739,99.9760827 72.4155553,100.091542 L38.6018109,103.645509 C37.5032923,103.760968 36.5191691,102.964041 36.4037102,101.865523 L31.8044578,58.1065591 C31.6889988,57.0080406 32.4859261,56.0239173 33.5844447,55.9084584 Z M49.2817321,90.4569051 L59.226951,89.4116204 C59.5155984,92.1579168 57.5232803,94.6182248 54.7769839,94.9068722 C52.0306875,95.1955196 49.5703795,93.2032014 49.2817321,90.4569051 Z M46.3773135,86.7401386 C45.4128783,86.8415049 44.7623607,85.7250476 44.6242095,84.4106266 C44.4860583,83.0962056 44.890236,81.8688954 45.8546712,81.7675292 C46.8191063,81.6661629 47.469624,82.7826202 47.6077752,84.0970412 C47.7459264,85.4114622 47.3417487,86.6387724 46.3773135,86.7401386 Z M61.2951419,85.1722117 C60.3307067,85.2735779 59.6801891,84.1571207 59.5420379,82.8426996 C59.4038867,81.5282786 59.8080644,80.3009684 60.7724996,80.1996022 C61.7369348,80.098236 62.3874524,81.2146932 62.5256036,82.5291143 C62.6637548,83.8435353 62.2595771,85.0708455 61.2951419,85.1722117 Z" id="Shape" fill="#212121" fill-rule="nonzero"></path>
        <path d="M234.5,121.5 L251,121.5 C252.932997,121.5 254.5,123.067003 254.5,125 L254.5,133 C254.5,134.932997 252.932997,136.5 251,136.5 L49,136.5 C47.0670034,136.5 45.5,134.932997 45.5,133 L45.5,125 C45.5,123.067003 47.0670034,121.5 49,121.5 L65.5,121.5 L65.5,104.817383 L66.5,104.817383 L66.5,121.5 L233.5,121.5 L233.5,55.2792969 L234.5,55.2792969 L234.5,121.5 Z M251,122.5 L49,122.5 C47.6192881,122.5 46.5,123.619288 46.5,125 L46.5,133 C46.5,134.380712 47.6192881,135.5 49,135.5 L251,135.5 C252.380712,135.5 253.5,134.380712 253.5,133 L253.5,125 C253.5,123.619288 252.380712,122.5 251,122.5 Z M66.5,51.328125 L65.5,51.328125 L65.5,17 C65.5,15.0670034 67.0670034,13.5 69,13.5 L214.864258,13.5 L214.864258,14.5 L69,14.5 C67.6192881,14.5 66.5,15.6192881 66.5,17 L66.5,51.328125 Z" id="Shape" fill="#19BF74" fill-rule="nonzero"></path>
      </g>
    </g>
  </g>
</svg>