<svg width="30" height="30" viewBox="0 0 30 30" fill="none" xmlns="http://www.w3.org/2000/svg">
<g clip-path="url(#clip0)">
<path d="M19.0099 14.2178H18.7358C18.3976 14.2178 18.1235 14.4919 18.1235 14.83C18.1235 15.1682 18.3976 15.4423 18.7358 15.4423H19.0099C19.348 15.4423 19.6221 15.1682 19.6221 14.83C19.6221 14.4919 19.348 14.2178 19.0099 14.2178Z" fill="#2E68B2"/>
<path d="M26.3252 14.2178H20.9907C20.6525 14.2178 20.3784 14.4919 20.3784 14.83C20.3784 15.1682 20.6525 15.4423 20.9907 15.4423H26.3252C26.6634 15.4423 26.9375 15.1682 26.9375 14.83C26.9375 14.4919 26.6634 14.2178 26.3252 14.2178Z" fill="#2E68B2"/>
<path d="M29.9433 13.6939C29.8133 12.7151 28.938 11.9484 27.9507 11.9484H16.8042C15.7914 11.9484 14.9675 12.7724 14.9675 13.7852V16.4214C14.9675 17.4342 15.7914 18.2582 16.8042 18.2582H22.308C22.4986 18.2582 22.5924 18.3264 22.603 18.3491C22.6039 18.353 22.6037 18.3698 22.594 18.3988C21.9554 19.8199 20.929 21.0333 19.6246 21.9085C19.6246 21.9085 19.6245 21.9086 19.6244 21.9086C18.2496 22.8309 16.6509 23.3183 15.0011 23.3183C11.5846 23.3183 8.46572 21.1701 7.24006 17.9726C7.24 17.9725 7.24 17.9723 7.23994 17.9722C6.87033 17.0075 6.68289 16.0075 6.68289 15C6.68289 13.9796 6.87391 12.9697 7.25066 11.9983C7.25084 11.9978 7.25096 11.9973 7.25113 11.9968C8.50375 8.76809 11.5455 6.68191 15.0007 6.68191C16.6653 6.68191 18.274 7.17721 19.653 8.11436C19.6554 8.11594 19.6578 8.11758 19.6602 8.11922L19.7024 8.14705C19.7061 8.14939 19.7096 8.15174 19.7133 8.15402C20.0695 8.37814 20.4733 8.49662 20.881 8.49662C21.42 8.49662 21.9123 8.28721 22.2667 7.90787L24.4429 5.58615C24.787 5.21789 24.9496 4.73666 24.8891 4.26598C24.831 3.81369 24.5713 3.40406 24.1732 3.13371C24.1629 3.12451 24.1522 3.11572 24.1412 3.10729C21.5008 1.07449 18.34 0 15.0009 0C9.43926 0 4.36129 3.05508 1.74836 7.97314C1.74801 7.97385 1.74777 7.97449 1.74736 7.97514C0.604902 10.1265 0.000976562 12.5556 0.000976562 15.0001C0.000976562 17.4574 0.610293 19.8971 1.76295 22.0557C1.76301 22.0558 1.76307 22.056 1.76318 22.0562C4.38057 26.9561 9.45285 30 15.0007 30C18.5721 30 22.0337 28.7203 24.7482 26.3965C24.7489 26.3959 24.7496 26.3954 24.7504 26.3948C28.0872 23.5371 30.0009 19.3839 30.0009 15C30.0009 14.137 29.9457 13.7116 29.9433 13.6939ZM15.0009 1.22449C18.059 1.22449 20.9537 2.20547 23.3743 4.06207C23.3743 4.06207 23.4409 4.11434 23.4695 4.13613C23.5953 4.23211 23.6607 4.3125 23.6748 4.42195C23.6888 4.53135 23.6439 4.64801 23.549 4.74961L21.3728 7.07133C21.2177 7.23738 21.0199 7.27219 20.8813 7.27219C20.7089 7.27219 20.5278 7.21846 20.3705 7.12078L20.3378 7.09916C18.7558 6.02514 16.9104 5.45748 15.0009 5.45748C13.039 5.45748 11.1548 6.04969 9.55211 7.17018C8.21488 8.1051 7.15064 9.34922 6.43979 10.8002L3.07498 8.10545C5.53826 3.84797 10.0619 1.22449 15.0009 1.22449ZM1.22547 15.0001C1.22547 13.0034 1.6651 11.0184 2.50029 9.21393L5.95533 11.981C5.62545 12.9627 5.45852 13.9761 5.45852 15C5.45852 16.012 5.62252 17.0159 5.94654 17.9906L2.50932 20.8073C1.6682 18.9977 1.22547 17.0057 1.22547 15.0001ZM15.0007 28.7755C10.073 28.7755 5.55355 26.1601 3.08717 21.9168L6.42947 19.1779C7.1374 20.6327 8.19994 21.8808 9.5374 22.8196C11.1433 23.947 13.0326 24.5429 15.0012 24.5429C16.744 24.5429 18.4369 24.0692 19.9251 23.1687L23.3764 25.9328C20.9791 27.7708 18.0329 28.7755 15.0007 28.7755ZM24.3308 25.1283L20.9699 22.4367C22.157 21.4845 23.1005 20.2686 23.7207 18.8788C23.7252 18.8688 23.7295 18.8585 23.7334 18.8482C23.8923 18.4332 23.8476 17.9979 23.6109 17.6539C23.3437 17.2655 22.8566 17.0336 22.308 17.0336H16.8042C16.4666 17.0336 16.192 16.759 16.192 16.4214V13.7851C16.192 13.4475 16.4666 13.1729 16.8042 13.1729H27.9506C28.3172 13.1729 28.6812 13.4917 28.7293 13.8536C28.7297 13.8573 28.7763 14.2306 28.7763 14.9999C28.7764 18.8573 27.1618 22.5197 24.3308 25.1283Z" fill="#2E68B2"/>
</g>
<defs>
<clipPath id="clip0">
<rect width="30" height="30" fill="white"/>
</clipPath>
</defs>
</svg>
