<svg width="30" height="30" viewBox="0 0 30 30" fill="none" xmlns="http://www.w3.org/2000/svg">
<path d="M23.647 2H6.35835C5.20288 2.00142 4.09514 2.46106 3.2781 3.2781C2.46106 4.09514 2.00142 5.20288 2 6.35835V23.647C2.00284 24.8016 2.4631 25.9079 3.27999 26.7238C4.09688 27.5397 5.20381 27.9986 6.35835 28H23.647C24.8011 27.9986 25.9074 27.5395 26.7235 26.7235C27.5395 25.9074 27.9986 24.8011 28 23.647V6.35835C28 5.20337 27.5416 4.09562 26.7254 3.27842C25.9092 2.46123 24.802 2.00142 23.647 2ZM26.9278 23.647C26.9264 24.5167 26.5803 25.3504 25.9653 25.9653C25.3504 26.5803 24.5167 26.9264 23.647 26.9278H6.35835C5.48773 26.9278 4.65269 26.5823 4.03656 25.9672C3.42043 25.3521 3.07359 24.5176 3.07216 23.647V6.35835C3.07358 5.48724 3.42026 4.6522 4.03623 4.03623C4.6522 3.42026 5.48724 3.07358 6.35835 3.07216H23.647C24.5176 3.07359 25.3521 3.42043 25.9672 4.03656C26.5823 4.65269 26.9278 5.48773 26.9278 6.35835V23.647Z" fill="#2E68B2"/>
<path d="M18.0185 14.802C18.0185 14.802 15.4881 9.3929 15.4881 9.38218C15.4455 9.28858 15.3768 9.20923 15.2903 9.15359C15.2038 9.09795 15.1032 9.06836 15.0003 9.06836C14.8975 9.06836 14.7968 9.09795 14.7103 9.15359C14.6238 9.20923 14.5551 9.28858 14.5125 9.38218C14.5125 9.41434 11.9929 14.7752 11.9822 14.802L9.47865 20.1628C9.41894 20.2922 9.41306 20.44 9.46233 20.5737C9.51159 20.7074 9.61195 20.8161 9.74133 20.8758C9.87071 20.9355 10.0185 20.9414 10.1522 20.8921C10.2859 20.8428 10.3946 20.7425 10.4543 20.6131L12.8238 15.5364H17.1768L19.5463 20.6185C19.5759 20.6825 19.6178 20.7401 19.6696 20.788C19.7214 20.8359 19.7822 20.8731 19.8484 20.8975C19.9146 20.9219 19.985 20.933 20.0555 20.9302C20.126 20.9274 20.1952 20.9107 20.2593 20.8811C20.3234 20.8516 20.381 20.8097 20.4288 20.7578C20.4767 20.706 20.5139 20.6453 20.5383 20.5791C20.5627 20.5128 20.5738 20.4425 20.571 20.372C20.5682 20.3015 20.5515 20.2322 20.522 20.1682L18.0185 14.802ZM13.3224 14.4642L15.0003 10.8725L16.6783 14.4642H13.3224Z" fill="#2E68B2"/>
</svg>
