<svg width="30" height="30" viewBox="0 0 30 30" fill="none" xmlns="http://www.w3.org/2000/svg">
<path d="M25.625 7.5H19.375C19.03 7.5 18.75 7.21875 18.75 6.87498V0.62502C18.75 0.28002 18.47 0 18.125 0H5.625C4.59123 0 3.75 0.841231 3.75 1.875V28.125C3.75 29.1588 4.59123 30 5.625 30H24.375C25.4088 30 26.25 29.1588 26.25 28.125V8.12502C26.25 7.78002 25.97 7.5 25.625 7.5ZM25 28.125C25 28.4688 24.72 28.75 24.375 28.75H5.625C5.28 28.75 4.99998 28.4688 4.99998 28.125V1.875C4.99998 1.53123 5.28 1.24998 5.625 1.24998H17.5V6.87498C17.5 7.90875 18.3412 8.74998 19.375 8.74998H25V28.125Z" fill="#933EC5"/>
<path d="M26.0661 7.68379L18.5661 0.183789C18.3223 -0.0599609 17.9261 -0.0599609 17.6823 0.183789C17.4386 0.427539 17.4386 0.823809 17.6823 1.06756L25.1823 8.56756C25.3049 8.68879 25.4648 8.75008 25.6248 8.75008C25.7849 8.75008 25.9448 8.68885 26.0661 8.56756C26.3099 8.32381 26.3099 7.92754 26.0661 7.68379Z" fill="#933EC5"/>
</svg>
