<svg width="30" height="30" viewBox="0 0 30 30" fill="none" xmlns="http://www.w3.org/2000/svg">
<g clip-path="url(#clip0)">
<path d="M27.1962 0H2.80244C1.35359 0 0.174805 1.17879 0.174805 2.6277V18.194C0.174805 19.643 1.35354 20.8217 2.80244 20.8217H3.25027V21.3846C3.25027 22.1787 3.89633 22.8248 4.69045 22.8248H8.26162L4.70328 29.3501C4.62898 29.4863 4.63203 29.6515 4.71119 29.7848C4.79041 29.9182 4.93396 29.9999 5.08906 29.9999H7.97773C8.13857 29.9999 8.28658 29.9121 8.36351 29.7709L12.1514 22.8248H13.8051C14.0478 22.8248 14.2446 22.628 14.2446 22.3853C14.2446 22.1426 14.0478 21.9459 13.8051 21.9459H4.69045C4.38096 21.9459 4.12918 21.6941 4.12918 21.3846V20.8217H25.871V21.3846C25.871 21.6941 25.6193 21.9459 25.3098 21.9459H15.8415C15.5988 21.9459 15.4021 22.1426 15.4021 22.3853C15.4021 22.628 15.5988 22.8248 15.8415 22.8248H17.8471L21.635 29.7709C21.712 29.9121 21.86 29.9999 22.0208 29.9999H24.9112C25.0662 29.9999 25.2099 29.9182 25.2891 29.7848C25.3682 29.6515 25.3712 29.4862 25.2971 29.3501L21.7387 22.8248H25.3098C26.1039 22.8248 26.7499 22.1787 26.7499 21.3846V20.8217H27.1961C28.6459 20.8217 29.8254 19.6429 29.8254 18.194V2.6277C29.8255 1.17879 28.646 0 27.1962 0V0ZM11.1503 22.8248L7.71682 29.1211H5.82922L9.26269 22.8248H11.1503ZM24.1711 29.1211H22.2818L18.8483 22.8248H20.7376L24.1711 29.1211ZM5.69697 19.9428V19.2164C5.69697 18.8149 6.02357 18.4884 6.425 18.4884H10.9215C11.3229 18.4884 11.6495 18.815 11.6495 19.2164V19.9428H5.69697ZM28.9466 18.194C28.9466 19.1583 28.1613 19.9428 27.1962 19.9428H26.3105H12.5284V19.2164C12.5284 19.1626 12.5256 19.1095 12.5204 19.0571H27.1961C27.673 19.0571 28.0609 18.6699 28.0609 18.194V2.6277C28.0609 2.1518 27.673 1.76461 27.1961 1.76461H15.8415C15.5988 1.76461 15.4021 1.96137 15.4021 2.20406C15.4021 2.44676 15.5988 2.64352 15.8415 2.64352H27.182V18.1782H12.1466C11.8516 17.8306 11.412 17.6094 10.9214 17.6094H6.42494C5.93439 17.6094 5.49482 17.8306 5.1998 18.1782H2.81832V2.64352H13.8052C14.0479 2.64352 14.2446 2.44676 14.2446 2.20406C14.2446 1.96137 14.0479 1.76461 13.8052 1.76461H2.80244C2.32654 1.76461 1.93941 2.1518 1.93941 2.6277V18.194C1.93941 18.6699 2.32654 19.0571 2.80244 19.0571H4.82603C4.82088 19.1095 4.81807 19.1626 4.81807 19.2164V19.9428H3.68973H2.80244C1.83816 19.9428 1.05371 19.1583 1.05371 18.194V2.6277C1.05371 1.66342 1.83822 0.878906 2.80244 0.878906H27.1961C28.1613 0.878906 28.9465 1.66342 28.9465 2.6277V18.194H28.9466Z" fill="#2ABF4B"/>
<path d="M8.84723 5.43992C8.84612 5.43693 8.84494 5.434 8.84377 5.43107C8.74985 5.1977 8.52631 5.04688 8.2743 5.04688C8.02229 5.04688 7.79875 5.1977 7.70483 5.43107C7.70377 5.43359 7.70278 5.43617 7.70184 5.43875L4.79646 13.0676C4.7101 13.2944 4.82395 13.5483 5.0507 13.6347C5.27758 13.721 5.53141 13.6072 5.61777 13.3804L6.23348 11.7638H10.2953L10.9052 13.3792C10.9717 13.5552 11.1388 13.6636 11.3164 13.6636C11.368 13.6636 11.4204 13.6544 11.4715 13.6351C11.6986 13.5494 11.8132 13.2958 11.7275 13.0688L8.84723 5.43992ZM6.56822 10.8849L8.27319 6.40789L9.9635 10.8849H6.56822Z" fill="#2ABF4B"/>
<path d="M23.0331 13.664C23.6877 13.664 24.2742 13.4503 24.7331 13.0426C24.826 12.9582 24.9101 12.8705 24.983 12.7823C25.1376 12.5952 25.1112 12.3181 24.9242 12.1636C24.7371 12.009 24.4601 12.0353 24.3054 12.2224C24.2589 12.2787 24.2039 12.3358 24.1455 12.3889C23.8497 12.6518 23.4754 12.785 23.0331 12.785C21.8647 12.785 20.9141 11.8344 20.9141 10.666C20.9141 9.4975 21.8647 8.54688 23.0331 8.54688C23.457 8.54688 23.8669 8.67203 24.2186 8.90887C24.4198 9.04445 24.693 8.99113 24.8285 8.78986C24.9641 8.58854 24.9108 8.31543 24.7095 8.1799C24.2122 7.84498 23.6325 7.66797 23.0331 7.66797C21.38 7.66797 20.0352 9.01287 20.0352 10.666C20.0352 12.3191 21.38 13.664 23.0331 13.664Z" fill="#2ABF4B"/>
<path d="M13.9341 8.54639V5.59473C13.9341 5.35203 13.7373 5.15527 13.4946 5.15527C13.2519 5.15527 13.0552 5.35203 13.0552 5.59473V13.2236C13.0552 13.4663 13.2519 13.663 13.4946 13.663C13.7373 13.663 13.9341 13.4663 13.9341 13.2236V12.7838C14.477 13.3267 15.2265 13.663 16.0531 13.663C17.7062 13.663 19.051 12.3181 19.051 10.6651C19.051 9.01197 17.7062 7.66707 16.0531 7.66707C15.2265 7.66713 14.477 8.0034 13.9341 8.54639ZM16.0531 8.54604C17.2215 8.54604 18.1721 9.49666 18.1721 10.6651C18.1721 11.8336 17.2215 12.7842 16.0531 12.7842C14.8847 12.7842 13.9341 11.8336 13.9341 10.6651C13.9341 9.49666 14.8846 8.54604 16.0531 8.54604Z" fill="#2ABF4B"/>
</g>
<defs>
<clipPath id="clip0">
<rect width="30" height="30" fill="white"/>
</clipPath>
</defs>
</svg>
