<svg width="30" height="30" viewBox="0 0 30 30" fill="none" xmlns="http://www.w3.org/2000/svg">
<path d="M15.0657 2.34404C15.0438 2.34387 15.0219 2.34375 15 2.34375C14.6764 2.34375 14.4141 2.60607 14.4141 2.92969C14.4141 3.2533 14.6764 3.51562 15 3.51562C15.0174 3.51562 15.0347 3.51574 15.052 3.51592C15.0543 3.51592 15.0567 3.51592 15.059 3.51592C15.3794 3.51592 15.641 3.25805 15.6447 2.93684C15.6485 2.61322 15.3893 2.34785 15.0657 2.34404Z" fill="#933EC5"/>
<path d="M25.0781 11.3672H22.5586V7.55859C22.5586 3.39076 19.1678 0 15 0C10.8322 0 7.44141 3.39076 7.44141 7.55859V11.3672H4.92188C3.95262 11.3672 3.16406 12.1557 3.16406 13.125V28.2422C3.16406 29.2114 3.95262 30 4.92188 30H25.0781C26.0474 30 26.8359 29.2114 26.8359 28.2422V13.125C26.8359 12.1557 26.0474 11.3672 25.0781 11.3672ZM25.6641 28.2422C25.6641 28.5653 25.4012 28.8281 25.0781 28.8281H4.92188C4.59879 28.8281 4.33594 28.5653 4.33594 28.2422V13.125C4.33594 12.8019 4.59879 12.5391 4.92188 12.5391H13.0664C13.39 12.5391 13.6523 12.2767 13.6523 11.9531C13.6523 11.6295 13.39 11.3672 13.0664 11.3672H10.957V7.55859C10.957 5.9318 11.9272 4.46965 13.4286 3.8335C13.7265 3.70729 13.8657 3.3634 13.7395 3.06539C13.6133 2.76744 13.2696 2.62816 12.9714 2.75449C11.0358 3.57457 9.78516 5.46029 9.78516 7.55859V11.3672H8.61328V7.55859C8.61328 4.03693 11.4783 1.17188 15 1.17188C18.5217 1.17188 21.3867 4.03693 21.3867 7.55859V11.3672H20.2148V7.55859C20.2148 5.50834 19.0037 3.63984 17.1294 2.79844C16.8342 2.66607 16.4875 2.79779 16.3549 3.09305C16.2223 3.3883 16.3542 3.73506 16.6494 3.86754C18.1035 4.52027 19.043 5.96906 19.043 7.55859V11.3672H17.1386C16.8151 11.3672 16.5527 11.6295 16.5527 11.9531C16.5527 12.2767 16.8151 12.5391 17.1386 12.5391H25.0781C25.4012 12.5391 25.6641 12.8019 25.6641 13.125V28.2422Z" fill="#933EC5"/>
<path d="M15.088 11.3672H15.0732C14.7497 11.3672 14.4873 11.6295 14.4873 11.9531C14.4873 12.2767 14.7497 12.5391 15.0732 12.5391H15.088C15.4116 12.5391 15.6739 12.2767 15.6739 11.9531C15.6739 11.6295 15.4116 11.3672 15.088 11.3672Z" fill="#933EC5"/>
<path d="M16.612 20.6684C17.1493 20.2045 17.4609 19.5328 17.4609 18.8086C17.4609 17.4516 16.357 16.3477 15 16.3477C13.643 16.3477 12.5391 17.4516 12.5391 18.8086C12.5391 19.5414 12.8714 20.2361 13.4262 20.6996L13.0378 24.372C13.0203 24.5371 13.0738 24.702 13.1849 24.8255C13.296 24.949 13.4544 25.0195 13.6205 25.0195H16.421C16.5871 25.0195 16.7454 24.949 16.8566 24.8255C16.9677 24.702 17.0212 24.5372 17.0037 24.372L16.612 20.6684ZM15.6829 19.9017C15.4933 20.0205 15.3879 20.2372 15.4114 20.4598L15.7697 23.8477H14.2716L14.6274 20.4836C14.6515 20.2558 14.5407 20.0349 14.3438 19.918C13.9475 19.6829 13.7109 19.2681 13.7109 18.8086C13.7109 18.0978 14.2892 17.5195 15 17.5195C15.7108 17.5195 16.2891 18.0978 16.2891 18.8086C16.2891 19.2551 16.0625 19.6638 15.6829 19.9017Z" fill="#933EC5"/>
</svg>
