<svg width="30" height="30" viewBox="0 0 30 30" fill="none" xmlns="http://www.w3.org/2000/svg">
<path d="M28.747 2.98828H24.7796C24.537 2.98828 24.3402 3.18512 24.3402 3.42773C24.3402 3.67035 24.537 3.86719 24.7796 3.86719H28.747C28.9533 3.86719 29.121 4.03496 29.121 4.24118V18.7028H0.878905V4.24118C0.878905 4.03496 1.04667 3.86719 1.2529 3.86719H23.0419C23.2848 3.86719 23.4814 3.67058 23.4814 3.42773C23.4814 3.18512 23.2848 2.98828 23.0419 2.98828H1.2529C0.562133 2.98828 0 3.55041 0 4.24118V21.0855C0 21.7765 0.562133 22.3384 1.2529 22.3384H17.2057L17.6999 26.0975H12.3003L12.6111 23.7339C12.643 23.4933 12.4733 23.2724 12.2328 23.2409C11.9925 23.209 11.7714 23.3786 11.7398 23.6192L11.4139 26.0975H9.35713C9.11452 26.0975 8.91768 26.2941 8.91768 26.537C8.91768 26.7796 9.11452 26.9764 9.35713 26.9764H20.643C20.8857 26.9764 21.0825 26.7796 21.0825 26.537C21.0825 26.2941 20.8857 26.0975 20.643 26.0975H18.5863L18.0922 22.3384H28.7473C29.438 22.3384 29.9999 21.7762 29.9999 21.0855V4.24118C29.9999 3.55041 29.4378 2.98828 28.747 2.98828V2.98828ZM28.747 21.4595H1.2529C1.04667 21.4595 0.878905 21.2917 0.878905 21.0855V19.582H29.121V21.0855C29.121 21.2917 28.9533 21.4595 28.747 21.4595Z" fill="url(#paint0_linear)"/>
<path d="M5.57568 11.9004C5.33284 11.9004 5.13623 12.0972 5.13623 12.3398V16.5137C5.13623 16.7563 5.33284 16.9532 5.57568 16.9532H8.26824C8.51109 16.9532 8.7077 16.7563 8.7077 16.5137V12.3398C8.7077 12.0972 8.51109 11.9004 8.26824 11.9004H5.57568ZM7.82879 16.0743H6.01513V12.7793H7.82879V16.0743Z" fill="url(#paint1_linear)"/>
<path d="M21.2925 14.4912V16.4804C21.2925 16.723 21.4891 16.9199 21.7319 16.9199H24.4245C24.6673 16.9199 24.8639 16.723 24.8639 16.4804V14.4912C24.8639 14.2484 24.6673 14.0518 24.4245 14.0518H21.7319C21.4891 14.0518 21.2925 14.2484 21.2925 14.4912ZM22.1714 14.9307H23.985V16.041H22.1714V14.9307Z" fill="url(#paint2_linear)"/>
<path d="M16.3462 10.1221C16.1036 10.1221 15.9067 10.3189 15.9067 10.5615V16.514C15.9067 16.7567 16.1036 16.9535 16.3462 16.9535H19.039C19.2816 16.9535 19.4784 16.7567 19.4784 16.514V10.5615C19.4784 10.3189 19.2816 10.1221 19.039 10.1221H16.3462ZM18.5995 16.0746H16.7856V11.001H18.5995V16.0746Z" fill="url(#paint3_linear)"/>
<path d="M10.9609 8.07715C10.7183 8.07715 10.5215 8.27376 10.5215 8.5166V16.5137C10.5215 16.7563 10.7183 16.9532 10.9609 16.9532H13.6537C13.8963 16.9532 14.0932 16.7563 14.0932 16.5137V8.5166C14.0932 8.27376 13.8963 8.07715 13.6537 8.07715H10.9609ZM13.2143 16.0743H11.4004V8.95605H13.2143V16.0743Z" fill="url(#paint4_linear)"/>
<defs>
<linearGradient id="paint0_linear" x1="24" y1="5.3871" x2="7.5919" y2="31.472" gradientUnits="userSpaceOnUse">
<stop stop-color="#00C0EF"/>
<stop offset="1" stop-color="#57A2E7"/>
</linearGradient>
<linearGradient id="paint1_linear" x1="7.9934" y1="12.4057" x2="4.18103" y2="15.8311" gradientUnits="userSpaceOnUse">
<stop stop-color="#00C0EF"/>
<stop offset="1" stop-color="#57A2E7"/>
</linearGradient>
<linearGradient id="paint2_linear" x1="24.1497" y1="14.3386" x2="22.1842" y2="17.4497" gradientUnits="userSpaceOnUse">
<stop stop-color="#00C0EF"/>
<stop offset="1" stop-color="#57A2E7"/>
</linearGradient>
<linearGradient id="paint3_linear" x1="18.7641" y1="10.8052" x2="13.9846" y2="13.9817" gradientUnits="userSpaceOnUse">
<stop stop-color="#00C0EF"/>
<stop offset="1" stop-color="#57A2E7"/>
</linearGradient>
<linearGradient id="paint4_linear" x1="13.3788" y1="8.96475" x2="7.91725" y2="11.7585" gradientUnits="userSpaceOnUse">
<stop stop-color="#00C0EF"/>
<stop offset="1" stop-color="#57A2E7"/>
</linearGradient>
</defs>
</svg>
