<svg width="30" height="30" viewBox="0 0 30 30" fill="none" xmlns="http://www.w3.org/2000/svg">
<g clip-path="url(#clip0)">
<path d="M4.34503 7.70737C5.65744 5.14 8.25822 3.54492 11.1328 3.54492C11.4564 3.54492 11.7187 3.28262 11.7187 2.95898C11.7187 2.63535 11.4564 2.37305 11.1328 2.37305C7.74759 2.37305 4.7696 4.30183 3.30156 7.17407C3.15439 7.46224 3.2686 7.81517 3.55676 7.96257C3.84469 8.10974 4.19786 7.99553 4.34503 7.70737Z" fill="#2ABF4B"/>
<path d="M3.36914 9.44727C3.36914 9.69011 3.1723 9.88672 2.92969 9.88672C2.68684 9.88672 2.49023 9.69011 2.49023 9.44727C2.49023 9.20465 2.68684 9.00781 2.92969 9.00781C3.1723 9.00781 3.36914 9.20465 3.36914 9.44727Z" fill="#2ABF4B"/>
<path d="M28.7535 23.8259C28.7336 23.809 28.7125 23.7934 28.6903 23.7795L25.8041 21.939C24.025 20.8045 21.8532 18.9986 20.3224 17.4889C21.6103 15.6274 22.2887 13.4562 22.2887 11.1772C22.2887 5.03014 17.2842 0.0292969 11.1326 0.0292969C4.99397 0.0292969 0 5.0235 0 11.1619C0 17.309 5.0045 22.3098 11.1562 22.3098C13.3987 22.3098 15.5415 21.6509 17.3856 20.3998C18.9143 21.9448 20.8331 24.1411 21.9905 25.955L23.7536 28.7183C23.7678 28.7403 23.7833 28.7613 23.8003 28.7815C25.2358 30.4782 27.8732 30.447 29.2639 28.6705C30.3774 27.2489 30.2435 25.0848 28.7535 23.8259ZM17.0993 19.1661C15.3694 20.4561 13.3143 21.138 11.1562 21.138C5.65087 21.138 1.17188 16.6628 1.17188 11.1619C1.17188 5.66964 5.64034 1.20117 11.1326 1.20117C16.6381 1.20117 21.1169 5.67628 21.1169 11.1772C21.1169 14.4747 19.5168 17.363 17.0993 19.1661ZM18.3268 19.6855C18.7841 19.2993 19.2098 18.8773 19.6005 18.4225C20.1785 18.9871 20.836 19.5857 21.5192 20.1691L20.0963 21.5918C19.5232 20.9393 18.9166 20.2858 18.3268 19.6855ZM28.3413 27.9481C27.4251 29.1186 25.6897 29.1644 24.7192 28.0529L22.9784 25.3247C22.4453 24.4892 21.7181 23.5149 20.8608 22.4849L22.4247 20.921C23.4029 21.7106 24.3459 22.3989 25.1743 22.9271L28.0254 24.7451C28.9531 25.5549 29.0968 26.9834 28.3413 27.9481Z" fill="#2ABF4B"/>
<path d="M16.992 15.322H16.406V5.36133C16.406 5.03769 16.1437 4.77539 15.8201 4.77539H12.3045C11.9808 4.77539 11.7185 5.03769 11.7185 5.36133V8.29102H8.78906C8.46543 8.29102 8.20313 8.55332 8.20313 8.87695V11.8066H5.27344C4.9498 11.8066 4.6875 12.0689 4.6875 12.3926V15.322H4.10156C3.77792 15.322 3.51562 15.5846 3.51562 15.908C3.51562 16.2316 3.77792 16.4939 4.10156 16.4939H16.992C17.3156 16.4939 17.5779 16.2316 17.5779 15.908C17.5779 15.5846 17.3156 15.322 16.992 15.322ZM8.20313 15.322H5.85938V12.9785H8.20313V15.322ZM11.7185 15.322H9.375C9.375 13.7343 9.375 10.3981 9.375 9.46289H11.7185V15.322ZM15.2341 15.322H12.8904C12.8904 14.187 12.8904 7.08206 12.8904 5.94727H15.2341V15.322Z" fill="#2ABF4B"/>
</g>
<defs>
<clipPath id="clip0">
<rect width="30" height="29.9414" fill="white"/>
</clipPath>
</defs>
</svg>
