<svg width="30" height="30" viewBox="0 0 30 30" fill="none" xmlns="http://www.w3.org/2000/svg">
<g clip-path="url(#clip0)">
<path d="M17.3608 17.4651H16.2024V11.2185C16.2024 10.4632 15.5879 9.84863 14.8326 9.84863H12.5733C11.8179 9.84863 11.2036 10.4632 11.2036 11.2185V17.4651H10.045C9.60922 17.4651 9.22928 17.7128 9.05326 18.1115C8.87748 18.5104 8.95095 18.9579 9.24484 19.2797L12.5943 22.9466C12.8781 23.2572 13.2821 23.4355 13.703 23.4355C14.1237 23.4355 14.5277 23.2572 14.8115 22.9466L18.161 19.2797C18.4548 18.9579 18.5283 18.5104 18.3525 18.1117C18.1765 17.7128 17.7968 17.4651 17.3608 17.4651ZM13.9463 22.1561C13.8609 22.2497 13.757 22.2634 13.7028 22.2634C13.6485 22.2634 13.5449 22.2497 13.4595 22.1563L10.2448 18.637H11.5884C12.0223 18.637 12.3755 18.2839 12.3755 17.8499V11.2185C12.3755 11.1093 12.4643 11.0205 12.5733 11.0205H14.8326C14.9417 11.0205 15.0305 11.1093 15.0305 11.2185V17.8501C15.0305 18.2839 15.3835 18.637 15.8174 18.637H17.1607L13.9463 22.1561Z" fill="#2E68B2"/>
<path d="M17.5535 24.293H9.85303C9.52939 24.293 9.26709 24.5555 9.26709 24.8789C9.26709 25.2025 9.52939 25.4648 9.85303 25.4648H17.5535C17.877 25.4648 18.1395 25.2025 18.1395 24.8789C18.1395 24.5555 17.877 24.293 17.5535 24.293Z" fill="#2E68B2"/>
<path d="M23.4937 12.4907C23.4791 12.4555 23.461 12.4214 23.44 12.3898C23.4189 12.3575 23.3942 12.3277 23.3672 12.3007C23.3404 12.2737 23.31 12.2492 23.2781 12.2275C23.2461 12.2064 23.212 12.1888 23.1767 12.1742C23.1417 12.1595 23.1049 12.1478 23.0673 12.1401C22.9918 12.125 22.9138 12.1254 22.8382 12.1401C22.8007 12.1478 22.7638 12.1595 22.7286 12.1742C22.6933 12.1888 22.6588 12.2064 22.6272 12.2275C22.5956 12.2492 22.5652 12.2737 22.5382 12.3007C22.5112 12.3277 22.4867 12.3575 22.4656 12.3898C22.4443 12.4214 22.4262 12.4555 22.4116 12.4907C22.3969 12.5264 22.3857 12.5633 22.3782 12.6008C22.3706 12.6383 22.3672 12.677 22.3672 12.715C22.3672 12.753 22.3706 12.7917 22.3782 12.8292C22.3857 12.8668 22.3969 12.9036 22.4116 12.9389C22.4262 12.9746 22.4443 13.0084 22.4656 13.0403C22.4867 13.0723 22.5112 13.1023 22.5382 13.1293C22.6471 13.2382 22.7984 13.301 22.9524 13.301C22.9911 13.301 23.0291 13.2973 23.0673 13.2897C23.1049 13.2822 23.1417 13.2705 23.1767 13.2559C23.212 13.2412 23.2461 13.2231 23.2781 13.2018C23.31 13.1808 23.3404 13.1563 23.3672 13.1293C23.4764 13.0203 23.5384 12.8693 23.5384 12.715C23.5384 12.677 23.5349 12.6383 23.5272 12.6008C23.5196 12.5633 23.5084 12.5264 23.4937 12.4907Z" fill="#2E68B2"/>
<path d="M22.1391 -0.0585938H9.27087C7.80854 -0.0585938 6.61881 1.13114 6.61881 2.59347V5.24163L4.51744 7.60553C4.49227 7.63368 4.468 7.66252 4.4442 7.69182C4.43504 7.70303 4.42635 7.71448 4.41742 7.72592C4.40346 7.74377 4.38927 7.76163 4.37576 7.77994C4.36409 7.7955 4.3531 7.81152 4.34166 7.82755C4.33182 7.84151 4.32175 7.85547 4.31213 7.86966C4.29909 7.88889 4.2865 7.90857 4.27391 7.92802C4.26704 7.93878 4.25995 7.94954 4.25331 7.96053C4.23912 7.98319 4.22539 8.00653 4.21188 8.02965C4.20754 8.0372 4.20319 8.04475 4.19907 8.05231C4.18419 8.07863 4.16977 8.10541 4.15581 8.13219C4.15375 8.13654 4.15146 8.14066 4.1494 8.14501C4.13406 8.17476 4.11942 8.20474 4.10545 8.23518C4.10477 8.23633 4.10431 8.2377 4.10362 8.23908C3.94936 8.57393 3.86719 8.9406 3.86719 9.31574V27.1196C3.86719 28.6755 5.13291 29.9415 6.68908 29.9415H20.717C22.2398 29.9415 23.4838 28.7291 23.5364 27.2189C24.9752 27.1914 26.1372 26.0134 26.1372 24.5685V3.93952C26.1372 1.73493 24.3437 -0.0585937 22.1391 -0.0585937V-0.0585938ZM8.71972 4.64196V7.67122C8.71972 7.83807 8.58399 7.9738 8.41714 7.9738H5.75798L7.6426 5.85389C7.6426 5.85366 7.6426 5.85366 7.64283 5.85366L8.63366 4.73901L8.71972 4.64196ZM24.9653 24.5685C24.9653 25.3666 24.3304 26.0191 23.5389 26.0475V15.0586C23.5389 14.735 23.2766 14.4727 22.953 14.4727C22.6294 14.4727 22.3671 14.735 22.3671 15.0586V27.1196C22.3671 28.0294 21.6269 28.7696 20.7173 28.7696H6.68908C5.77927 28.7696 5.03906 28.0294 5.03906 27.1196V9.31574C5.03906 9.25852 5.04387 9.20198 5.05074 9.14568H8.41714C9.23013 9.14568 9.8916 8.48421 9.8916 7.67122V3.72117C9.99162 3.69874 10.0944 3.68684 10.1985 3.68684H20.717C21.6269 3.68684 22.3671 4.42704 22.3671 5.33685V10.3711C22.3671 10.6948 22.6294 10.9571 22.953 10.9571C23.2766 10.9571 23.5389 10.6948 23.5389 10.3711V5.33685C23.5389 3.78091 22.273 2.51496 20.717 2.51496H10.1985C10.1067 2.51496 10.0154 2.51999 9.92501 2.52961C9.61808 2.56234 9.32145 2.65069 9.0484 2.7871C9.04656 2.78802 9.0445 2.78847 9.04267 2.78939C9.04038 2.79053 9.03832 2.79191 9.03626 2.79282C9.01567 2.80335 8.99552 2.81434 8.97515 2.82532C8.9573 2.83517 8.93945 2.84455 8.92182 2.85462C8.90374 2.86492 8.88589 2.87568 8.86804 2.88666C8.84812 2.89857 8.82844 2.91047 8.80898 2.92306C8.79342 2.9329 8.77786 2.9432 8.76252 2.95373C8.74124 2.96792 8.72018 2.98257 8.69935 2.99744C8.68562 3.00706 8.67211 3.01713 8.65861 3.0272C8.63664 3.04368 8.61489 3.06039 8.59338 3.07755C8.58125 3.08739 8.56889 3.09701 8.55699 3.10708C8.53478 3.12539 8.51327 3.14416 8.49175 3.16315C8.48054 3.173 8.46932 3.18261 8.45834 3.19268C8.43591 3.21328 8.41393 3.23456 8.39219 3.25608C8.38281 3.26523 8.37319 3.27416 8.36404 3.28355C8.3336 3.31444 8.30407 3.3458 8.27523 3.3783C8.275 3.37853 8.27477 3.37876 8.27454 3.37899L7.79069 3.92327V2.59347C7.79069 1.77727 8.45468 1.11328 9.27087 1.11328H22.1391C23.6975 1.11328 24.9653 2.38106 24.9653 3.93952V24.5685Z" fill="#2E68B2"/>
</g>
<defs>
<clipPath id="clip0">
<rect width="30" height="30" fill="white"/>
</clipPath>
</defs>
</svg>
