<svg width="30" height="30" viewBox="0 0 30 30" fill="none" xmlns="http://www.w3.org/2000/svg">
<g clip-path="url(#clip0)">
<path d="M26.9986 10.002H3.00098V25.0005H26.9986V10.002ZM25.9987 24.0006H4.00088V11.0019H25.9987V24.0006Z" fill="#933EC5"/>
<path d="M28.9986 26.0002V9.5018C28.9986 8.67345 28.3271 8.00195 27.4987 8.00195H2.50121C1.67286 8.00195 1.00136 8.67345 1.00136 9.5018V26.0002H0.00146484V27.5C0.00308968 28.8799 1.12135 29.9981 2.50121 29.9998H27.4987C28.8786 29.9981 29.9968 28.8799 29.9985 27.5V26.0002H28.9986ZM2.00126 9.5018C2.00126 9.22571 2.22512 9.00185 2.50121 9.00185H27.4987C27.7748 9.00185 27.9987 9.22571 27.9987 9.5018V26.0002H16.9998V26.5001C16.9998 26.7762 16.7759 27.0001 16.4998 27.0001H13.5001C13.224 27.0001 13.0002 26.7762 13.0002 26.5001V26.0002H2.00126V9.5018ZM28.9986 27.5C28.9986 28.3284 28.3271 28.9999 27.4987 28.9999H2.50121C1.67286 28.9999 1.00136 28.3284 1.00136 27.5V27.0001H12.0858C12.0918 27.0176 12.1013 27.0331 12.1083 27.05C12.1188 27.0765 12.1303 27.1 12.1423 27.1275C12.1687 27.1842 12.1986 27.2391 12.2317 27.292C12.2467 27.3155 12.2607 27.3395 12.2772 27.3625C12.3195 27.4221 12.3662 27.4786 12.4167 27.5315C12.4272 27.542 12.4352 27.554 12.4457 27.5645C12.5077 27.6254 12.5745 27.6811 12.6457 27.731C12.6657 27.7445 12.6872 27.756 12.7082 27.769C12.7626 27.8033 12.8192 27.834 12.8777 27.861C12.9052 27.8735 12.9327 27.8845 12.9607 27.8955C13.0197 27.9179 13.0799 27.9368 13.1412 27.952C13.1686 27.9585 13.1951 27.9665 13.2231 27.9715C13.3144 27.9897 13.4071 27.9993 13.5001 28H16.4998C16.5923 27.9993 16.6845 27.99 16.7753 27.972C16.8033 27.967 16.8298 27.959 16.8573 27.952C16.9186 27.9371 16.9788 27.9185 17.0378 27.896C17.0658 27.885 17.0933 27.874 17.1208 27.8615C17.1792 27.8345 17.2358 27.8037 17.2902 27.7695C17.3112 27.7565 17.3327 27.745 17.3527 27.7315C17.4239 27.6816 17.4908 27.6259 17.5527 27.565C17.5632 27.5545 17.5712 27.5425 17.5817 27.532C17.6323 27.4791 17.6789 27.4226 17.7212 27.363C17.7377 27.34 17.7517 27.316 17.7667 27.2925C17.7997 27.2395 17.8294 27.1846 17.8557 27.128C17.8677 27.102 17.8797 27.078 17.8907 27.05C17.8972 27.0331 17.9067 27.0176 17.9127 27.0001H28.9986V27.5Z" fill="#933EC5"/>
<path d="M10.7574 2.75971L10.7589 2.76121C13.0982 0.418945 16.8933 0.416446 19.2356 2.75571C19.2374 2.75752 19.2393 2.7594 19.2411 2.76121C19.4367 2.95682 19.7539 2.95682 19.9495 2.76121C20.1451 2.56561 20.1451 2.24839 19.9495 2.05278C17.221 -0.680757 12.793 -0.684757 10.0595 2.04378C10.0565 2.04678 10.0535 2.04978 10.0505 2.05278C9.85868 2.25139 9.86418 2.56792 10.0628 2.75971C10.2565 2.94682 10.5637 2.94682 10.7574 2.75971Z" fill="#933EC5"/>
<path d="M17.8264 4.67531C17.9202 4.76905 18.0473 4.8218 18.1799 4.8218C18.456 4.82173 18.6798 4.59788 18.6797 4.32172C18.6797 4.18917 18.627 4.06212 18.5334 3.96838C16.5876 2.01708 13.4284 2.01258 11.4771 3.95832C11.4738 3.9617 11.4704 3.96501 11.4671 3.96838C11.2685 4.16018 11.263 4.47671 11.4548 4.67531C11.6466 4.87392 11.9631 4.87942 12.1617 4.68762C12.1659 4.68356 12.17 4.6795 12.174 4.67531C13.7296 3.1144 16.256 3.11015 17.8169 4.66575C17.8201 4.66894 17.8233 4.67212 17.8264 4.67531Z" fill="#933EC5"/>
<path d="M12.8628 6.58426C13.0537 6.78374 13.3701 6.79074 13.5697 6.59988C13.5736 6.59607 13.5775 6.59226 13.5814 6.58832C14.3763 5.83346 15.6232 5.83346 16.4181 6.58832C16.6176 6.77918 16.9341 6.77218 17.1249 6.5727C17.3114 6.37784 17.3097 6.07019 17.121 5.87739C15.9471 4.71144 14.0523 4.71144 12.8784 5.87739C12.679 6.06825 12.672 6.38472 12.8628 6.58426Z" fill="#933EC5"/>
</g>
<defs>
<clipPath id="clip0">
<rect width="30" height="30" fill="white"/>
</clipPath>
</defs>
</svg>
