10
1 1 2 1
 22 15 34 1126 10 5 1
 15 22 28 943 6 2 0
2 3 1 3
 30 26 56 1604 11 5 2
 26 30 39 1378 8 3 0
3 3 2 2
 7 28 29 923 6 3 1
 28 7 43 1204 11 4 2
4 1 2 1
 24 6 47 1023 9 4 1
 6 24 17 1056 9 3 1
5 2 3 3
 15 18 29 923 9 3 1
 18 15 35 1204 11 4 2
6 2 1 2
 22 15 34 1126 10 5 1
 15 22 28 943 6 2 0
7 3 1 3
 30 26 56 1604 11 5 2
 26 30 39 1378 8 3 0
8 3 4 4
 7 28 29 923 6 3 1
 28 7 43 1204 11 4 2
9 1 2 1
 24 6 47 1023 9 4 1
 6 24 17 1056 9 3 1
10 2 3 3
 15 18 29 923 9 3 1
 18 15 35 1204 11 4 2
