{
  "project_info": {
    "project_number": "271719919618",
    "project_id": "dumap-341418",
    "storage_bucket": "dumap-341418.appspot.com"
  },
  "client": [
    {
      "client_info": {
        "mobilesdk_app_id": "1:271719919618:android:cc3e9a7820c8053b31f71b",
        "android_client_info": {
          "package_name": "com.example.dumap"
        }
      },
      "oauth_client": [
        {
          "client_id": "271719919618-hrdtncgm1oin0qgc9t3fob1u2p3fna0r.apps.googleusercontent.com",
          "client_type": 1,
          "android_info": {
            "package_name": "com.example.dumap",
            "certificate_hash": "8bf26269aa7ffe5719d1eee4f7778614cafb351d"
          }
        },
        {
          "client_id": "271719919618-db263844g52u3d60jc039stpgbbi30cn.apps.googleusercontent.com",
          "client_type": 3
        }
      ],
      "api_key": [
        {
          "current_key": "AIzaSyA7QPn0Ssb_QcotrdWuZkwQxCrMo5psEqI"
        }
      ],
      "services": {
        "appinvite_service": {
          "other_platform_oauth_client": [
            {
              "client_id": "271719919618-db263844g52u3d60jc039stpgbbi30cn.apps.googleusercontent.com",
              "client_type": 3
            }
          ]
        }
      }
    }
  ],
  "configuration_version": "1"
}