com\alvarado\webscraping\robots\IRobot.class
com\alvarado\webscraping\model\Producto.class
com\alvarado\webscraping\service\ComercioResource.class
com\alvarado\webscraping\robots\LinioRobot.class
com\alvarado\webscraping\utils\EMFactory.class
com\alvarado\webscraping\model\Comercio.class
com\alvarado\webscraping\model\AccessDB.class
com\alvarado\webscraping\robots\AmazonRobot.class
com\alvarado\webscraping\robots\LiverpoolRobot.class
com\alvarado\webscraping\utils\Config.class
com\alvarado\webscraping\model\Producto_.class
com\alvarado\webscraping\service\ProductoResource.class
com\alvarado\webscraping\service\ApplicationConfig.class
com\alvarado\webscraping\model\Comercio_.class
