<svg width="20" height="20" viewBox="0 0 20 20" fill="none" xmlns="http://www.w3.org/2000/svg">
<path d="M9.99978 2.72727V0L6.36341 3.63636L9.99978 7.27273V4.54545C12.9998 4.54545 15.4543 7 15.4543 10C15.4543 10.9091 15.1816 11.8182 14.818 12.5455L16.1816 13.9091C16.818 12.7273 17.2725 11.4545 17.2725 10C17.2725 6 13.9998 2.72727 9.99978 2.72727ZM9.99978 15.4545C6.99978 15.4545 4.54523 13 4.54523 10C4.54523 9.09091 4.81796 8.18182 5.1816 7.45455L3.81796 6.09091C3.1816 7.27273 2.72705 8.54545 2.72705 10C2.72705 14 5.99978 17.2727 9.99978 17.2727V20L13.6361 16.3636L9.99978 12.7273V15.4545Z" fill="#0C1116"/>
</svg>
