<svg width="38" height="34" viewBox="0 0 38 34" fill="none" xmlns="http://www.w3.org/2000/svg">
<path d="M18.2739 30.8692L16.8431 28.4842C16.1823 27.3834 15.8331 26.1225 15.8331 24.8392V22.75C15.8331 20.1125 14.0731 17.8817 11.6664 17.1625V15.6667C11.6664 14.7475 10.9189 14 9.99972 14C9.08054 14 8.33304 14.7475 8.33304 15.6667V17.1625C5.9264 17.8817 4.1664 20.1125 4.1664 22.75V24.8392C4.1664 26.1225 3.81722 27.3825 3.15722 28.4834L1.7264 30.8684C1.6489 30.9975 1.64722 31.1575 1.7214 31.2884C1.79558 31.4192 1.93308 31.5 2.08308 31.5H17.9164C18.0664 31.5 18.2047 31.4192 18.2789 31.2892C18.3531 31.1592 18.3506 30.9975 18.2739 30.8692Z" fill="white"/>
<path d="M7.37549 32.3333C7.84549 33.315 8.84049 34 9.99963 34C11.1588 34 12.1538 33.315 12.6238 32.3333H7.37549V32.3333Z" fill="white"/>
<circle cx="26" cy="12" r="12" fill="#EB4458"/>
<path d="M22.6414 16.5H29.2214V15.016H24.8394L27.0374 13.014C28.5354 11.642 29.2214 10.676 29.2214 9.57C29.2214 7.806 27.9894 6.574 25.9314 6.574C23.8874 6.574 22.6414 7.806 22.6414 9.71H24.4054C24.4054 8.716 24.9794 8.142 25.9314 8.142C26.8834 8.142 27.4574 8.716 27.4574 9.57C27.4574 10.228 27.0514 10.788 25.8054 11.978L22.6414 15.016V16.5Z" fill="white"/>
</svg>
