<svg width="57" height="14" viewBox="0 0 57 14" fill="none" xmlns="http://www.w3.org/2000/svg">
<path d="M0.224 13.5V0.899999H2.528V6.138H8.18V0.899999H10.484V13.5H8.18V8.01H2.528V13.5H0.224ZM17.163 13.716C16.299 13.716 15.519 13.518 14.823 13.122C14.139 12.726 13.593 12.18 13.185 11.484C12.789 10.776 12.591 9.96 12.591 9.036C12.591 8.112 12.795 7.302 13.203 6.606C13.611 5.898 14.157 5.346 14.841 4.95C15.537 4.554 16.317 4.356 17.181 4.356C18.033 4.356 18.801 4.554 19.485 4.95C20.181 5.346 20.727 5.898 21.123 6.606C21.531 7.302 21.735 8.112 21.735 9.036C21.735 9.96 21.531 10.776 21.123 11.484C20.727 12.18 20.181 12.726 19.485 13.122C18.789 13.518 18.015 13.716 17.163 13.716ZM17.163 11.718C17.763 11.718 18.285 11.496 18.729 11.052C19.173 10.596 19.395 9.924 19.395 9.036C19.395 8.148 19.173 7.482 18.729 7.038C18.285 6.582 17.769 6.354 17.181 6.354C16.569 6.354 16.041 6.582 15.597 7.038C15.165 7.482 14.949 8.148 14.949 9.036C14.949 9.924 15.165 10.596 15.597 11.052C16.041 11.496 16.563 11.718 17.163 11.718ZM27.485 13.716C26.693 13.716 25.997 13.59 25.397 13.338C24.797 13.074 24.317 12.714 23.957 12.258C23.597 11.802 23.381 11.274 23.309 10.674H25.631C25.703 11.022 25.895 11.322 26.207 11.574C26.531 11.814 26.945 11.934 27.449 11.934C27.953 11.934 28.319 11.832 28.547 11.628C28.787 11.424 28.907 11.19 28.907 10.926C28.907 10.542 28.739 10.284 28.403 10.152C28.067 10.008 27.599 9.87 26.999 9.738C26.615 9.654 26.225 9.552 25.829 9.432C25.433 9.312 25.067 9.162 24.731 8.982C24.407 8.79 24.143 8.55 23.939 8.262C23.735 7.962 23.633 7.596 23.633 7.164C23.633 6.372 23.945 5.706 24.569 5.166C25.205 4.626 26.093 4.356 27.233 4.356C28.289 4.356 29.129 4.602 29.753 5.094C30.389 5.586 30.767 6.264 30.887 7.128H28.709C28.577 6.468 28.079 6.138 27.215 6.138C26.783 6.138 26.447 6.222 26.207 6.39C25.979 6.558 25.865 6.768 25.865 7.02C25.865 7.284 26.039 7.494 26.387 7.65C26.735 7.806 27.197 7.95 27.773 8.082C28.397 8.226 28.967 8.388 29.483 8.568C30.011 8.736 30.431 8.994 30.743 9.342C31.055 9.678 31.211 10.164 31.211 10.8C31.223 11.352 31.079 11.85 30.779 12.294C30.479 12.738 30.047 13.086 29.483 13.338C28.919 13.59 28.253 13.716 27.485 13.716ZM36.9488 13.5C36.0128 13.5 35.2628 13.272 34.6988 12.816C34.1348 12.36 33.8528 11.55 33.8528 10.386V6.498H32.3228V4.572H33.8528L34.1228 2.178H36.1568V4.572H38.5688V6.498H36.1568V10.404C36.1568 10.836 36.2468 11.136 36.4268 11.304C36.6188 11.46 36.9428 11.538 37.3988 11.538H38.5148V13.5H36.9488ZM44.6564 13.716C43.7564 13.716 42.9584 13.524 42.2624 13.14C41.5664 12.756 41.0204 12.216 40.6244 11.52C40.2284 10.824 40.0304 10.02 40.0304 9.108C40.0304 8.184 40.2224 7.362 40.6064 6.642C41.0024 5.922 41.5424 5.364 42.2264 4.968C42.9224 4.56 43.7384 4.356 44.6744 4.356C45.5504 4.356 46.3244 4.548 46.9964 4.932C47.6684 5.316 48.1904 5.844 48.5624 6.516C48.9464 7.176 49.1384 7.914 49.1384 8.73C49.1384 8.862 49.1324 9 49.1204 9.144C49.1204 9.288 49.1144 9.438 49.1024 9.594H42.3164C42.3644 10.29 42.6044 10.836 43.0364 11.232C43.4804 11.628 44.0144 11.826 44.6384 11.826C45.1064 11.826 45.4964 11.724 45.8084 11.52C46.1324 11.304 46.3724 11.028 46.5284 10.692H48.8684C48.7004 11.256 48.4184 11.772 48.0224 12.24C47.6384 12.696 47.1584 13.056 46.5824 13.32C46.0184 13.584 45.3764 13.716 44.6564 13.716ZM44.6744 6.228C44.1104 6.228 43.6124 6.39 43.1804 6.714C42.7484 7.026 42.4724 7.506 42.3524 8.154H46.7984C46.7624 7.566 46.5464 7.098 46.1504 6.75C45.7544 6.402 45.2624 6.228 44.6744 6.228ZM51.0763 13.5V4.572H53.1283L53.3443 6.246C53.6683 5.67 54.1063 5.214 54.6582 4.878C55.2223 4.53 55.8823 4.356 56.6383 4.356V6.786H55.9903C55.4863 6.786 55.0363 6.864 54.6403 7.02C54.2443 7.176 53.9323 7.446 53.7043 7.83C53.4883 8.214 53.3803 8.748 53.3803 9.432V13.5H51.0763Z" fill="white"/>
</svg>
