{

	"productID": "acquadigio",
	"description": "Wonderful citrus, aquatic, spicy, musk smell that is well done by perfumer Alberto Morillas.",
	"price": 250,
	"stocks": 6,
	"isActive": true,
	"SKU": 2019001
}