name,code
NONE,0
STANDARD_FAKTURA,1
EDUCATIONAL_FAKTURA,2
N3,3
N4,4
N5,5
N6,6
N7,7
N8,8
N9,9
N10,10
N11,11
N12,12
N13,13
N14,14
N15,15
N16,16
N17,17
N18,18
N19,19
N20,20
N21,21
AIRPLANE_TICKET,22
N23,23