{
   "title":"DevOps Radar",
   "quadrants":[
      "Techniques",
      "Software Tools",
      "Platforms",
      "Frameworks & Practices"
   ],
   "rings":[
      "Experimental",
      "Advanced",
      "Basic",
      "Dont's"
   ],
   "blips":[
      {
         "name":"Compliance as Code",
         "quadrant":"Techniques",
         "ring":"Basic",
         "isNew":false,
         "description":"<p>Blog: <a target=\"_blank\" rel=\"noopener noreferrer\" href=\"https://www.contino.io/insights/compliance-as-code\"> Compliance as Code</a></p>"
      },
      {
         "name":"Configuration as Code",
         "quadrant":"Techniques",
         "ring":"Basic",
         "isNew":false,
         "description":"<p>Blog: <a href=https://www.cloudbees.com/blog/configuration-as-code-everything-need-know> Configuration as Code</a></p>"
      },
      {
         "name":"Pair Programming",
         "quadrant":"Techniques",
         "ring":"Basic",
         "isNew":false,
         "description":"<p>Wiki: <a href=https://en.wikipedia.org/wiki/Pair_programming> Pair Programming</a><br>Blog: <a href=https://www.codementor.io/pair-programming> Pair Programming</a></p>"
      },
      {
         "name":"Infrastructure as Code",
         "quadrant":"Techniques",
         "ring":"Basic",
         "isNew":false,
         "description":"<p>Wiki: <a href=https://en.wikipedia.org/wiki/Infrastructure_as_code> Infrastructure as Code</a><br>Blog: <a href=https://stackoverflow.blog/2021/03/08/infrastructure-as-code-create-and-configure-infrastructure-elements-in-seconds/> Infrastructure as Code</a></p>"
      },
      {
         "name":"Unit Testing",
         "quadrant":"Techniques",
         "ring":"Basic",
         "isNew":false,
         "description":"<p>Wiki: <a href=https://en.wikipedia.org/wiki/Unit_testing> Unit Testing</a><br>Blog: <a href=https://smartbear.com/learn/automated-testing/what-is-unit-testing/> Unit Testing</a></p>"
      },
      {
         "name":"Blue Green Deployment",
         "quadrant":"Techniques",
         "ring":"Basic",
         "isNew":false,
         "description":"<p>Wiki: <a href=https://en.wikipedia.org/wiki/Blue-green_deployment> Blue Green Deployment</a><br>Blog: <a href=https://www.opsmx.com/blog/blue-green-deployment/> Blue Green Deployment</a></p>"
      },
      {
         "name":"Feature Toggles",
         "quadrant":"Techniques",
         "ring":"Basic",
         "isNew":false,
         "description":"<p>Wiki: <a href=https://en.wikipedia.org/wiki/Feature_toggle> Feature Toggles</a><br>Blog: <a href=https://www.split.io/glossary/feature-toggles/> Feature Toggles</a></p>"
      },
      {
         "name":"Test Driven Development (TDD)",
         "quadrant":"Techniques",
         "ring":"Basic",
         "isNew":false,
         "description":"<p>Wiki: <a href=https://en.wikipedia.org/wiki/Test-driven_development> Test Driven Development (TDD)</a><br>Blog: <a href=https://www.techopedia.com/definition/25850/test-driven-development-tdd> Test Driven Development (TDD)</a></p>"
      },
      {
         "name":"MOB Programming",
         "quadrant":"Techniques",
         "ring":"Basic",
         "isNew":false,
         "description":"<p>Wiki: <a href=https://en.wikipedia.org/wiki/Mob_programming> MOB Programming</a><br>Blog: <a href=https://www.agilealliance.org/glossary/mob-programming/> MOB Programming</a></p>"
      },
      {
         "name":"Continuous Exploration",
         "quadrant":"Techniques",
         "ring":"Basic",
         "isNew":false,
         "description":"<p>Blog: <a href=https://www.scaledagileframework.com/continuous-exploration/> Continuous Exploration</a></p>"
      },
      {
         "name":"Continuous Integration",
         "quadrant":"Techniques",
         "ring":"Basic",
         "isNew":false,
         "description":"<p>Wiki: <a href=https://en.wikipedia.org/wiki/Continuous_integration> Continuous Integration</a><br>Blog: <a href=https://www.thoughtworks.com/de/continuous-integration> Continuous Integration</a></p>"
      },
      {
         "name":"Post Mortem Analysis",
         "quadrant":"Techniques",
         "ring":"Advanced",
         "isNew":false,
         "description":"<p>Wiki: <a href=https://de.wikipedia.org/wiki/Post-mortem-Analyse> Post Mortem Analysis</a><br>Blog: <a href=https://www.smartsheet.com/content/business-post-mortem> Post Mortem Analysis</a></p>"
      },
      {
         "name":"Canary Release",
         "quadrant":"Techniques",
         "ring":"Advanced",
         "isNew":false,
         "description":"<p>Wiki: <a href=https://en.wikipedia.org/wiki/Feature_toggle#Canary_release> Canary Release</a><br>Blog: <a href=https://www.suse.com/c/canary-releases-rancher-continuous-delivery-src/> Canary Release</a></p>"
      },
      {
         "name":"Security Testing",
         "quadrant":"Techniques",
         "ring":"Advanced",
         "isNew":false,
         "description":"<p>Wiki: <a href=https://en.wikipedia.org/wiki/Security_testing> Security Testing</a><br>Blog: <a href=https://www.javatpoint.com/security-testing> Security Testing</a></p>"
      },
      {
         "name":"Penetration Testing",
         "quadrant":"Techniques",
         "ring":"Advanced",
         "isNew":false,
         "description":"<p>Wiki: <a href=https://en.wikipedia.org/wiki/Penetration_test> Penetration Testing</a><br>Blog: <a href=https://www.imperva.com/learn/application-security/penetration-testing/> Penetration Testing</a></p>"
      },
      {
         "name":"Performance Testing",
         "quadrant":"Techniques",
         "ring":"Advanced",
         "isNew":false,
         "description":"<p>Wiki: <a href=https://en.wikipedia.org/wiki/Software_performance_testing> Performance Testing</a><br>Blog: <a href=https://www.microfocus.com/en-us/what-is/performance-testing> Performance Testing</a></p>"
      },
      {
         "name":"Regression Testing",
         "quadrant":"Techniques",
         "ring":"Advanced",
         "isNew":false,
         "description":"<p>Wiki: <a href=https://en.wikipedia.org/wiki/Regression_testing> Regression Testing</a><br>Blog: <a href=https://smartbear.com/learn/automated-testing/what-is-regression-testing/> Regression Testing</a></p>"
      },
      {
         "name":"Integration Testing",
         "quadrant":"Techniques",
         "ring":"Advanced",
         "isNew":false,
         "description":"<p>Wiki: <a href=https://en.wikipedia.org/wiki/Integration_testing> Integration Testing</a><br>Blog: <a href=https://www.fullstackpython.com/integration-testing.html> Integration Testing</a></p>"
      },
      {
         "name":"Functional Testing",
         "quadrant":"Techniques",
         "ring":"Advanced",
         "isNew":false,
         "description":"<p>Wiki: <a href=https://en.wikipedia.org/wiki/Functional_testing> Functional Testing</a><br>Blog: <a href=https://smartbear.com/learn/automated-testing/introduction-to-functional-testing/> Functional Testing</a></p>"
      },
      {
         "name":"Continuous Deployment",
         "quadrant":"Techniques",
         "ring":"Advanced",
         "isNew":false,
         "description":"<p>Wiki: <a href=https://en.wikipedia.org/wiki/Continuous_deployment> Continuous Deployment</a><br>Blog: <a href=https://www.atlassian.com/continuous-delivery/continuous-deployment> Continuous Deployment</a></p>"
      },
      {
         "name":"Release on Demand",
         "quadrant":"Techniques",
         "ring":"Advanced",
         "isNew":false,
         "description":"<p>Blog: <a href=https://www.scaledagileframework.com/release-on-demand/> Release on Demand</a></p>"
      },
      {
         "name":"Self Healing Infrastructure",
         "quadrant":"Techniques",
         "ring":"Advanced",
         "isNew":false,
         "description":"<p>Blog: <a href=https://hackernoon.com/how-to-create-a-self-healing-it-infrastructure-d171bfe479fc> Self Healing Infrastructure</a></p>"
      },
      {
         "name":"Behaviour Driven Development",
         "quadrant":"Techniques",
         "ring":"Advanced",
         "isNew":false,
         "description":"<p>Wiki: <a href=https://en.wikipedia.org/wiki/Behavior-driven_development> Behaviour Driven Development</a><br>Blog: <a href=https://cucumber.io/docs/bdd/> Behaviour Driven Development</a></p>"
      },
      {
         "name":"Contract Driven Testing",
         "quadrant":"Techniques",
         "ring":"Advanced",
         "isNew":false,
         "description":"<p>Blog: <a href=https://www.ibm.com/garage/method/practices/code/contract-driven-testing/> Contract Driven Testing</a></p>"
      },
      {
         "name":"Low Code",
         "quadrant":"Techniques",
         "ring":"Experimental",
         "isNew":false,
         "description":"<p>Wiki: <a href=https://en.wikipedia.org/wiki/Low-code_development_platform> Low Code</a><br>Blog: <a href=https://www.thinkwisesoftware.com/en/low-code/?utm_term=low%20code&utm_campaign=DE+%7C+Thinkwise+%7C+Search+%7C+Non-brand+doorlopend&utm_source=adwords&utm_medium=ppc&hsa_acc=6202902242&hsa_cam=12605538677&hsa_grp=122397213800&hsa_ad=508798350201&hsa_src=g&hsa_tgt=kwd-49998014847&hsa_kw=low%20code&hsa_mt=e&hsa_net=adwords&hsa_ver=3&gclid=EAIaIQobChMI_arBlZOw8QIVTQOLCh1JqwpEEAAYASAAEgI4YPD_BwE> Low Code</a></p>"
      },
      {
         "name":"Rancher",
         "quadrant":"Platforms",
         "ring":"Basic",
         "isNew":false,
         "description":"<p>Home: <a href=https://rancher.com/> Rancher</a></p>"
      },
      {
         "name":"AWS",
         "quadrant":"Platforms",
         "ring":"Basic",
         "isNew":false,
         "description":"<p>Home: <a href=https://aws.amazon.com/> AWS</a></p>"
      },
      {
         "name":"Azure Cloud",
         "quadrant":"Platforms",
         "ring":"Basic",
         "isNew":false,
         "description":"<p>Home: <a href=https://azure.microsoft.com/en-us/> Azure Cloud</a></p>"
      },
      {
         "name":"Gitlab",
         "quadrant":"Platforms",
         "ring":"Basic",
         "isNew":false,
         "description":"<p>Home: <a href=https://gitlab.com/> Gitlab</a></p>"
      },
      {
         "name":"Github",
         "quadrant":"Platforms",
         "ring":"Basic",
         "isNew":false,
         "description":"<p>Home: <a href=https://github.com/> Github</a></p>"
      },
      {
         "name":"Bitbucket",
         "quadrant":"Platforms",
         "ring":"Basic",
         "isNew":false,
         "description":"<p>Home: <a href=https://bitbucket.org/> Bitbucket</a></p>"
      },
      {
         "name":"OpenShift",
         "quadrant":"Platforms",
         "ring":"Basic",
         "isNew":false,
         "description":"<p>Home: <a href=https://www.openshift.com/> OpenShift</a></p>"
      },
      {
         "name":"SonarCloud",
         "quadrant":"Platforms",
         "ring":"Advanced",
         "isNew":false,
         "description":"<p>Home: <a href=https://sonarcloud.io/> SonarCloud</a></p>"
      },
      {
         "name":"VMware vRealize Cloud Universal",
         "quadrant":"Platforms",
         "ring":"Advanced",
         "isNew":false,
         "description":"<p>Home: <a href=https://www.vmware.com/de/products/vrealize-cloud-universal.html> VMware vRealize Cloud Universal</a></p>"
      },
      {
         "name":"VMware vCenter Server",
         "quadrant":"Platforms",
         "ring":"Advanced",
         "isNew":false,
         "description":"<p>Home: <a href=https://www.vmware.com/de/products/vcenter-server.html> VMware vCenter Server</a></p>"
      },
      {
         "name":"Heroku",
         "quadrant":"Platforms",
         "ring":"Advanced",
         "isNew":false,
         "description":"<p>Home: <a href=https://www.heroku.com/> Heroku</a></p>"
      },
      {
         "name":"KETO Software",
         "quadrant":"Platforms",
         "ring":"Experimental",
         "isNew":false,
         "description":"<p>Home: <a href=https://ketosoftware.com/> KETO Software</a></p>"
      },
      {
         "name":"NixOS",
         "quadrant":"Platforms",
         "ring":"Experimental",
         "isNew":false,
         "description":"<p>Home: <a href=https://nixos.org/> NixOS</a></p>"
      },
      {
         "name":"Alibaba Cloud",
         "quadrant":"Platforms",
         "ring":"Experimental",
         "isNew":false,
         "description":"<p>Home: <a href=https://eu.alibabacloud.com/en> Alibaba Cloud</a></p>"
      },
      {
         "name":"Backstage",
         "quadrant":"Platforms",
         "ring":"Experimental",
         "isNew":false,
         "description":"<p>Home: <a href=https://backstage.io> Backstage</a></p>"
      },
      {
         "name":"TeamCity",
         "quadrant":"Platforms",
         "ring":"Experimental",
         "isNew":false,
         "description":"<p>Home: <a href=https://www.jetbrains.com/de-de/teamcity/> TeamCity</a></p>"
      },
      {
         "name":"Atomist",
         "quadrant":"Platforms",
         "ring":"Experimental",
         "isNew":false,
         "description":"<p>Home: <a href=https://atomist.com/> Atomist</a></p>"
      },
      {
         "name":"Mesos",
         "quadrant":"Platforms",
         "ring":"Dont's",
         "isNew":false,
         "description":"<p>Home: <a href=http://mesos.apache.org/> Mesos</a></p>"
      },
      {
         "name":"IBM Mainframe",
         "quadrant":"Platforms",
         "ring":"Dont's",
         "isNew":false,
         "description":"<p>Home: <a href=https://www.ibm.com/de-de/it-infrastructure/servers/mainframes> IBM Mainframe</a></p>"
      },
      {
         "name":"Docker Swarm",
         "quadrant":"Platforms",
         "ring":"Dont's",
         "isNew":false,
         "description":"<p>Home: <a href=https://docs.docker.com/engine/swarm/> Docker Swarm</a></p>"
      },
      {
         "name":"kubeadm",
         "quadrant":"Software Tools",
         "ring":"Basic",
         "isNew":false,
         "description":"<p>Home: <a href=https://kubernetes.io/docs/reference/setup-tools/kubeadm/> kubeadm</a></p>"
      },
      {
         "name":"Kustomize",
         "quadrant":"Software Tools",
         "ring":"Basic",
         "isNew":false,
         "description":"<p>Home: <a href=https://kustomize.io/> Kustomize</a></p>"
      },
      {
         "name":"Elastic Stack",
         "quadrant":"Software Tools",
         "ring":"Basic",
         "isNew":false,
         "description":"<p>Home: <a href=https://www.elastic.co/de/cloud/elasticsearch-service/signup?ultron=B-Stack-Trials-EMEA-C-DE-Exact&gambit=Elasticsearch-ELK&blade=adwords-s&hulk=cpc&Device=c&thor=elk%20stack%20software&gclid=EAIaIQobChMIm8TnmdGu8QIVzIODBx1EoQHkEAAYASAAEgJ5dPD_BwE> Elastic Stack</a></p>"
      },
      {
         "name":"Azure DevOps",
         "quadrant":"Software Tools",
         "ring":"Basic",
         "isNew":false,
         "description":"<p>Home: <a href=https://azure.microsoft.com/de-de/services/devops/> Azure DevOps</a></p>"
      },
      {
         "name":"Veracode",
         "quadrant":"Software Tools",
         "ring":"Basic",
         "isNew":false,
         "description":"<p>Home: <a href=https://www.veracode.com/> Veracode</a></p>"
      },
      {
         "name":"Vagrant",
         "quadrant":"Software Tools",
         "ring":"Basic",
         "isNew":false,
         "description":"<p>Home: <a href=https://www.vagrantup.com/> Vagrant</a></p>"
      },
      {
         "name":"Jenkins",
         "quadrant":"Software Tools",
         "ring":"Basic",
         "isNew":false,
         "description":"<p>Home: <a href=https://www.jenkins.io/> Jenkins</a></p>"
      },
      {
         "name":"Chef",
         "quadrant":"Software Tools",
         "ring":"Basic",
         "isNew":false,
         "description":"<p>Home: <a href=https://www.chef.io/> Chef</a></p>"
      },
      {
         "name":"Prometheus",
         "quadrant":"Software Tools",
         "ring":"Basic",
         "isNew":false,
         "description":"<p>Home: <a href=https://prometheus.io/> Prometheus</a></p>"
      },
      {
         "name":"Grafana",
         "quadrant":"Software Tools",
         "ring":"Basic",
         "isNew":false,
         "description":"<p>Home: <a href=https://prometheus.io/docs/visualization/grafana/> Grafana</a></p>"
      },
      {
         "name":"Artifactory",
         "quadrant":"Software Tools",
         "ring":"Basic",
         "isNew":false,
         "description":"<p>Home: <a href=https://jfrog.com/artifactory/> Artifactory</a></p>"
      },
      {
         "name":"Nexus",
         "quadrant":"Software Tools",
         "ring":"Basic",
         "isNew":false,
         "description":"<p>Home: <a href=https://www.sonatype.com/products/repository-pro> Nexus</a></p>"
      },
      {
         "name":"Puppet",
         "quadrant":"Software Tools",
         "ring":"Basic",
         "isNew":false,
         "description":"<p>Home: <a href=https://puppet.com/> Puppet</a></p>"
      },
      {
         "name":"HashiCorp Vault",
         "quadrant":"Software Tools",
         "ring":"Basic",
         "isNew":false,
         "description":"<p>Home: <a href=https://www.vaultproject.io/> HashiCorp Vault</a></p>"
      },
      {
         "name":"Terraform",
         "quadrant":"Software Tools",
         "ring":"Basic",
         "isNew":false,
         "description":"<p>Home: <a href=https://www.terraform.io/> Terraform</a></p>"
      },
      {
         "name":"Docker",
         "quadrant":"Software Tools",
         "ring":"Basic",
         "isNew":false,
         "description":"<p>Home: <a href=https://www.docker.com/> Docker</a></p>"
      },
      {
         "name":"SonarQube",
         "quadrant":"Software Tools",
         "ring":"Basic",
         "isNew":false,
         "description":"<p>Home: <a href=https://www.sonarqube.org/> SonarQube</a></p>"
      },
      {
         "name":"Kubernetes",
         "quadrant":"Software Tools",
         "ring":"Basic",
         "isNew":false,
         "description":"<p>Home: <a href=https://kubernetes.io/> Kubernetes</a></p>"
      },
      {
         "name":"Ansible",
         "quadrant":"Software Tools",
         "ring":"Basic",
         "isNew":false,
         "description":"<p>Home: <a href=https://www.ansible.com/> Ansible</a><br>Docu: <a href=https://docs.ansible.com/ansible/latest/> Ansible</a></p>"
      },
      {
         "name":"Git",
         "quadrant":"Software Tools",
         "ring":"Basic",
         "isNew":false,
         "description":"<p>Home: <a href=https://git-scm.com/> Git</a></p>"
      },
      {
         "name":"Mercurial",
         "quadrant":"Software Tools",
         "ring":"Basic",
         "isNew":false,
         "description":"<p>Home: <a href=https://www.mercurial-scm.org/> Mercurial</a></p>"
      },
      {
         "name":"Cucumber",
         "quadrant":"Software Tools",
         "ring":"Advanced",
         "isNew":false,
         "description":"<p>Home: <a href=https://cucumber.io/> Cucumber</a></p>"
      },
      {
         "name":"Kafka",
         "quadrant":"Software Tools",
         "ring":"Advanced",
         "isNew":false,
         "description":"<p>Home: <a href=https://kafka.apache.org/> Kafka</a></p>"
      },
      {
         "name":"Helm",
         "quadrant":"Software Tools",
         "ring":"Advanced",
         "isNew":false,
         "description":"<p>Home: <a href=https://helm.sh/> Helm</a></p>"
      },
      {
         "name":"Istio",
         "quadrant":"Software Tools",
         "ring":"Advanced",
         "isNew":false,
         "description":"<p>Home: <a href=https://istio.io/> Istio</a></p>"
      },
      {
         "name":"Consul",
         "quadrant":"Software Tools",
         "ring":"Advanced",
         "isNew":false,
         "description":"<p>Home: <a href=https://www.consul.io/> Consul</a></p>"
      },
      {
         "name":"Anchore",
         "quadrant":"Software Tools",
         "ring":"Advanced",
         "isNew":false,
         "description":"<p>Home: <a href=https://anchore.com/> Anchore</a></p>"
      },
      {
         "name":"Datadog",
         "quadrant":"Software Tools",
         "ring":"Advanced",
         "isNew":false,
         "description":"<p>Home: <a href=https://www.datadoghq.com/> Datadog</a></p>"
      },
      {
         "name":"Nexus IQ",
         "quadrant":"Software Tools",
         "ring":"Advanced",
         "isNew":false,
         "description":"<p>Home: <a href=https://help.sonatype.com/iqserver> Nexus IQ</a></p>"
      },
      {
         "name":"Buildah",
         "quadrant":"Software Tools",
         "ring":"Experimental",
         "isNew":false,
         "description":"<p>Home: <a href=https://buildah.io/> Buildah</a></p>"
      },
      {
         "name":"Waypoint",
         "quadrant":"Software Tools",
         "ring":"Experimental",
         "isNew":false,
         "description":"<p>Home: <a href=https://www.waypointproject.io/> Waypoint</a></p>"
      },
      {
         "name":"FreeBSD jail",
         "quadrant":"Software Tools",
         "ring":"Experimental",
         "isNew":false,
         "description":"<p>Wiki: <a href=https://en.wikipedia.org/wiki/FreeBSD_jail> FreeBSD jail</a></p>"
      },
      {
         "name":"Podman",
         "quadrant":"Software Tools",
         "ring":"Experimental",
         "isNew":false,
         "description":"<p>Home: <a href=https://podman.io/> Podman</a></p>"
      },
      {
         "name":"SubVersion",
         "quadrant":"Software Tools",
         "ring":"Dont's",
         "isNew":false,
         "description":"<p>Home: <a href=https://subversion.apache.org/> SubVersion</a></p>"
      },
      {
         "name":"Concurrent Versions System",
         "quadrant":"Software Tools",
         "ring":"Dont's",
         "isNew":false,
         "description":"<p>Wiki: <a href=https://en.wikipedia.org/wiki/Concurrent_Versions_System> Concurrent Versions System</a></p>"
      },
      {
         "name":"Rational ClearCase",
         "quadrant":"Software Tools",
         "ring":"Dont's",
         "isNew":false,
         "description":"<p>Home: <a href=https://www.ibm.com/products/rational-clearcase> Rational ClearCase</a></p>"
      },
      {
         "name":"ScrumBan",
         "quadrant":"Frameworks & Practices",
         "ring":"Basic",
         "isNew":false,
         "description":"<p>Wiki: <a href=https://en.wikipedia.org/wiki/Scrumban> ScrumBan</a></p>"
      },
      {
         "name":"Change Management",
         "quadrant":"Frameworks & Practices",
         "ring":"Basic",
         "isNew":false,
         "description":"<p>Wiki: <a href=https://en.wikipedia.org/wiki/Change_management_(ITSM)> Change Management</a></p>"
      },
      {
         "name":"CALMR",
         "quadrant":"Frameworks & Practices",
         "ring":"Basic",
         "isNew":false,
         "description":"<p>Home: <a href=https://www.scaledagileframework.com/calmr/> CALMR</a></p>"
      },
      {
         "name":"Kanban",
         "quadrant":"Frameworks & Practices",
         "ring":"Basic",
         "isNew":false,
         "description":"<p>Wiki: <a href=https://en.wikipedia.org/wiki/Kanban> Kanban</a></p>"
      },
      {
         "name":"Scrum",
         "quadrant":"Frameworks & Practices",
         "ring":"Basic",
         "isNew":false,
         "description":"<p>Wiki: <a href=https://en.wikipedia.org/wiki/Scrum_(software_development)> Scrum</a></p>"
      },
      {
         "name":"Shift Left",
         "quadrant":"Frameworks & Practices",
         "ring":"Basic",
         "isNew":false,
         "description":"<p>Blog: <a href=https://devops.com/devops-shift-left-avoid-failure/> Shift Left</a></p>"
      },
      {
         "name":"SAFe",
         "quadrant":"Frameworks & Practices",
         "ring":"Basic",
         "isNew":false,
         "description":"<p>Wiki: <a href=https://en.wikipedia.org/wiki/Scaled_agile_framework> SAFe</a></p>"
      },
      {
         "name":"GitOps",
         "quadrant":"Frameworks & Practices",
         "ring":"Advanced",
         "isNew":false,
         "description":"<p>Blog: <a href=https://www.weave.works/blog/what-is-gitops-really> GitOps</a></p>"
      },
      {
         "name":"Lean 6 Sigma",
         "quadrant":"Frameworks & Practices",
         "ring":"Advanced",
         "isNew":false,
         "description":"<p>Wiki: <a href=https://en.wikipedia.org/wiki/Six_Sigma> Lean 6 Sigma</a></p>"
      },
      {
         "name":"Generative Culture",
         "quadrant":"Frameworks & Practices",
         "ring":"Advanced",
         "isNew":false,
         "description":"<p>Blog: <a href=https://www.forbes.com/sites/forbestechcouncil/2021/05/11/a-generative-culture-is-a-clean-code-culture/?sh=4df4faad44f0> Generative Culture</a></p>"
      },
      {
         "name":"SRE",
         "quadrant":"Frameworks & Practices",
         "ring":"Advanced",
         "isNew":false,
         "description":"<p>Wiki: <a href=https://en.wikipedia.org/wiki/Site_reliability_engineering> SRE</a></p>"
      },
      {
         "name":"SBI-Feedback",
         "quadrant":"Frameworks & Practices",
         "ring":"Advanced",
         "isNew":false,
         "description":"<p>Blog: <a href=https://www.mindtools.com/pages/article/situation-behavior-impact-feedback.htm> SBI-Feedback</a></p>"
      },
      {
         "name":"Error Budget",
         "quadrant":"Frameworks & Practices",
         "ring":"Advanced",
         "isNew":false,
         "description":"<p>Blog: <a href=https://www.atlassian.com/incident-management/kpis/error-budget> Error Budget</a></p>"
      },
      {
         "name":"Westrum Model",
         "quadrant":"Frameworks & Practices",
         "ring":"Advanced",
         "isNew":false,
         "description":"<p>Blog: <a href=https://cloud.google.com/architecture/devops/devops-culture-westrum-organizational-culture> Westrum Model</a></p>"
      },
      {
         "name":"AIOps",
         "quadrant":"Frameworks & Practices",
         "ring":"Experimental",
         "isNew":false,
         "description":"<p>Wiki: <a href=https://en.wikipedia.org/wiki/Artificial_Intelligence_for_IT_Operations> AIOps</a></p>"
      },
      {
         "name":"Team Topologies",
         "quadrant":"Frameworks & Practices",
         "ring":"Experimental",
         "isNew":false,
         "description":"<p>Home: <a href=https://teamtopologies.com/> Team Topologies</a><br>Blog: <a href=https://www.atlassian.com/devops/frameworks/team-topologies> Team Topologies</a></p>"
      },
      {
         "name":"Sociocracy 3.0",
         "quadrant":"Frameworks & Practices",
         "ring":"Experimental",
         "isNew":false,
         "description":"<p>Home: <a href=https://sociocracy30.org/> Sociocracy 3.0</a></p>"
      },
      {
         "name":"Objectives and Key Results (OKR)",
         "quadrant":"Frameworks & Practices",
         "ring":"Experimental",
         "isNew":false,
         "description":"<p>Wiki: <a href=https://en.wikipedia.org/wiki/OKR> Objectives and Key Results (OKR)</a></p>"
      },
      {
         "name":"Crystal Agile Framework",
         "quadrant":"Frameworks & Practices",
         "ring":"Experimental",
         "isNew":false,
         "description":"<p>Blog: <a href=https://airfocus.com/glossary/what-is-the-crystal-agile-framework/> Crystal Agile Framework</a></p>"
      },
      {
         "name":"Edge Ops",
         "quadrant":"Frameworks & Practices",
         "ring":"Experimental",
         "isNew":false,
         "description":"<p>Blog: <a href=https://www.adapdix.com/edgeops/> Edge Ops</a></p>"
      },
      {
         "name":"Chaos Engineering",
         "quadrant":"Frameworks & Practices",
         "ring":"Experimental",
         "isNew":false,
         "description":"<p>Wiki: <a href=https://en.wikipedia.org/wiki/Chaos_engineering> Chaos Engineering</a></p>"
      },
      {
         "name":"Waterfall",
         "quadrant":"Frameworks & Practices",
         "ring":"Dont's",
         "isNew":false,
         "description":"<p>Wiki: <a href=https://en.wikipedia.org/wiki/Waterfall_model> Waterfall</a></p>"
      },
      {
         "name":"V-Model",
         "quadrant":"Frameworks & Practices",
         "ring":"Dont's",
         "isNew":false,
         "description":"<p>Wiki: <a href=https://en.wikipedia.org/wiki/V-Model_(software_development)> V-Model</a></p>"
      },
      {
         "name":"ITIL",
         "quadrant":"Frameworks & Practices",
         "ring":"Dont's",
         "isNew":false,
         "description":"<p>Wiki: <a href=https://en.wikipedia.org/wiki/ITIL> ITIL</a></p>"
      }
   ]
}
