@startuml

title __OPERATORS's Class Diagram__\n

  namespace  {
    namespace ddtool.add.operators {
      enum Comparison {
        EQUAL
        GE
        GEQ
        LE
        LEQ
        NEQ
      }
    }
  }
  



right footer


PlantUML diagram generated by SketchIt! (https://bitbucket.org/pmesmeur/sketch.it)
For more information about this tool, please contact philippe.mesmeur@gmail.com
endfooter

@enduml
