@startuml

title __MODELCHECKING's Class Diagram__\n

  namespace  {
    namespace ddtool.modelchecking {
      class addtool.modelchecking.CheckerConnector {
          ~ inputTMP : File
          ~ outputTMP : File
          ~ propertyTMP : File
          - active : boolean
          - command : String
          - exe : ExecutorService
          - format : String
          - realInputTMP : File
          - realOutputTMP : File
          + executeModel()
          - prepareCommand()
          - prepareCommand()
      }
    }
  }
  

  namespace  {
    namespace ddtool.modelchecking {
      interface addtool.modelchecking.CheckingConstants {
          {static} + ADTOOL_MC_ARGS : String
          {static} + KEY_ADTOOL_MC_ARGS : String
          {static} + KEY_ADTOOL_PATH : String
          {static} + KEY_MODEST_MC_ARGS : String
          {static} + KEY_MODEST_PATH : String
          {static} + KEY_PRISM_MC_ARGS : String
          {static} + KEY_PRISM_PATH : String
          {static} + KEY_PRISM_PROPS : String
          {static} + KEY_UPPAAL_MC_ARGS : String
          {static} + KEY_UPPAAL_PATH : String
          {static} + MODEST_MC_ARGS : String
          {static} + PRISM_MC_ARGS : String
          {static} + PRISM_PROPS : String
          {static} + UPPAAL_MC_ARGS : String
      }
    }
  }
  



right footer


PlantUML diagram generated by SketchIt! (https://bitbucket.org/pmesmeur/sketch.it)
For more information about this tool, please contact philippe.mesmeur@gmail.com
endfooter

@enduml
