@startuml

title __TIMESERIES's Class Diagram__\n

  namespace  {
    namespace ddtool.timeseries {
      class addtool.timeseries.ARIMA {
          {static} + DEFAULT_DELTA : double
          ~ progressListeners : List<DoubleConsumer>
          - counter : int
          - delta : double
          - minimalAIC : double
          - minimalParameter : int[]
          - terminated : boolean
          + addListener()
          + apply()
          + calcPACForTimeSeries()
          + getName()
          + setDelta()
          + terminate()
          - analyse()
          - runTask()
          - updateParam()
      }
    }
  }
  

  namespace  {
    namespace ddtool.timeseries {
      class addtool.timeseries.CSVHandler {
          {static} - NONE : String
          {static} - TS : String[]
          {static} + getColumnArray()
          {static} + getColumns()
          {static} + getRecords()
          {static} + getTimeSeriesFor()
          {static} + getTimeSeriesFor()
          {static} + getTimeSeriesProbabilityFor()
          {static} + getTimeSeriesProbabilityFor()
          {static} + openImportDialog()
          - CSVHandler()
          {static} - convertColumn()
          {static} - convertColumn()
          {static} - getColumnID()
          {static} - getColumns()
      }
    }
  }
  

  namespace  {
    namespace ddtool.timeseries {
      class addtool.timeseries.CalcPAC {
          - progress : List<JProgressBar>
          - progressStream : List<PrintStream>
          + CalcPAC()
          + receiveProgress()
          + registerProgressBar()
          + registerProgressStream()
          + run()
          + shutdownNow()
      }
    }
  }
  

  namespace  {
    namespace ddtool.timeseries {
      class addtool.timeseries.GAUSSIAN {
          {static} + DEFAULT_ALPHA : double
          - alpha : double
          - checker : ExecutorService
          + addListener()
          + apply()
          + getName()
          + setAlpha()
          + terminate()
      }
    }
  }
  

  namespace  {
    namespace ddtool.timeseries {
      class addtool.timeseries.PACTuple {
          ~ delta : Rational
          ~ uncertainty : Rational
          ~ value : Rational
          + PACTuple()
          + PACTuple()
          + PACTuple()
          + PACTuple()
          + copy()
          + getDelta()
          + getUncertainty()
          + getValue()
          + setDelta()
          + setUncertainty()
          + setValue()
          + toString()
      }
    }
  }
  

  namespace  {
    namespace ddtool.timeseries {
      interface addtool.timeseries.TimeSeriesAnalysis {
          {abstract} + addListener()
          {static} + getMethodByName()
          {abstract} + getName()
          {static} + getOptions()
          {abstract} + terminate()
      }
    }
  }
  

  addtool.timeseries.ARIMA .up.|> addtool.timeseries.TimeSeriesAnalysis
  addtool.timeseries.CalcPAC o-- addtool.timeseries.TimeSeriesAnalysis : analysis
  addtool.timeseries.GAUSSIAN .up.|> addtool.timeseries.TimeSeriesAnalysis
  addtool.timeseries.PACTuple .up.|> java.io.Serializable


right footer


PlantUML diagram generated by SketchIt! (https://bitbucket.org/pmesmeur/sketch.it)
For more information about this tool, please contact philippe.mesmeur@gmail.com
endfooter

@enduml
