@startuml

title __HELPERS's Class Diagram__\n

  namespace  {
    namespace ddtool.helpers {
      class addtool.helpers.ADDIOHandler {
          {static} - lastPath : File
          {static} + chooseFile()
          {static} + chooseFile()
          {static} + chooseFile()
          {static} + export()
          {static} + importADD()
          {static} + importADDMasked()
          {static} + selectFormat()
          {static} + selectFormat()
          - ADDIOHandler()
      }
    }
  }
  

  namespace  {
    namespace ddtool.helpers {
      class addtool.helpers.CaseStringList {
          + CaseStringList()
          + CaseStringList()
          + clone()
          + contains()
          {static} + ofCSL()
      }
    }
  }
  

  namespace  {
    namespace ddtool.helpers {
      interface addtool.helpers.Constants {
          {static} + COMMENT : String
          {static} + plugins : List<Class>
          {static} + prefs : Preferences
          {static} + convertArgs()
          {static} + convertArgs()
          {static} + findAllMatchingTypes()
          {static} + generatePerm()
          {static} + getPermutations()
          {static} + getPermutationsFromIDs()
          {static} + getRandomObjects()
          {static} + getResourceFolder()
          {static} + getSubsets()
          {static} + loadPlugins()
          {static} + renderDot2png()
          {static} + renderDot2png()
          {static} + renderDot2png()
          {static} + runningFromJar()
      }
    }
  }
  

  namespace  {
    namespace ddtool.helpers {
      class addtool.helpers.ExceptionHandler {
          {static} ~ errorFile : String
          {static} ~ nthCall : boolean
          {static} ~ warningFile : String
          {static} + logException()
          + uncaughtException()
          {static} - writeThrowable()
      }
    }
  }
  

  namespace  {
    namespace ddtool.helpers {
      class addtool.helpers.Maths {
          {static} + powerSet()
          {static} + powerSetIterator()
          {static} + powerSetIterator()
          - Maths()
          {static} - powerSetHelper()
      }
    }
  }
  

  namespace  {
    namespace ddtool.helpers {
      class addtool.helpers.Pair {
          + Pair()
          + equals()
          + getFirst()
          + getSecond()
          + hashCode()
          + setFirst()
          + setSecond()
          + toString()
      }
    }
  }
  

  namespace  {
    namespace ddtool.helpers {
      class addtool.helpers.PartitionSet {
          # arr : E[]
          # bset : BitSet
          - bset_ones : int
          - min_elements : int
          - up_to : int
          + PartitionSet()
          + PartitionSet()
          + PartitionSet()
          + hasNext()
          + iterator()
          + next()
          + remove()
          # nextOnlyFirst()
          - incrementCounter()
          - incrementUntilValid()
          - overflow()
      }
    }
  }
  

  namespace  {
    namespace ddtool.helpers {
      class addtool.helpers.PollSet {
          - partitionSet : PartitionSet<E>
          + PollSet()
          + hasNext()
          + iterator()
          + next()
          + remove()
      }
    }
  }
  

  namespace  {
    namespace ddtool.helpers {
      class addtool.helpers.PowerSet {
          - partitionSet : PartitionSet<E>
          + PowerSet()
          + PowerSet()
          + PowerSet()
          + hasNext()
          + iterator()
          + next()
          + remove()
      }
    }
  }
  

  namespace  {
    namespace ddtool.helpers {
      class addtool.helpers.Properties {
          {static} + isADT()
          {static} + isSAT()
          - Properties()
      }
    }
  }
  

  namespace  {
    namespace ddtool.helpers {
      class addtool.helpers.String2Values {
          {static} + getComparison()
          {static} + getVertexList()
          {static} + parseCost()
          {static} + parseCosts()
          - String2Values()
      }
    }
  }
  

  namespace  {
    namespace ddtool.helpers {
      class addtool.helpers.TranslationTable {
          {static} + ADTOOL : String
          {static} + AND : List<String>
          {static} + ATTACKER : List<String>
          {static} + BASIC_EVENT : List<String>
          {static} + BOUND : String
          {static} + CANBEROOT : String
          {static} + CM : List<String>
          {static} + COLOR : String
          {static} + COMMENT : String
          {static} + COMPARISON : String
          {static} + COST : List<String>
          {static} + COST_DELAY : String
          {static} + COST_EXECUTION : String
          {static} + COST_PROBABILITYDELTA : String
          {static} + COST_UNCERTAINTY : String
          {static} + DEFENDER : List<String>
          {static} + DELAY_EXECUTION : String
          {static} + DELAY_PROBABILITYDELTA : String
          {static} + DELAY_UNCERTAINTY : String
          {static} + DISTRIBUTION : String
          {static} + DOT : String
          {static} + EQ : List<String>
          {static} + FIRST : String
          {static} + GATE : String
          {static} + GE : List<String>
          {static} + GEQ : List<String>
          {static} + IF : List<String>
          {static} + IVR : List<String>
          {static} + LE : List<String>
          {static} + LEQ : List<String>
          {static} + MODEST : String
          {static} + NAME : String
          {static} + NAT : List<String>
          {static} + NEQ : List<String>
          {static} + NOT : List<String>
          {static} + NOT_TRUE : List<String>
          {static} + OR : List<String>
          {static} + ORDER : String
          {static} + PRISM : String
          {static} + PROBABILITY : String
          {static} + PROBABILITYDELTA : String
          {static} + RESET : List<String>
          {static} + SAND : List<String>
          {static} + SECOND : String
          {static} + SINK : String
          {static} + SOR : List<String>
          {static} + STYLE : String
          {static} + TRIGGER : List<String>
          {static} + TYPE : String
          {static} + UNCERTAINTY : String
          {static} + UPPAAL : String
          {static} + XML : String
          {static} + XPOS : String
          {static} + YPOS : String
          - TranslationTable()
      }
    }
  }
  

  namespace  {
    namespace ddtool.helpers {
      class addtool.helpers.Values2String {
          {static} + Rational2string()
          {static} + costConstraint()
          {static} + getIdList()
          {static} + getList()
          {static} + getVertexName()
          {static} + id2Int()
          {static} + id2Int()
          {static} + string2Comparisons()
          {static} + string2Costs()
          {static} + string2Costs()
          - Values2String()
      }
    }
  }
  

  addtool.helpers.CaseStringList -up-|> java.util.ArrayList
  addtool.helpers.ExceptionHandler .up.|> java.lang.Thread.UncaughtExceptionHandler
  addtool.helpers.Pair o-- F : first
  addtool.helpers.Pair o-- S : second
  addtool.helpers.PartitionSet .up.|> java.lang.Iterable
  addtool.helpers.PartitionSet .up.|> java.util.Iterator
  addtool.helpers.PollSet .up.|> java.lang.Iterable
  addtool.helpers.PollSet .up.|> java.util.Iterator
  addtool.helpers.PowerSet .up.|> java.lang.Iterable
  addtool.helpers.PowerSet .up.|> java.util.Iterator


right footer


PlantUML diagram generated by SketchIt! (https://bitbucket.org/pmesmeur/sketch.it)
For more information about this tool, please contact philippe.mesmeur@gmail.com
endfooter

@enduml
