@startuml

title __XML2ADD's Class Diagram__\n

  namespace  {
    namespace ddtool.xml2add {
      class addtool.xml2add.Domain {
          - cache : Map<String, Rational>
          - id : String
          + Domain()
          + getId()
          + handleVertex()
          + toString()
          + valueFromCache()
          - tryPutValue()
      }
    }
  }
  

  namespace  {
    namespace ddtool.xml2add {
      enum Domain_type {
        COST
        NOT_DETERMINED
        PROBABILITY
      }
    }
  }
  

  namespace  {
    namespace ddtool.xml2add {
      class addtool.xml2add.MainXML2Dot {
          {static} + main()
          - MainXML2Dot()
      }
    }
  }
  

  namespace  {
    namespace ddtool.xml2add {
      class addtool.xml2add.ParserXML {
          {static} - id : int
          {static} + parse()
          - ParserXML()
          {static} - generateBasicEvent()
          {static} - getLabel()
          {static} - handleNode()
          {static} - isBasicEvent()
          {static} - iterateCM()
          {static} - reformModel()
      }
    }
  }
  

  namespace  {
    namespace ddtool.xml2add {
      class addtool.xml2add.XML2ADD {
          + getFileExtension()
          + getName()
          + importModel()
      }
    }
  }
  

  addtool.xml2add.Domain o-- addtool.xml2add.Domain.Domain_type : type
  addtool.xml2add.Domain +-down- addtool.xml2add.Domain.Domain_type
  addtool.xml2add.XML2ADD .up.|> addtool.add.io.ADDImport


right footer


PlantUML diagram generated by SketchIt! (https://bitbucket.org/pmesmeur/sketch.it)
For more information about this tool, please contact philippe.mesmeur@gmail.com
endfooter

@enduml
