@startuml

title __GAMEGENERATION's Class Diagram__\n

  namespace  {
    namespace ddtool.add2prism {
      namespace GameGeneration {
        class addtool.add2prism.GameGeneration.AmpleSetReduction {
        }
      }
    }
  }
  



right footer


PlantUML diagram generated by SketchIt! (https://bitbucket.org/pmesmeur/sketch.it)
For more information about this tool, please contact philippe.mesmeur@gmail.com
endfooter

@enduml
