<svg width="703" height="156" viewBox="0 0 703 156" fill="none" xmlns="http://www.w3.org/2000/svg">
<g id="GES_D">
<g id="Keyboard arrow up" clip-path="url(#clip0_6_370)">
<path id="Vector" d="M345.056 142.973L351.75 136.294L358.444 142.973L360.5 140.917L351.75 132.167L343 140.917L345.056 142.973Z" fill="#0A172A"/>
</g>
<g id="Frame 2">
<rect x="0.75" y="15.5" width="90" height="90" rx="20" fill="#99D5F7"/>
<path id="A" d="M50.843 65.16L46.685 54.114C46.349 53.26 46.006 52.175 45.656 50.859C45.502 51.517 45.334 52.126 45.152 52.686C44.97 53.232 44.802 53.715 44.648 54.135L40.49 65.16H50.843ZM60.146 76.5H56.345C55.911 76.5 55.561 76.395 55.295 76.185C55.029 75.961 54.826 75.688 54.686 75.366L52.166 68.688H39.146L36.626 75.366C36.514 75.646 36.318 75.905 36.038 76.143C35.758 76.381 35.408 76.5 34.988 76.5H31.187L43.178 46.26H48.155L60.146 76.5Z" fill="white"/>
</g>
<g id="Frame 4">
<rect x="204.75" y="15.5" width="90" height="90" rx="20" fill="#6D87A8"/>
<path id="C" d="M259.841 69.759C260.107 69.759 260.338 69.864 260.534 70.074L262.487 72.195C261.255 73.679 259.743 74.827 257.951 75.639C256.159 76.437 254.017 76.836 251.525 76.836C249.313 76.836 247.311 76.458 245.519 75.702C243.741 74.932 242.222 73.868 240.962 72.51C239.702 71.138 238.729 69.507 238.043 67.617C237.371 65.727 237.035 63.648 237.035 61.38C237.035 59.112 237.392 57.033 238.106 55.143C238.834 53.239 239.849 51.608 241.151 50.25C242.467 48.878 244.035 47.814 245.855 47.058C247.689 46.302 249.705 45.924 251.903 45.924C254.087 45.924 256.012 46.281 257.678 46.995C259.358 47.695 260.814 48.633 262.046 49.809L260.429 52.098C260.317 52.252 260.184 52.385 260.03 52.497C259.876 52.609 259.666 52.665 259.4 52.665C259.12 52.665 258.798 52.539 258.434 52.287C258.084 52.021 257.629 51.734 257.069 51.426C256.523 51.104 255.83 50.817 254.99 50.565C254.164 50.299 253.128 50.166 251.882 50.166C250.44 50.166 249.117 50.418 247.913 50.922C246.709 51.426 245.673 52.161 244.805 53.127C243.937 54.093 243.258 55.269 242.768 56.655C242.292 58.041 242.054 59.616 242.054 61.38C242.054 63.158 242.306 64.747 242.81 66.147C243.314 67.533 244.007 68.709 244.889 69.675C245.771 70.627 246.807 71.355 247.997 71.859C249.187 72.363 250.468 72.615 251.84 72.615C252.68 72.615 253.429 72.573 254.087 72.489C254.759 72.391 255.375 72.244 255.935 72.048C256.495 71.838 257.02 71.579 257.51 71.271C258.014 70.963 258.511 70.585 259.001 70.137C259.281 69.885 259.561 69.759 259.841 69.759Z" fill="white"/>
</g>
<g id="Frame 6">
<rect x="408.75" y="15.5" width="90" height="90" rx="20" fill="#434665"/>
<path id="E" d="M461.72 72.531L461.699 76.5H442.841V46.26H461.699V50.229H447.776V59.343H458.906V63.186H447.776V72.531H461.72Z" fill="white"/>
</g>
<g id="Frame 3">
<rect x="102.75" y="15.5" width="90" height="90" rx="20" fill="#80ABCD"/>
<path id="B" d="M147.845 72.615C148.951 72.615 149.882 72.489 150.638 72.237C151.408 71.971 152.031 71.614 152.507 71.166C152.997 70.718 153.347 70.193 153.557 69.591C153.781 68.975 153.893 68.317 153.893 67.617C153.893 66.189 153.403 65.069 152.423 64.257C151.457 63.431 149.924 63.018 147.824 63.018H141.755V72.615H147.845ZM141.755 50.103V59.553H146.669C148.769 59.553 150.337 59.147 151.373 58.335C152.409 57.523 152.927 56.354 152.927 54.828C152.927 53.162 152.437 51.958 151.457 51.216C150.491 50.474 148.972 50.103 146.9 50.103H141.755ZM146.9 46.26C148.832 46.26 150.484 46.449 151.856 46.827C153.228 47.191 154.355 47.716 155.237 48.402C156.119 49.088 156.763 49.928 157.169 50.922C157.589 51.902 157.799 53.008 157.799 54.24C157.799 54.954 157.687 55.647 157.463 56.319C157.253 56.977 156.917 57.6 156.455 58.188C156.007 58.762 155.44 59.28 154.754 59.742C154.068 60.204 153.256 60.589 152.318 60.897C156.602 61.807 158.744 64.082 158.744 67.722C158.744 69.01 158.499 70.193 158.009 71.271C157.533 72.335 156.833 73.259 155.909 74.043C154.999 74.813 153.872 75.415 152.528 75.849C151.184 76.283 149.651 76.5 147.929 76.5H136.841V46.26H146.9Z" fill="white"/>
</g>
<g id="Frame 5">
<rect x="306.75" y="0.5" width="90" height="120" rx="20" fill="#546384"/>
<path id="D" d="M367.385 61.38C367.385 63.62 367.021 65.671 366.293 67.533C365.565 69.381 364.536 70.97 363.206 72.3C361.89 73.63 360.301 74.666 358.439 75.408C356.591 76.136 354.533 76.5 352.265 76.5H340.841V46.26H352.265C354.533 46.26 356.591 46.631 358.439 47.373C360.301 48.101 361.89 49.13 363.206 50.46C364.536 51.79 365.565 53.386 366.293 55.248C367.021 57.096 367.385 59.14 367.385 61.38ZM362.366 61.38C362.366 59.644 362.128 58.083 361.652 56.697C361.19 55.311 360.518 54.142 359.636 53.19C358.768 52.238 357.711 51.51 356.465 51.006C355.219 50.488 353.819 50.229 352.265 50.229H345.776V72.531H352.265C353.819 72.531 355.219 72.279 356.465 71.775C357.711 71.271 358.768 70.543 359.636 69.591C360.518 68.625 361.19 67.456 361.652 66.084C362.128 64.698 362.366 63.13 362.366 61.38Z" fill="white"/>
</g>
<g id="Frame 7">
<rect x="510.75" y="15.5" width="90" height="90" rx="20" fill="#332D47"/>
<path id="F" d="M549.776 50.229V59.91H561.599V63.879H549.776V76.5H544.841V46.26H563.699V50.229H549.776Z" fill="white"/>
</g>
<g id="Frame 8">
<rect x="612.75" y="15.5" width="90" height="90" rx="20" fill="#231A2F"/>
<path id="G" d="M671.6 61.611V73.581C668.59 75.751 665.09 76.836 661.1 76.836C658.65 76.836 656.431 76.458 654.443 75.702C652.469 74.932 650.782 73.868 649.382 72.51C647.982 71.138 646.904 69.507 646.148 67.617C645.392 65.727 645.014 63.648 645.014 61.38C645.014 59.098 645.378 57.012 646.106 55.122C646.834 53.218 647.877 51.587 649.235 50.229C650.593 48.857 652.231 47.8 654.149 47.058C656.067 46.302 658.223 45.924 660.617 45.924C661.835 45.924 662.962 46.022 663.998 46.218C665.048 46.4 666.021 46.659 666.917 46.995C667.813 47.331 668.639 47.737 669.395 48.213C670.151 48.689 670.844 49.221 671.474 49.809L670.067 52.056C669.843 52.406 669.556 52.623 669.206 52.707C668.856 52.791 668.478 52.707 668.072 52.455C667.666 52.217 667.232 51.965 666.77 51.699C666.322 51.433 665.804 51.188 665.216 50.964C664.628 50.726 663.949 50.537 663.179 50.397C662.409 50.243 661.499 50.166 660.449 50.166C658.853 50.166 657.411 50.432 656.123 50.964C654.849 51.482 653.757 52.231 652.847 53.211C651.937 54.177 651.237 55.353 650.747 56.739C650.257 58.125 650.012 59.672 650.012 61.38C650.012 63.186 650.271 64.803 650.789 66.231C651.307 67.645 652.042 68.849 652.994 69.843C653.946 70.823 655.094 71.572 656.438 72.09C657.796 72.608 659.308 72.867 660.974 72.867C662.22 72.867 663.326 72.734 664.292 72.468C665.272 72.202 666.231 71.831 667.169 71.355V65.349H662.948C662.626 65.349 662.374 65.265 662.192 65.097C662.01 64.915 661.919 64.684 661.919 64.404V61.611H671.6Z" fill="white"/>
</g>
</g>
<defs>
<clipPath id="clip0_6_370">
<rect width="35" height="35" fill="white" transform="translate(334.25 120.5)"/>
</clipPath>
</defs>
</svg>
