<svg width="703" height="155" viewBox="0 0 703 155" fill="none" xmlns="http://www.w3.org/2000/svg">
<g id="GES_F">
<g id="Keyboard arrow up" clip-path="url(#clip0_6_340)">
<path id="Vector" d="M548.556 142.473L555.25 135.794L561.944 142.473L564 140.417L555.25 131.667L546.5 140.417L548.556 142.473Z" fill="#0A172A"/>
</g>
<g id="Frame 2">
<rect x="0.25" y="15" width="90" height="90" rx="20" fill="#99D5F7"/>
<path id="A" d="M50.343 64.66L46.185 53.614C45.849 52.76 45.506 51.675 45.156 50.359C45.002 51.017 44.834 51.626 44.652 52.186C44.47 52.732 44.302 53.215 44.148 53.635L39.99 64.66H50.343ZM59.646 76H55.845C55.411 76 55.061 75.895 54.795 75.685C54.529 75.461 54.326 75.188 54.186 74.866L51.666 68.188H38.646L36.126 74.866C36.014 75.146 35.818 75.405 35.538 75.643C35.258 75.881 34.908 76 34.488 76H30.687L42.678 45.76H47.655L59.646 76Z" fill="white"/>
</g>
<g id="Frame 4">
<rect x="204.25" y="15" width="90" height="90" rx="20" fill="#6D87A8"/>
<path id="C" d="M259.341 69.259C259.607 69.259 259.838 69.364 260.034 69.574L261.987 71.695C260.755 73.179 259.243 74.327 257.451 75.139C255.659 75.937 253.517 76.336 251.025 76.336C248.813 76.336 246.811 75.958 245.019 75.202C243.241 74.432 241.722 73.368 240.462 72.01C239.202 70.638 238.229 69.007 237.543 67.117C236.871 65.227 236.535 63.148 236.535 60.88C236.535 58.612 236.892 56.533 237.606 54.643C238.334 52.739 239.349 51.108 240.651 49.75C241.967 48.378 243.535 47.314 245.355 46.558C247.189 45.802 249.205 45.424 251.403 45.424C253.587 45.424 255.512 45.781 257.178 46.495C258.858 47.195 260.314 48.133 261.546 49.309L259.929 51.598C259.817 51.752 259.684 51.885 259.53 51.997C259.376 52.109 259.166 52.165 258.9 52.165C258.62 52.165 258.298 52.039 257.934 51.787C257.584 51.521 257.129 51.234 256.569 50.926C256.023 50.604 255.33 50.317 254.49 50.065C253.664 49.799 252.628 49.666 251.382 49.666C249.94 49.666 248.617 49.918 247.413 50.422C246.209 50.926 245.173 51.661 244.305 52.627C243.437 53.593 242.758 54.769 242.268 56.155C241.792 57.541 241.554 59.116 241.554 60.88C241.554 62.658 241.806 64.247 242.31 65.647C242.814 67.033 243.507 68.209 244.389 69.175C245.271 70.127 246.307 70.855 247.497 71.359C248.687 71.863 249.968 72.115 251.34 72.115C252.18 72.115 252.929 72.073 253.587 71.989C254.259 71.891 254.875 71.744 255.435 71.548C255.995 71.338 256.52 71.079 257.01 70.771C257.514 70.463 258.011 70.085 258.501 69.637C258.781 69.385 259.061 69.259 259.341 69.259Z" fill="white"/>
</g>
<g id="Frame 6">
<rect x="408.25" y="15" width="90" height="90" rx="20" fill="#434665"/>
<path id="E" d="M461.22 72.031L461.199 76H442.341V45.76H461.199V49.729H447.276V58.843H458.406V62.686H447.276V72.031H461.22Z" fill="white"/>
</g>
<g id="Frame 3">
<rect x="102.25" y="15" width="90" height="90" rx="20" fill="#80ABCD"/>
<path id="B" d="M147.345 72.115C148.451 72.115 149.382 71.989 150.138 71.737C150.908 71.471 151.531 71.114 152.007 70.666C152.497 70.218 152.847 69.693 153.057 69.091C153.281 68.475 153.393 67.817 153.393 67.117C153.393 65.689 152.903 64.569 151.923 63.757C150.957 62.931 149.424 62.518 147.324 62.518H141.255V72.115H147.345ZM141.255 49.603V59.053H146.169C148.269 59.053 149.837 58.647 150.873 57.835C151.909 57.023 152.427 55.854 152.427 54.328C152.427 52.662 151.937 51.458 150.957 50.716C149.991 49.974 148.472 49.603 146.4 49.603H141.255ZM146.4 45.76C148.332 45.76 149.984 45.949 151.356 46.327C152.728 46.691 153.855 47.216 154.737 47.902C155.619 48.588 156.263 49.428 156.669 50.422C157.089 51.402 157.299 52.508 157.299 53.74C157.299 54.454 157.187 55.147 156.963 55.819C156.753 56.477 156.417 57.1 155.955 57.688C155.507 58.262 154.94 58.78 154.254 59.242C153.568 59.704 152.756 60.089 151.818 60.397C156.102 61.307 158.244 63.582 158.244 67.222C158.244 68.51 157.999 69.693 157.509 70.771C157.033 71.835 156.333 72.759 155.409 73.543C154.499 74.313 153.372 74.915 152.028 75.349C150.684 75.783 149.151 76 147.429 76H136.341V45.76H146.4Z" fill="white"/>
</g>
<g id="Frame 5">
<rect x="306.25" y="15" width="90" height="90" rx="20" fill="#546384"/>
<path id="D" d="M366.885 60.88C366.885 63.12 366.521 65.171 365.793 67.033C365.065 68.881 364.036 70.47 362.706 71.8C361.39 73.13 359.801 74.166 357.939 74.908C356.091 75.636 354.033 76 351.765 76H340.341V45.76H351.765C354.033 45.76 356.091 46.131 357.939 46.873C359.801 47.601 361.39 48.63 362.706 49.96C364.036 51.29 365.065 52.886 365.793 54.748C366.521 56.596 366.885 58.64 366.885 60.88ZM361.866 60.88C361.866 59.144 361.628 57.583 361.152 56.197C360.69 54.811 360.018 53.642 359.136 52.69C358.268 51.738 357.211 51.01 355.965 50.506C354.719 49.988 353.319 49.729 351.765 49.729H345.276V72.031H351.765C353.319 72.031 354.719 71.779 355.965 71.275C357.211 70.771 358.268 70.043 359.136 69.091C360.018 68.125 360.69 66.956 361.152 65.584C361.628 64.198 361.866 62.63 361.866 60.88Z" fill="white"/>
</g>
<g id="Frame 7">
<rect x="510.25" width="90" height="120" rx="20" fill="#332D47"/>
<path id="F" d="M549.276 49.729V59.41H561.099V63.379H549.276V76H544.341V45.76H563.199V49.729H549.276Z" fill="white"/>
</g>
<g id="Frame 8">
<rect x="612.25" y="15" width="90" height="90" rx="20" fill="#231A2F"/>
<path id="G" d="M671.1 61.111V73.081C668.09 75.251 664.59 76.336 660.6 76.336C658.15 76.336 655.931 75.958 653.943 75.202C651.969 74.432 650.282 73.368 648.882 72.01C647.482 70.638 646.404 69.007 645.648 67.117C644.892 65.227 644.514 63.148 644.514 60.88C644.514 58.598 644.878 56.512 645.606 54.622C646.334 52.718 647.377 51.087 648.735 49.729C650.093 48.357 651.731 47.3 653.649 46.558C655.567 45.802 657.723 45.424 660.117 45.424C661.335 45.424 662.462 45.522 663.498 45.718C664.548 45.9 665.521 46.159 666.417 46.495C667.313 46.831 668.139 47.237 668.895 47.713C669.651 48.189 670.344 48.721 670.974 49.309L669.567 51.556C669.343 51.906 669.056 52.123 668.706 52.207C668.356 52.291 667.978 52.207 667.572 51.955C667.166 51.717 666.732 51.465 666.27 51.199C665.822 50.933 665.304 50.688 664.716 50.464C664.128 50.226 663.449 50.037 662.679 49.897C661.909 49.743 660.999 49.666 659.949 49.666C658.353 49.666 656.911 49.932 655.623 50.464C654.349 50.982 653.257 51.731 652.347 52.711C651.437 53.677 650.737 54.853 650.247 56.239C649.757 57.625 649.512 59.172 649.512 60.88C649.512 62.686 649.771 64.303 650.289 65.731C650.807 67.145 651.542 68.349 652.494 69.343C653.446 70.323 654.594 71.072 655.938 71.59C657.296 72.108 658.808 72.367 660.474 72.367C661.72 72.367 662.826 72.234 663.792 71.968C664.772 71.702 665.731 71.331 666.669 70.855V64.849H662.448C662.126 64.849 661.874 64.765 661.692 64.597C661.51 64.415 661.419 64.184 661.419 63.904V61.111H671.1Z" fill="white"/>
</g>
</g>
<defs>
<clipPath id="clip0_6_340">
<rect width="35" height="35" fill="white" transform="translate(537.75 120)"/>
</clipPath>
</defs>
</svg>
