<svg width="703" height="155" viewBox="0 0 703 155" fill="none" xmlns="http://www.w3.org/2000/svg">
<g clip-path="url(#clip0_6_250)">
<path d="M242.806 142.473L249.5 135.794L256.194 142.473L258.25 140.417L249.5 131.667L240.75 140.417L242.806 142.473Z" fill="#0A172A"/>
</g>
<rect x="0.5" y="15" width="90" height="90" rx="20" fill="#499264"/>
<path d="M50.593 64.66L46.435 53.614C46.099 52.76 45.756 51.675 45.406 50.359C45.252 51.017 45.084 51.626 44.902 52.186C44.72 52.732 44.552 53.215 44.398 53.635L40.24 64.66H50.593ZM59.896 76H56.095C55.661 76 55.311 75.895 55.045 75.685C54.779 75.461 54.576 75.188 54.436 74.866L51.916 68.188H38.896L36.376 74.866C36.264 75.146 36.068 75.405 35.788 75.643C35.508 75.881 35.158 76 34.738 76H30.937L42.928 45.76H47.905L59.896 76Z" fill="white"/>
<rect x="204.5" width="90" height="120" rx="20" fill="#6DB56D"/>
<path d="M259.591 69.259C259.857 69.259 260.088 69.364 260.284 69.574L262.237 71.695C261.005 73.179 259.493 74.327 257.701 75.139C255.909 75.937 253.767 76.336 251.275 76.336C249.063 76.336 247.061 75.958 245.269 75.202C243.491 74.432 241.972 73.368 240.712 72.01C239.452 70.638 238.479 69.007 237.793 67.117C237.121 65.227 236.785 63.148 236.785 60.88C236.785 58.612 237.142 56.533 237.856 54.643C238.584 52.739 239.599 51.108 240.901 49.75C242.217 48.378 243.785 47.314 245.605 46.558C247.439 45.802 249.455 45.424 251.653 45.424C253.837 45.424 255.762 45.781 257.428 46.495C259.108 47.195 260.564 48.133 261.796 49.309L260.179 51.598C260.067 51.752 259.934 51.885 259.78 51.997C259.626 52.109 259.416 52.165 259.15 52.165C258.87 52.165 258.548 52.039 258.184 51.787C257.834 51.521 257.379 51.234 256.819 50.926C256.273 50.604 255.58 50.317 254.74 50.065C253.914 49.799 252.878 49.666 251.632 49.666C250.19 49.666 248.867 49.918 247.663 50.422C246.459 50.926 245.423 51.661 244.555 52.627C243.687 53.593 243.008 54.769 242.518 56.155C242.042 57.541 241.804 59.116 241.804 60.88C241.804 62.658 242.056 64.247 242.56 65.647C243.064 67.033 243.757 68.209 244.639 69.175C245.521 70.127 246.557 70.855 247.747 71.359C248.937 71.863 250.218 72.115 251.59 72.115C252.43 72.115 253.179 72.073 253.837 71.989C254.509 71.891 255.125 71.744 255.685 71.548C256.245 71.338 256.77 71.079 257.26 70.771C257.764 70.463 258.261 70.085 258.751 69.637C259.031 69.385 259.311 69.259 259.591 69.259Z" fill="white"/>
<rect x="408.5" y="15" width="90" height="90" rx="20" fill="#EDAB28"/>
<path d="M461.47 72.031L461.449 76H442.591V45.76H461.449V49.729H447.526V58.843H458.656V62.686H447.526V72.031H461.47Z" fill="white"/>
<rect x="102.5" y="15" width="90" height="90" rx="20" fill="#58A74A"/>
<path d="M147.595 72.115C148.701 72.115 149.632 71.989 150.388 71.737C151.158 71.471 151.781 71.114 152.257 70.666C152.747 70.218 153.097 69.693 153.307 69.091C153.531 68.475 153.643 67.817 153.643 67.117C153.643 65.689 153.153 64.569 152.173 63.757C151.207 62.931 149.674 62.518 147.574 62.518H141.505V72.115H147.595ZM141.505 49.603V59.053H146.419C148.519 59.053 150.087 58.647 151.123 57.835C152.159 57.023 152.677 55.854 152.677 54.328C152.677 52.662 152.187 51.458 151.207 50.716C150.241 49.974 148.722 49.603 146.65 49.603H141.505ZM146.65 45.76C148.582 45.76 150.234 45.949 151.606 46.327C152.978 46.691 154.105 47.216 154.987 47.902C155.869 48.588 156.513 49.428 156.919 50.422C157.339 51.402 157.549 52.508 157.549 53.74C157.549 54.454 157.437 55.147 157.213 55.819C157.003 56.477 156.667 57.1 156.205 57.688C155.757 58.262 155.19 58.78 154.504 59.242C153.818 59.704 153.006 60.089 152.068 60.397C156.352 61.307 158.494 63.582 158.494 67.222C158.494 68.51 158.249 69.693 157.759 70.771C157.283 71.835 156.583 72.759 155.659 73.543C154.749 74.313 153.622 74.915 152.278 75.349C150.934 75.783 149.401 76 147.679 76H136.591V45.76H146.65Z" fill="white"/>
<rect x="306.5" y="15" width="90" height="90" rx="20" fill="#F2E31E"/>
<path d="M367.135 60.88C367.135 63.12 366.771 65.171 366.043 67.033C365.315 68.881 364.286 70.47 362.956 71.8C361.64 73.13 360.051 74.166 358.189 74.908C356.341 75.636 354.283 76 352.015 76H340.591V45.76H352.015C354.283 45.76 356.341 46.131 358.189 46.873C360.051 47.601 361.64 48.63 362.956 49.96C364.286 51.29 365.315 52.886 366.043 54.748C366.771 56.596 367.135 58.64 367.135 60.88ZM362.116 60.88C362.116 59.144 361.878 57.583 361.402 56.197C360.94 54.811 360.268 53.642 359.386 52.69C358.518 51.738 357.461 51.01 356.215 50.506C354.969 49.988 353.569 49.729 352.015 49.729H345.526V72.031H352.015C353.569 72.031 354.969 71.779 356.215 71.275C357.461 70.771 358.518 70.043 359.386 69.091C360.268 68.125 360.94 66.956 361.402 65.584C361.878 64.198 362.116 62.63 362.116 60.88Z" fill="white"/>
<rect x="510.5" y="15" width="90" height="90" rx="20" fill="#E8782F"/>
<path d="M549.526 49.729V59.41H561.349V63.379H549.526V76H544.591V45.76H563.449V49.729H549.526Z" fill="white"/>
<rect x="612.5" y="15" width="90" height="90" rx="20" fill="#D23D29"/>
<path d="M671.35 61.111V73.081C668.34 75.251 664.84 76.336 660.85 76.336C658.4 76.336 656.181 75.958 654.193 75.202C652.219 74.432 650.532 73.368 649.132 72.01C647.732 70.638 646.654 69.007 645.898 67.117C645.142 65.227 644.764 63.148 644.764 60.88C644.764 58.598 645.128 56.512 645.856 54.622C646.584 52.718 647.627 51.087 648.985 49.729C650.343 48.357 651.981 47.3 653.899 46.558C655.817 45.802 657.973 45.424 660.367 45.424C661.585 45.424 662.712 45.522 663.748 45.718C664.798 45.9 665.771 46.159 666.667 46.495C667.563 46.831 668.389 47.237 669.145 47.713C669.901 48.189 670.594 48.721 671.224 49.309L669.817 51.556C669.593 51.906 669.306 52.123 668.956 52.207C668.606 52.291 668.228 52.207 667.822 51.955C667.416 51.717 666.982 51.465 666.52 51.199C666.072 50.933 665.554 50.688 664.966 50.464C664.378 50.226 663.699 50.037 662.929 49.897C662.159 49.743 661.249 49.666 660.199 49.666C658.603 49.666 657.161 49.932 655.873 50.464C654.599 50.982 653.507 51.731 652.597 52.711C651.687 53.677 650.987 54.853 650.497 56.239C650.007 57.625 649.762 59.172 649.762 60.88C649.762 62.686 650.021 64.303 650.539 65.731C651.057 67.145 651.792 68.349 652.744 69.343C653.696 70.323 654.844 71.072 656.188 71.59C657.546 72.108 659.058 72.367 660.724 72.367C661.97 72.367 663.076 72.234 664.042 71.968C665.022 71.702 665.981 71.331 666.919 70.855V64.849H662.698C662.376 64.849 662.124 64.765 661.942 64.597C661.76 64.415 661.669 64.184 661.669 63.904V61.111H671.35Z" fill="white"/>
<defs>
<clipPath id="clip0_6_250">
<rect width="35" height="35" fill="white" transform="translate(232 120)"/>
</clipPath>
</defs>
</svg>
