<svg width="130" height="35" viewBox="0 0 748 167" fill="none" xmlns="http://www.w3.org/2000/svg">
<path d="M73.647 0.0701904L145.25 63.4776V167H0.75V63.4776L43.0216 26.3821L84.8619 63.4776V94.103H61.1381V74.6926L43.0216 60.0269L25.3366 74.6926V143.276H61.1381V118.69H84.8619V143.276H121.095V74.6926L55.5306 16.4612L73.647 0.0701904Z" fill="#F0B212"/>
<path d="M215 68.74C224.62 68.74 233.027 70.6467 240.22 74.46C247.413 78.2733 252.96 83.6467 256.86 90.58C260.847 97.4267 262.84 105.357 262.84 114.37C262.84 123.297 260.847 131.227 256.86 138.16C252.96 145.093 247.37 150.467 240.09 154.28C232.897 158.093 224.533 160 215 160H180.81V68.74H215ZM213.57 140.76C221.977 140.76 228.52 138.463 233.2 133.87C237.88 129.277 240.22 122.777 240.22 114.37C240.22 105.963 237.88 99.42 233.2 94.74C228.52 90.06 221.977 87.72 213.57 87.72H203.04V140.76H213.57Z" fill="#0A172A"/>
<path d="M270.843 123.6C270.843 116.147 272.23 109.603 275.003 103.97C277.863 98.3367 281.72 94.0033 286.573 90.97C291.426 87.9367 296.843 86.42 302.823 86.42C307.936 86.42 312.4 87.46 316.213 89.54C320.113 91.62 323.103 94.35 325.183 97.73V87.46H347.413V160H325.183V149.73C323.016 153.11 319.983 155.84 316.083 157.92C312.27 160 307.806 161.04 302.693 161.04C296.8 161.04 291.426 159.523 286.573 156.49C281.72 153.37 277.863 148.993 275.003 143.36C272.23 137.64 270.843 131.053 270.843 123.6ZM325.183 123.73C325.183 118.183 323.623 113.807 320.503 110.6C317.47 107.393 313.743 105.79 309.323 105.79C304.903 105.79 301.133 107.393 298.013 110.6C294.98 113.72 293.463 118.053 293.463 123.6C293.463 129.147 294.98 133.567 298.013 136.86C301.133 140.067 304.903 141.67 309.323 141.67C313.743 141.67 317.47 140.067 320.503 136.86C323.623 133.653 325.183 129.277 325.183 123.73Z" fill="#0A172A"/>
<path d="M442.536 68.74V160H420.306V122.43H385.726V160H363.496V68.74H385.726V104.49H420.306V68.74H442.536Z" fill="#0A172A"/>
<path d="M491.603 161.04C484.497 161.04 478.083 159.523 472.363 156.49C466.73 153.457 462.267 149.123 458.973 143.49C455.767 137.857 454.163 131.27 454.163 123.73C454.163 116.277 455.81 109.733 459.103 104.1C462.397 98.38 466.903 94.0033 472.623 90.97C478.343 87.9367 484.757 86.42 491.863 86.42C498.97 86.42 505.383 87.9367 511.103 90.97C516.823 94.0033 521.33 98.38 524.623 104.1C527.917 109.733 529.563 116.277 529.563 123.73C529.563 131.183 527.873 137.77 524.493 143.49C521.2 149.123 516.65 153.457 510.843 156.49C505.123 159.523 498.71 161.04 491.603 161.04ZM491.603 141.8C495.85 141.8 499.447 140.24 502.393 137.12C505.427 134 506.943 129.537 506.943 123.73C506.943 117.923 505.47 113.46 502.523 110.34C499.663 107.22 496.11 105.66 491.863 105.66C487.53 105.66 483.933 107.22 481.073 110.34C478.213 113.373 476.783 117.837 476.783 123.73C476.783 129.537 478.17 134 480.943 137.12C483.803 140.24 487.357 141.8 491.603 141.8Z" fill="#0A172A"/>
<path d="M633.917 86.68C642.93 86.68 650.08 89.41 655.367 94.87C660.74 100.33 663.427 107.913 663.427 117.62V160H641.327V120.61C641.327 115.93 640.07 112.333 637.557 109.82C635.13 107.22 631.75 105.92 627.417 105.92C623.084 105.92 619.66 107.22 617.147 109.82C614.72 112.333 613.507 115.93 613.507 120.61V160H591.407V120.61C591.407 115.93 590.15 112.333 587.637 109.82C585.21 107.22 581.83 105.92 577.497 105.92C573.164 105.92 569.74 107.22 567.227 109.82C564.8 112.333 563.587 115.93 563.587 120.61V160H541.357V87.46H563.587V96.56C565.84 93.5267 568.787 91.1433 572.427 89.41C576.067 87.59 580.184 86.68 584.777 86.68C590.237 86.68 595.09 87.85 599.337 90.19C603.67 92.53 607.05 95.8667 609.477 100.2C611.99 96.2133 615.414 92.9633 619.747 90.45C624.08 87.9367 628.804 86.68 633.917 86.68Z" fill="#0A172A"/>
<path d="M747.354 122.56C747.354 124.64 747.224 126.807 746.964 129.06H696.654C697.001 133.567 698.431 137.033 700.944 139.46C703.544 141.8 706.707 142.97 710.434 142.97C715.981 142.97 719.837 140.63 722.004 135.95H745.664C744.451 140.717 742.241 145.007 739.034 148.82C735.914 152.633 731.971 155.623 727.204 157.79C722.437 159.957 717.107 161.04 711.214 161.04C704.107 161.04 697.781 159.523 692.234 156.49C686.687 153.457 682.354 149.123 679.234 143.49C676.114 137.857 674.554 131.27 674.554 123.73C674.554 116.19 676.071 109.603 679.104 103.97C682.224 98.3367 686.557 94.0033 692.104 90.97C697.651 87.9367 704.021 86.42 711.214 86.42C718.234 86.42 724.474 87.8933 729.934 90.84C735.394 93.7867 739.641 97.99 742.674 103.45C745.794 108.91 747.354 115.28 747.354 122.56ZM724.604 116.71C724.604 112.897 723.304 109.863 720.704 107.61C718.104 105.357 714.854 104.23 710.954 104.23C707.227 104.23 704.064 105.313 701.464 107.48C698.951 109.647 697.391 112.723 696.784 116.71H724.604Z" fill="#0A172A"/>
</svg>
