[2020-04-15T11:42:35.208+0200][0.007s] Heap region size: 1M
[2020-04-15T11:42:35.220+0200][0.019s] Using G1
[2020-04-15T11:42:35.220+0200][0.019s] Heap address: 0x00000000e0000000, size: 512 MB, Compressed Oops mode: 32-bit
[2020-04-15T11:42:35.221+0200][0.020s] Mark closed archive regions in map: [0x00000000fff00000, 0x00000000fff69ff8]
[2020-04-15T11:42:35.221+0200][0.020s] Mark open archive regions in map: [0x00000000ffe00000, 0x00000000ffe46ff8]
[2020-04-15T11:42:35.652+0200][0,451s] GC(0) Pause Young (Normal) (G1 Evacuation Pause)
[2020-04-15T11:42:35.652+0200][0,451s] GC(0) Using 8 workers of 8 for evacuation
[2020-04-15T11:42:35.661+0200][0,460s] GC(0)   Pre Evacuate Collection Set: 0,0ms
[2020-04-15T11:42:35.661+0200][0,460s] GC(0)   Evacuate Collection Set: 7,9ms
[2020-04-15T11:42:35.661+0200][0,460s] GC(0)   Post Evacuate Collection Set: 1,1ms
[2020-04-15T11:42:35.661+0200][0,460s] GC(0)   Other: 0,5ms
[2020-04-15T11:42:35.661+0200][0,460s] GC(0) Eden regions: 30->0(303)
[2020-04-15T11:42:35.661+0200][0,460s] GC(0) Survivor regions: 0->4(4)
[2020-04-15T11:42:35.661+0200][0,460s] GC(0) Old regions: 2->2
[2020-04-15T11:42:35.661+0200][0,460s] GC(0) Humongous regions: 0->0
[2020-04-15T11:42:35.661+0200][0,460s] GC(0) Metaspace: 7714K->7714K(1056768K)
[2020-04-15T11:42:35.661+0200][0,460s] GC(0) Pause Young (Normal) (G1 Evacuation Pause) 30M->3M(512M) 9,577ms
[2020-04-15T11:42:35.661+0200][0,460s] GC(0) User=0,07s Sys=0,00s Real=0,01s
[2020-04-15T11:42:36.584+0200][1,383s] GC(1) Pause Young (Concurrent Start) (Metadata GC Threshold)
[2020-04-15T11:42:36.584+0200][1,383s] GC(1) Using 8 workers of 8 for evacuation
[2020-04-15T11:42:36.601+0200][1,400s] GC(1)   Pre Evacuate Collection Set: 0,0ms
[2020-04-15T11:42:36.601+0200][1,400s] GC(1)   Evacuate Collection Set: 14,7ms
[2020-04-15T11:42:36.601+0200][1,400s] GC(1)   Post Evacuate Collection Set: 1,9ms
[2020-04-15T11:42:36.601+0200][1,400s] GC(1)   Other: 0,2ms
[2020-04-15T11:42:36.601+0200][1,400s] GC(1) Eden regions: 103->0(98)
[2020-04-15T11:42:36.601+0200][1,400s] GC(1) Survivor regions: 4->19(39)
[2020-04-15T11:42:36.601+0200][1,400s] GC(1) Old regions: 2->2
[2020-04-15T11:42:36.601+0200][1,400s] GC(1) Humongous regions: 4->4
[2020-04-15T11:42:36.601+0200][1,400s] GC(1) Metaspace: 20365K->20365K(1069056K)
[2020-04-15T11:42:36.601+0200][1,400s] GC(1) Pause Young (Concurrent Start) (Metadata GC Threshold) 110M->23M(512M) 16,956ms
[2020-04-15T11:42:36.601+0200][1,400s] GC(1) User=0,11s Sys=0,00s Real=0,01s
[2020-04-15T11:42:36.601+0200][1,400s] GC(2) Concurrent Cycle
[2020-04-15T11:42:36.601+0200][1,400s] GC(2) Concurrent Clear Claimed Marks
[2020-04-15T11:42:36.601+0200][1,400s] GC(2) Concurrent Clear Claimed Marks 0,035ms
[2020-04-15T11:42:36.601+0200][1,400s] GC(2) Concurrent Scan Root Regions
[2020-04-15T11:42:36.605+0200][1,404s] GC(2) Concurrent Scan Root Regions 3,766ms
[2020-04-15T11:42:36.605+0200][1,404s] GC(2) Concurrent Mark (1,404s)
[2020-04-15T11:42:36.605+0200][1,404s] GC(2) Concurrent Mark From Roots
[2020-04-15T11:42:36.605+0200][1,404s] GC(2) Using 2 workers of 2 for marking
[2020-04-15T11:42:36.610+0200][1,409s] GC(2) Concurrent Mark From Roots 4,752ms
[2020-04-15T11:42:36.610+0200][1,409s] GC(2) Concurrent Preclean
[2020-04-15T11:42:36.610+0200][1,409s] GC(2) Concurrent Preclean 0,127ms
[2020-04-15T11:42:36.610+0200][1,409s] GC(2) Concurrent Mark (1,404s, 1,409s) 4,912ms
[2020-04-15T11:42:36.610+0200][1,409s] GC(2) Pause Remark
[2020-04-15T11:42:36.612+0200][1,411s] GC(2) Cleaned string and symbol table, strings: 9400 processed, 0 removed, symbols: 58998 processed, 27 removed
[2020-04-15T11:42:36.612+0200][1,411s] GC(2) Pause Remark 23M->23M(512M) 2,135ms
[2020-04-15T11:42:36.612+0200][1,411s] GC(2) User=0,01s Sys=0,00s Real=0,00s
[2020-04-15T11:42:36.613+0200][1,411s] GC(2) Concurrent Rebuild Remembered Sets
[2020-04-15T11:42:36.615+0200][1,414s] GC(2) Concurrent Rebuild Remembered Sets 2,821ms
[2020-04-15T11:42:36.615+0200][1,414s] GC(2) Pause Cleanup
[2020-04-15T11:42:36.616+0200][1,414s] GC(2) Pause Cleanup 23M->23M(512M) 0,103ms
[2020-04-15T11:42:36.616+0200][1,414s] GC(2) User=0,00s Sys=0,00s Real=0,00s
[2020-04-15T11:42:36.616+0200][1,414s] GC(2) Concurrent Cleanup for Next Mark
[2020-04-15T11:42:36.618+0200][1,417s] GC(2) Concurrent Cleanup for Next Mark 2,770ms
[2020-04-15T11:42:36.618+0200][1,417s] GC(2) Concurrent Cycle 17,137ms
[2020-04-15T11:42:37.461+0200][2,260s] GC(3) Pause Young (Normal) (G1 Evacuation Pause)
[2020-04-15T11:42:37.461+0200][2,260s] GC(3) Using 8 workers of 8 for evacuation
[2020-04-15T11:42:37.474+0200][2,273s] GC(3)   Pre Evacuate Collection Set: 0,0ms
[2020-04-15T11:42:37.474+0200][2,273s] GC(3)   Evacuate Collection Set: 11,6ms
[2020-04-15T11:42:37.474+0200][2,273s] GC(3)   Post Evacuate Collection Set: 1,1ms
[2020-04-15T11:42:37.474+0200][2,273s] GC(3)   Other: 0,1ms
[2020-04-15T11:42:37.474+0200][2,273s] GC(3) Eden regions: 91->0(157)
[2020-04-15T11:42:37.474+0200][2,273s] GC(3) Survivor regions: 19->6(14)
[2020-04-15T11:42:37.474+0200][2,273s] GC(3) Old regions: 2->20
[2020-04-15T11:42:37.474+0200][2,273s] GC(3) Humongous regions: 4->4
[2020-04-15T11:42:37.474+0200][2,273s] GC(3) Metaspace: 31789K->31789K(1079296K)
[2020-04-15T11:42:37.474+0200][2,273s] GC(3) Pause Young (Normal) (G1 Evacuation Pause) 114M->28M(512M) 12,875ms
[2020-04-15T11:42:37.474+0200][2,273s] GC(3) User=0,08s Sys=0,02s Real=0,01s
[2020-04-15T11:42:37.869+0200][2,668s] GC(4) Pause Young (Concurrent Start) (Metadata GC Threshold)
[2020-04-15T11:42:37.869+0200][2,668s] GC(4) Using 8 workers of 8 for evacuation
[2020-04-15T11:42:37.875+0200][2,674s] GC(4)   Pre Evacuate Collection Set: 0,1ms
[2020-04-15T11:42:37.875+0200][2,674s] GC(4)   Evacuate Collection Set: 5,7ms
[2020-04-15T11:42:37.875+0200][2,674s] GC(4)   Post Evacuate Collection Set: 0,4ms
[2020-04-15T11:42:37.875+0200][2,674s] GC(4)   Other: 0,2ms
[2020-04-15T11:42:37.875+0200][2,674s] GC(4) Eden regions: 79->0(159)
[2020-04-15T11:42:37.875+0200][2,674s] GC(4) Survivor regions: 6->11(21)
[2020-04-15T11:42:37.875+0200][2,674s] GC(4) Old regions: 20->20
[2020-04-15T11:42:37.875+0200][2,674s] GC(4) Humongous regions: 6->5
[2020-04-15T11:42:37.875+0200][2,674s] GC(4) Metaspace: 34734K->34734K(1081344K)
[2020-04-15T11:42:37.875+0200][2,674s] GC(4) Pause Young (Concurrent Start) (Metadata GC Threshold) 108M->34M(512M) 6,355ms
[2020-04-15T11:42:37.875+0200][2,674s] GC(4) User=0,04s Sys=0,00s Real=0,01s
[2020-04-15T11:42:37.875+0200][2,674s] GC(5) Concurrent Cycle
[2020-04-15T11:42:37.875+0200][2,674s] GC(5) Concurrent Clear Claimed Marks
[2020-04-15T11:42:37.875+0200][2,674s] GC(5) Concurrent Clear Claimed Marks 0,024ms
[2020-04-15T11:42:37.875+0200][2,674s] GC(5) Concurrent Scan Root Regions
[2020-04-15T11:42:37.878+0200][2,677s] GC(5) Concurrent Scan Root Regions 2,886ms
[2020-04-15T11:42:37.878+0200][2,677s] GC(5) Concurrent Mark (2,677s)
[2020-04-15T11:42:37.878+0200][2,677s] GC(5) Concurrent Mark From Roots
[2020-04-15T11:42:37.878+0200][2,677s] GC(5) Using 2 workers of 2 for marking
[2020-04-15T11:42:37.894+0200][2,692s] GC(5) Concurrent Mark From Roots 15,495ms
[2020-04-15T11:42:37.894+0200][2,692s] GC(5) Concurrent Preclean
[2020-04-15T11:42:37.894+0200][2,693s] GC(5) Concurrent Preclean 0,133ms
[2020-04-15T11:42:37.894+0200][2,693s] GC(5) Concurrent Mark (2,677s, 2,693s) 15,677ms
[2020-04-15T11:42:37.894+0200][2,693s] GC(5) Pause Remark
[2020-04-15T11:42:37.903+0200][2,702s] GC(5) Cleaned string and symbol table, strings: 16238 processed, 23 removed, symbols: 102127 processed, 85 removed
[2020-04-15T11:42:37.903+0200][2,702s] GC(5) Pause Remark 39M->39M(512M) 9,314ms
[2020-04-15T11:42:37.903+0200][2,702s] GC(5) User=0,07s Sys=0,00s Real=0,02s
[2020-04-15T11:42:37.903+0200][2,702s] GC(5) Concurrent Rebuild Remembered Sets
[2020-04-15T11:42:37.912+0200][2,711s] GC(5) Concurrent Rebuild Remembered Sets 8,766ms
[2020-04-15T11:42:37.912+0200][2,711s] GC(5) Pause Cleanup
[2020-04-15T11:42:37.912+0200][2,711s] GC(5) Pause Cleanup 41M->41M(512M) 0,102ms
[2020-04-15T11:42:37.912+0200][2,711s] GC(5) User=0,00s Sys=0,00s Real=0,00s
[2020-04-15T11:42:37.912+0200][2,711s] GC(5) Concurrent Cleanup for Next Mark
[2020-04-15T11:42:37.913+0200][2,712s] GC(5) Concurrent Cleanup for Next Mark 1,013ms
[2020-04-15T11:42:37.913+0200][2,712s] GC(5) Concurrent Cycle 38,192ms
[2020-04-15T11:42:38.211+0200][3,009s] GC(6) Pause Young (Normal) (G1 Evacuation Pause)
[2020-04-15T11:42:38.211+0200][3,010s] GC(6) Using 8 workers of 8 for evacuation
[2020-04-15T11:42:38.216+0200][3,015s] GC(6)   Pre Evacuate Collection Set: 0,0ms
[2020-04-15T11:42:38.216+0200][3,015s] GC(6)   Evacuate Collection Set: 5,0ms
[2020-04-15T11:42:38.216+0200][3,015s] GC(6)   Post Evacuate Collection Set: 0,4ms
[2020-04-15T11:42:38.216+0200][3,015s] GC(6)   Other: 0,1ms
[2020-04-15T11:42:38.216+0200][3,015s] GC(6) Eden regions: 159->0(204)
[2020-04-15T11:42:38.216+0200][3,015s] GC(6) Survivor regions: 11->12(22)
[2020-04-15T11:42:38.216+0200][3,015s] GC(6) Old regions: 20->20
[2020-04-15T11:42:38.216+0200][3,015s] GC(6) Humongous regions: 5->5
[2020-04-15T11:42:38.216+0200][3,015s] GC(6) Metaspace: 36109K->36109K(1081344K)
[2020-04-15T11:42:38.216+0200][3,015s] GC(6) Pause Young (Normal) (G1 Evacuation Pause) 193M->35M(512M) 5,583ms
[2020-04-15T11:42:38.216+0200][3,015s] GC(6) User=0,04s Sys=0,00s Real=0,01s
[2020-04-15T11:45:15.431+0200][160,230s] Heap
[2020-04-15T11:45:15.431+0200][160,230s]  garbage-first heap   total 524288K, used 146009K [0x00000000e0000000, 0x0000000100000000)
[2020-04-15T11:45:15.431+0200][160,230s]   region size 1024K, 120 young (122880K), 12 survivors (12288K)
[2020-04-15T11:45:15.431+0200][160,230s]  Metaspace       used 38843K, capacity 39778K, committed 39984K, reserved 1085440K
[2020-04-15T11:45:15.431+0200][160,230s]   class space    used 4529K, capacity 4910K, committed 4992K, reserved 1048576K
