[2020-04-15T11:45:17.614+0200][0.005s] Heap region size: 1M
[2020-04-15T11:45:17.623+0200][0.014s] Using G1
[2020-04-15T11:45:17.623+0200][0.014s] Heap address: 0x00000000e0000000, size: 512 MB, Compressed Oops mode: 32-bit
[2020-04-15T11:45:17.623+0200][0.014s] Mark closed archive regions in map: [0x00000000fff00000, 0x00000000fff69ff8]
[2020-04-15T11:45:17.623+0200][0.014s] Mark open archive regions in map: [0x00000000ffe00000, 0x00000000ffe46ff8]
[2020-04-15T11:45:18.046+0200][0,437s] GC(0) Pause Young (Normal) (G1 Evacuation Pause)
[2020-04-15T11:45:18.047+0200][0,437s] GC(0) Using 8 workers of 8 for evacuation
[2020-04-15T11:45:18.055+0200][0,446s] GC(0)   Pre Evacuate Collection Set: 0,0ms
[2020-04-15T11:45:18.055+0200][0,446s] GC(0)   Evacuate Collection Set: 7,3ms
[2020-04-15T11:45:18.055+0200][0,446s] GC(0)   Post Evacuate Collection Set: 0,9ms
[2020-04-15T11:45:18.055+0200][0,446s] GC(0)   Other: 0,7ms
[2020-04-15T11:45:18.055+0200][0,446s] GC(0) Eden regions: 30->0(303)
[2020-04-15T11:45:18.055+0200][0,446s] GC(0) Survivor regions: 0->4(4)
[2020-04-15T11:45:18.055+0200][0,446s] GC(0) Old regions: 2->2
[2020-04-15T11:45:18.055+0200][0,446s] GC(0) Humongous regions: 0->0
[2020-04-15T11:45:18.055+0200][0,446s] GC(0) Metaspace: 8004K->8004K(1056768K)
[2020-04-15T11:45:18.055+0200][0,446s] GC(0) Pause Young (Normal) (G1 Evacuation Pause) 30M->3M(512M) 8,911ms
[2020-04-15T11:45:18.055+0200][0,446s] GC(0) User=0,06s Sys=0,00s Real=0,01s
[2020-04-15T11:45:18.962+0200][1,353s] GC(1) Pause Young (Concurrent Start) (Metadata GC Threshold)
[2020-04-15T11:45:18.962+0200][1,353s] GC(1) Using 8 workers of 8 for evacuation
[2020-04-15T11:45:18.979+0200][1,369s] GC(1)   Pre Evacuate Collection Set: 0,0ms
[2020-04-15T11:45:18.979+0200][1,369s] GC(1)   Evacuate Collection Set: 15,0ms
[2020-04-15T11:45:18.979+0200][1,369s] GC(1)   Post Evacuate Collection Set: 1,4ms
[2020-04-15T11:45:18.979+0200][1,369s] GC(1)   Other: 0,2ms
[2020-04-15T11:45:18.979+0200][1,369s] GC(1) Eden regions: 99->0(93)
[2020-04-15T11:45:18.979+0200][1,369s] GC(1) Survivor regions: 4->19(39)
[2020-04-15T11:45:18.979+0200][1,369s] GC(1) Old regions: 2->2
[2020-04-15T11:45:18.979+0200][1,369s] GC(1) Humongous regions: 4->4
[2020-04-15T11:45:18.979+0200][1,369s] GC(1) Metaspace: 20503K->20503K(1069056K)
[2020-04-15T11:45:18.979+0200][1,369s] GC(1) Pause Young (Concurrent Start) (Metadata GC Threshold) 106M->23M(512M) 16,702ms
[2020-04-15T11:45:18.979+0200][1,369s] GC(1) User=0,11s Sys=0,00s Real=0,01s
[2020-04-15T11:45:18.979+0200][1,369s] GC(2) Concurrent Cycle
[2020-04-15T11:45:18.979+0200][1,369s] GC(2) Concurrent Clear Claimed Marks
[2020-04-15T11:45:18.979+0200][1,369s] GC(2) Concurrent Clear Claimed Marks 0,052ms
[2020-04-15T11:45:18.979+0200][1,369s] GC(2) Concurrent Scan Root Regions
[2020-04-15T11:45:18.983+0200][1,373s] GC(2) Concurrent Scan Root Regions 3,648ms
[2020-04-15T11:45:18.983+0200][1,373s] GC(2) Concurrent Mark (1,373s)
[2020-04-15T11:45:18.983+0200][1,373s] GC(2) Concurrent Mark From Roots
[2020-04-15T11:45:18.983+0200][1,373s] GC(2) Using 2 workers of 2 for marking
[2020-04-15T11:45:18.984+0200][1,374s] GC(2) Concurrent Mark From Roots 1,219ms
[2020-04-15T11:45:18.984+0200][1,374s] GC(2) Concurrent Preclean
[2020-04-15T11:45:18.984+0200][1,375s] GC(2) Concurrent Preclean 0,319ms
[2020-04-15T11:45:18.984+0200][1,375s] GC(2) Concurrent Mark (1,373s, 1,375s) 1,578ms
[2020-04-15T11:45:18.984+0200][1,375s] GC(2) Pause Remark
[2020-04-15T11:45:18.991+0200][1,381s] GC(2) Cleaned string and symbol table, strings: 9412 processed, 0 removed, symbols: 60141 processed, 27 removed
[2020-04-15T11:45:18.991+0200][1,381s] GC(2) Pause Remark 23M->23M(512M) 6,342ms
[2020-04-15T11:45:18.991+0200][1,381s] GC(2) User=0,04s Sys=0,00s Real=0,00s
[2020-04-15T11:45:18.991+0200][1,382s] GC(2) Concurrent Rebuild Remembered Sets
[2020-04-15T11:45:18.995+0200][1,385s] GC(2) Concurrent Rebuild Remembered Sets 3,484ms
[2020-04-15T11:45:18.995+0200][1,385s] GC(2) Pause Cleanup
[2020-04-15T11:45:18.995+0200][1,385s] GC(2) Pause Cleanup 23M->23M(512M) 0,124ms
[2020-04-15T11:45:18.995+0200][1,385s] GC(2) User=0,00s Sys=0,00s Real=0,00s
[2020-04-15T11:45:18.995+0200][1,385s] GC(2) Concurrent Cleanup for Next Mark
[2020-04-15T11:45:18.999+0200][1,389s] GC(2) Concurrent Cleanup for Next Mark 3,819ms
[2020-04-15T11:45:18.999+0200][1,389s] GC(2) Concurrent Cycle 19,808ms
[2020-04-15T11:45:19.689+0200][2,079s] GC(3) Pause Young (Normal) (G1 Evacuation Pause)
[2020-04-15T11:45:19.689+0200][2,079s] GC(3) Using 8 workers of 8 for evacuation
[2020-04-15T11:45:19.710+0200][2,101s] GC(3)   Pre Evacuate Collection Set: 0,0ms
[2020-04-15T11:45:19.710+0200][2,101s] GC(3)   Evacuate Collection Set: 18,8ms
[2020-04-15T11:45:19.710+0200][2,101s] GC(3)   Post Evacuate Collection Set: 2,9ms
[2020-04-15T11:45:19.710+0200][2,101s] GC(3)   Other: 0,1ms
[2020-04-15T11:45:19.710+0200][2,101s] GC(3) Eden regions: 84->0(138)
[2020-04-15T11:45:19.710+0200][2,101s] GC(3) Survivor regions: 19->5(13)
[2020-04-15T11:45:19.710+0200][2,101s] GC(3) Old regions: 2->21
[2020-04-15T11:45:19.710+0200][2,101s] GC(3) Humongous regions: 4->4
[2020-04-15T11:45:19.710+0200][2,101s] GC(3) Metaspace: 30518K->30518K(1077248K)
[2020-04-15T11:45:19.710+0200][2,101s] GC(3) Pause Young (Normal) (G1 Evacuation Pause) 107M->27M(512M) 21,868ms
[2020-04-15T11:45:19.710+0200][2,101s] GC(3) User=0,11s Sys=0,02s Real=0,02s
[2020-04-15T11:45:20.123+0200][2,513s] GC(4) Pause Young (Concurrent Start) (Metadata GC Threshold)
[2020-04-15T11:45:20.123+0200][2,513s] GC(4) Using 8 workers of 8 for evacuation
[2020-04-15T11:45:20.130+0200][2,520s] GC(4)   Pre Evacuate Collection Set: 0,1ms
[2020-04-15T11:45:20.130+0200][2,520s] GC(4)   Evacuate Collection Set: 6,5ms
[2020-04-15T11:45:20.130+0200][2,520s] GC(4)   Post Evacuate Collection Set: 0,3ms
[2020-04-15T11:45:20.130+0200][2,520s] GC(4)   Other: 0,2ms
[2020-04-15T11:45:20.130+0200][2,520s] GC(4) Eden regions: 90->0(159)
[2020-04-15T11:45:20.130+0200][2,520s] GC(4) Survivor regions: 5->11(18)
[2020-04-15T11:45:20.130+0200][2,520s] GC(4) Old regions: 21->21
[2020-04-15T11:45:20.130+0200][2,520s] GC(4) Humongous regions: 6->5
[2020-04-15T11:45:20.130+0200][2,520s] GC(4) Metaspace: 34774K->34774K(1081344K)
[2020-04-15T11:45:20.130+0200][2,520s] GC(4) Pause Young (Concurrent Start) (Metadata GC Threshold) 119M->34M(512M) 7,110ms
[2020-04-15T11:45:20.130+0200][2,520s] GC(4) User=0,04s Sys=0,00s Real=0,00s
[2020-04-15T11:45:20.130+0200][2,520s] GC(5) Concurrent Cycle
[2020-04-15T11:45:20.130+0200][2,520s] GC(5) Concurrent Clear Claimed Marks
[2020-04-15T11:45:20.130+0200][2,520s] GC(5) Concurrent Clear Claimed Marks 0,044ms
[2020-04-15T11:45:20.130+0200][2,520s] GC(5) Concurrent Scan Root Regions
[2020-04-15T11:45:20.132+0200][2,523s] GC(5) Concurrent Scan Root Regions 2,326ms
[2020-04-15T11:45:20.132+0200][2,523s] GC(5) Concurrent Mark (2,523s)
[2020-04-15T11:45:20.132+0200][2,523s] GC(5) Concurrent Mark From Roots
[2020-04-15T11:45:20.132+0200][2,523s] GC(5) Using 2 workers of 2 for marking
[2020-04-15T11:45:20.149+0200][2,540s] GC(5) Concurrent Mark From Roots 16,882ms
[2020-04-15T11:45:20.149+0200][2,540s] GC(5) Concurrent Preclean
[2020-04-15T11:45:20.149+0200][2,540s] GC(5) Concurrent Preclean 0,109ms
[2020-04-15T11:45:20.149+0200][2,540s] GC(5) Concurrent Mark (2,523s, 2,540s) 17,038ms
[2020-04-15T11:45:20.150+0200][2,540s] GC(5) Pause Remark
[2020-04-15T11:45:20.155+0200][2,546s] GC(5) Cleaned string and symbol table, strings: 16294 processed, 23 removed, symbols: 102305 processed, 85 removed
[2020-04-15T11:45:20.155+0200][2,546s] GC(5) Pause Remark 40M->40M(512M) 5,867ms
[2020-04-15T11:45:20.155+0200][2,546s] GC(5) User=0,04s Sys=0,00s Real=0,01s
[2020-04-15T11:45:20.156+0200][2,546s] GC(5) Concurrent Rebuild Remembered Sets
[2020-04-15T11:45:20.166+0200][2,557s] GC(5) Concurrent Rebuild Remembered Sets 10,707ms
[2020-04-15T11:45:20.166+0200][2,557s] GC(5) Pause Cleanup
[2020-04-15T11:45:20.166+0200][2,557s] GC(5) Pause Cleanup 46M->46M(512M) 0,101ms
[2020-04-15T11:45:20.166+0200][2,557s] GC(5) User=0,00s Sys=0,00s Real=0,00s
[2020-04-15T11:45:20.167+0200][2,557s] GC(5) Concurrent Cleanup for Next Mark
[2020-04-15T11:45:20.168+0200][2,558s] GC(5) Concurrent Cleanup for Next Mark 1,020ms
[2020-04-15T11:45:20.168+0200][2,558s] GC(5) Concurrent Cycle 37,602ms
[2020-04-15T11:45:20.456+0200][2,847s] GC(6) Pause Young (Normal) (G1 Evacuation Pause)
[2020-04-15T11:45:20.456+0200][2,847s] GC(6) Using 8 workers of 8 for evacuation
[2020-04-15T11:45:20.466+0200][2,856s] GC(6)   Pre Evacuate Collection Set: 0,0ms
[2020-04-15T11:45:20.466+0200][2,856s] GC(6)   Evacuate Collection Set: 9,0ms
[2020-04-15T11:45:20.466+0200][2,856s] GC(6)   Post Evacuate Collection Set: 0,5ms
[2020-04-15T11:45:20.466+0200][2,856s] GC(6)   Other: 0,2ms
[2020-04-15T11:45:20.466+0200][2,856s] GC(6) Eden regions: 159->0(231)
[2020-04-15T11:45:20.466+0200][2,856s] GC(6) Survivor regions: 11->12(22)
[2020-04-15T11:45:20.466+0200][2,856s] GC(6) Old regions: 21->21
[2020-04-15T11:45:20.466+0200][2,856s] GC(6) Humongous regions: 5->5
[2020-04-15T11:45:20.466+0200][2,856s] GC(6) Metaspace: 36159K->36159K(1081344K)
[2020-04-15T11:45:20.466+0200][2,856s] GC(6) Pause Young (Normal) (G1 Evacuation Pause) 193M->35M(512M) 9,759ms
[2020-04-15T11:45:20.466+0200][2,856s] GC(6) User=0,06s Sys=0,02s Real=0,01s
[2020-04-15T11:48:09.128+0200][171,518s] Heap
[2020-04-15T11:48:09.128+0200][171,518s]  garbage-first heap   total 524288K, used 214204K [0x00000000e0000000, 0x0000000100000000)
[2020-04-15T11:48:09.128+0200][171,518s]   region size 1024K, 187 young (191488K), 12 survivors (12288K)
[2020-04-15T11:48:09.128+0200][171,518s]  Metaspace       used 43202K, capacity 44191K, committed 44336K, reserved 1087488K
[2020-04-15T11:48:09.128+0200][171,518s]   class space    used 5035K, capacity 5417K, committed 5504K, reserved 1048576K
