[2020-04-15T12:12:06.791+0200][0.006s] Heap region size: 1M
[2020-04-15T12:12:06.802+0200][0.017s] Using G1
[2020-04-15T12:12:06.802+0200][0.017s] Heap address: 0x00000000e0000000, size: 512 MB, Compressed Oops mode: 32-bit
[2020-04-15T12:12:06.803+0200][0.017s] Mark closed archive regions in map: [0x00000000fff00000, 0x00000000fff69ff8]
[2020-04-15T12:12:06.803+0200][0.017s] Mark open archive regions in map: [0x00000000ffe00000, 0x00000000ffe46ff8]
[2020-04-15T12:12:07.387+0200][0,602s] GC(0) Pause Young (Normal) (G1 Evacuation Pause)
[2020-04-15T12:12:07.390+0200][0,605s] GC(0) Using 8 workers of 8 for evacuation
[2020-04-15T12:12:07.400+0200][0,615s] GC(0)   Pre Evacuate Collection Set: 0,0ms
[2020-04-15T12:12:07.400+0200][0,615s] GC(0)   Evacuate Collection Set: 8,7ms
[2020-04-15T12:12:07.400+0200][0,615s] GC(0)   Post Evacuate Collection Set: 1,0ms
[2020-04-15T12:12:07.400+0200][0,615s] GC(0)   Other: 3,5ms
[2020-04-15T12:12:07.400+0200][0,615s] GC(0) Eden regions: 30->0(303)
[2020-04-15T12:12:07.400+0200][0,615s] GC(0) Survivor regions: 0->4(4)
[2020-04-15T12:12:07.400+0200][0,615s] GC(0) Old regions: 2->2
[2020-04-15T12:12:07.400+0200][0,615s] GC(0) Humongous regions: 0->0
[2020-04-15T12:12:07.400+0200][0,615s] GC(0) Metaspace: 8233K->8233K(1056768K)
[2020-04-15T12:12:07.400+0200][0,615s] GC(0) Pause Young (Normal) (G1 Evacuation Pause) 30M->4M(512M) 13,286ms
[2020-04-15T12:12:07.400+0200][0,615s] GC(0) User=0,06s Sys=0,00s Real=0,01s
[2020-04-15T12:12:08.627+0200][1,842s] GC(1) Pause Young (Concurrent Start) (Metadata GC Threshold)
[2020-04-15T12:12:08.627+0200][1,842s] GC(1) Using 8 workers of 8 for evacuation
[2020-04-15T12:12:08.644+0200][1,859s] GC(1)   Pre Evacuate Collection Set: 0,1ms
[2020-04-15T12:12:08.644+0200][1,859s] GC(1)   Evacuate Collection Set: 15,6ms
[2020-04-15T12:12:08.644+0200][1,859s] GC(1)   Post Evacuate Collection Set: 1,4ms
[2020-04-15T12:12:08.644+0200][1,859s] GC(1)   Other: 0,3ms
[2020-04-15T12:12:08.644+0200][1,859s] GC(1) Eden regions: 96->0(90)
[2020-04-15T12:12:08.644+0200][1,859s] GC(1) Survivor regions: 4->19(39)
[2020-04-15T12:12:08.644+0200][1,859s] GC(1) Old regions: 2->2
[2020-04-15T12:12:08.644+0200][1,859s] GC(1) Humongous regions: 4->4
[2020-04-15T12:12:08.644+0200][1,859s] GC(1) Metaspace: 20428K->20428K(1069056K)
[2020-04-15T12:12:08.644+0200][1,859s] GC(1) Pause Young (Concurrent Start) (Metadata GC Threshold) 104M->23M(512M) 17,352ms
[2020-04-15T12:12:08.644+0200][1,859s] GC(1) User=0,09s Sys=0,01s Real=0,02s
[2020-04-15T12:12:08.644+0200][1,859s] GC(2) Concurrent Cycle
[2020-04-15T12:12:08.644+0200][1,859s] GC(2) Concurrent Clear Claimed Marks
[2020-04-15T12:12:08.644+0200][1,859s] GC(2) Concurrent Clear Claimed Marks 0,034ms
[2020-04-15T12:12:08.644+0200][1,859s] GC(2) Concurrent Scan Root Regions
[2020-04-15T12:12:08.649+0200][1,864s] GC(2) Concurrent Scan Root Regions 4,343ms
[2020-04-15T12:12:08.649+0200][1,864s] GC(2) Concurrent Mark (1,864s)
[2020-04-15T12:12:08.649+0200][1,864s] GC(2) Concurrent Mark From Roots
[2020-04-15T12:12:08.649+0200][1,864s] GC(2) Using 2 workers of 2 for marking
[2020-04-15T12:12:08.652+0200][1,867s] GC(2) Concurrent Mark From Roots 3,188ms
[2020-04-15T12:12:08.652+0200][1,867s] GC(2) Concurrent Preclean
[2020-04-15T12:12:08.652+0200][1,867s] GC(2) Concurrent Preclean 0,252ms
[2020-04-15T12:12:08.652+0200][1,867s] GC(2) Concurrent Mark (1,864s, 1,867s) 3,490ms
[2020-04-15T12:12:08.653+0200][1,867s] GC(2) Pause Remark
[2020-04-15T12:12:08.659+0200][1,874s] GC(2) Cleaned string and symbol table, strings: 9412 processed, 0 removed, symbols: 59317 processed, 26 removed
[2020-04-15T12:12:08.659+0200][1,874s] GC(2) Pause Remark 24M->24M(512M) 6,818ms
[2020-04-15T12:12:08.659+0200][1,874s] GC(2) User=0,03s Sys=0,00s Real=0,01s
[2020-04-15T12:12:08.659+0200][1,874s] GC(2) Concurrent Rebuild Remembered Sets
[2020-04-15T12:12:08.662+0200][1,877s] GC(2) Concurrent Rebuild Remembered Sets 2,834ms
[2020-04-15T12:12:08.662+0200][1,877s] GC(2) Pause Cleanup
[2020-04-15T12:12:08.663+0200][1,877s] GC(2) Pause Cleanup 24M->24M(512M) 0,142ms
[2020-04-15T12:12:08.663+0200][1,877s] GC(2) User=0,00s Sys=0,00s Real=0,00s
[2020-04-15T12:12:08.663+0200][1,878s] GC(2) Concurrent Cleanup for Next Mark
[2020-04-15T12:12:08.664+0200][1,879s] GC(2) Concurrent Cleanup for Next Mark 1,001ms
[2020-04-15T12:12:08.664+0200][1,879s] GC(2) Concurrent Cycle 19,391ms
[2020-04-15T12:12:09.572+0200][2,787s] GC(3) Pause Young (Normal) (G1 Evacuation Pause)
[2020-04-15T12:12:09.572+0200][2,787s] GC(3) Using 8 workers of 8 for evacuation
[2020-04-15T12:12:09.592+0200][2,807s] GC(3)   Pre Evacuate Collection Set: 0,0ms
[2020-04-15T12:12:09.592+0200][2,807s] GC(3)   Evacuate Collection Set: 18,5ms
[2020-04-15T12:12:09.592+0200][2,807s] GC(3)   Post Evacuate Collection Set: 1,5ms
[2020-04-15T12:12:09.592+0200][2,807s] GC(3)   Other: 0,1ms
[2020-04-15T12:12:09.592+0200][2,807s] GC(3) Eden regions: 82->0(137)
[2020-04-15T12:12:09.592+0200][2,807s] GC(3) Survivor regions: 19->5(13)
[2020-04-15T12:12:09.592+0200][2,807s] GC(3) Old regions: 2->20
[2020-04-15T12:12:09.592+0200][2,807s] GC(3) Humongous regions: 4->4
[2020-04-15T12:12:09.592+0200][2,807s] GC(3) Metaspace: 30527K->30527K(1077248K)
[2020-04-15T12:12:09.592+0200][2,807s] GC(3) Pause Young (Normal) (G1 Evacuation Pause) 105M->27M(512M) 20,145ms
[2020-04-15T12:12:09.592+0200][2,807s] GC(3) User=0,11s Sys=0,01s Real=0,02s
[2020-04-15T12:12:10.105+0200][3,320s] GC(4) Pause Young (Concurrent Start) (Metadata GC Threshold)
[2020-04-15T12:12:10.105+0200][3,320s] GC(4) Using 8 workers of 8 for evacuation
[2020-04-15T12:12:10.112+0200][3,327s] GC(4)   Pre Evacuate Collection Set: 0,1ms
[2020-04-15T12:12:10.112+0200][3,327s] GC(4)   Evacuate Collection Set: 6,9ms
[2020-04-15T12:12:10.112+0200][3,327s] GC(4)   Post Evacuate Collection Set: 0,4ms
[2020-04-15T12:12:10.112+0200][3,327s] GC(4)   Other: 0,1ms
[2020-04-15T12:12:10.112+0200][3,327s] GC(4) Eden regions: 92->0(148)
[2020-04-15T12:12:10.112+0200][3,327s] GC(4) Survivor regions: 5->11(18)
[2020-04-15T12:12:10.112+0200][3,327s] GC(4) Old regions: 20->20
[2020-04-15T12:12:10.112+0200][3,327s] GC(4) Humongous regions: 6->5
[2020-04-15T12:12:10.112+0200][3,327s] GC(4) Metaspace: 34865K->34865K(1081344K)
[2020-04-15T12:12:10.112+0200][3,327s] GC(4) Pause Young (Concurrent Start) (Metadata GC Threshold) 120M->34M(512M) 7,552ms
[2020-04-15T12:12:10.112+0200][3,327s] GC(4) User=0,05s Sys=0,00s Real=0,00s
[2020-04-15T12:12:10.112+0200][3,327s] GC(5) Concurrent Cycle
[2020-04-15T12:12:10.112+0200][3,327s] GC(5) Concurrent Clear Claimed Marks
[2020-04-15T12:12:10.112+0200][3,327s] GC(5) Concurrent Clear Claimed Marks 0,028ms
[2020-04-15T12:12:10.112+0200][3,327s] GC(5) Concurrent Scan Root Regions
[2020-04-15T12:12:10.115+0200][3,330s] GC(5) Concurrent Scan Root Regions 3,047ms
[2020-04-15T12:12:10.115+0200][3,330s] GC(5) Concurrent Mark (3,330s)
[2020-04-15T12:12:10.115+0200][3,330s] GC(5) Concurrent Mark From Roots
[2020-04-15T12:12:10.115+0200][3,330s] GC(5) Using 2 workers of 2 for marking
[2020-04-15T12:12:10.137+0200][3,352s] GC(5) Concurrent Mark From Roots 21,485ms
[2020-04-15T12:12:10.137+0200][3,352s] GC(5) Concurrent Preclean
[2020-04-15T12:12:10.137+0200][3,352s] GC(5) Concurrent Preclean 0,111ms
[2020-04-15T12:12:10.137+0200][3,352s] GC(5) Concurrent Mark (3,330s, 3,352s) 21,651ms
[2020-04-15T12:12:10.137+0200][3,352s] GC(5) Pause Remark
[2020-04-15T12:12:10.145+0200][3,360s] GC(5) Cleaned string and symbol table, strings: 16275 processed, 23 removed, symbols: 102326 processed, 95 removed
[2020-04-15T12:12:10.145+0200][3,360s] GC(5) Pause Remark 41M->41M(512M) 7,891ms
[2020-04-15T12:12:10.145+0200][3,360s] GC(5) User=0,05s Sys=0,00s Real=0,01s
[2020-04-15T12:12:10.145+0200][3,360s] GC(5) Concurrent Rebuild Remembered Sets
[2020-04-15T12:12:10.155+0200][3,370s] GC(5) Concurrent Rebuild Remembered Sets 10,272ms
[2020-04-15T12:12:10.156+0200][3,370s] GC(5) Pause Cleanup
[2020-04-15T12:12:10.156+0200][3,371s] GC(5) Pause Cleanup 48M->48M(512M) 0,135ms
[2020-04-15T12:12:10.156+0200][3,371s] GC(5) User=0,00s Sys=0,00s Real=0,00s
[2020-04-15T12:12:10.156+0200][3,371s] GC(5) Concurrent Cleanup for Next Mark
[2020-04-15T12:12:10.157+0200][3,372s] GC(5) Concurrent Cleanup for Next Mark 0,897ms
[2020-04-15T12:12:10.157+0200][3,372s] GC(5) Concurrent Cycle 44,494ms
[2020-04-15T12:12:10.407+0200][3,622s] GC(6) Pause Young (Normal) (G1 Evacuation Pause)
[2020-04-15T12:12:10.407+0200][3,622s] GC(6) Using 8 workers of 8 for evacuation
[2020-04-15T12:12:10.413+0200][3,628s] GC(6)   Pre Evacuate Collection Set: 0,0ms
[2020-04-15T12:12:10.413+0200][3,628s] GC(6)   Evacuate Collection Set: 5,3ms
[2020-04-15T12:12:10.413+0200][3,628s] GC(6)   Post Evacuate Collection Set: 0,4ms
[2020-04-15T12:12:10.413+0200][3,628s] GC(6)   Other: 0,2ms
[2020-04-15T12:12:10.413+0200][3,628s] GC(6) Eden regions: 148->0(197)
[2020-04-15T12:12:10.413+0200][3,628s] GC(6) Survivor regions: 11->8(20)
[2020-04-15T12:12:10.413+0200][3,628s] GC(6) Old regions: 20->24
[2020-04-15T12:12:10.413+0200][3,628s] GC(6) Humongous regions: 5->5
[2020-04-15T12:12:10.413+0200][3,628s] GC(6) Metaspace: 36049K->36049K(1081344K)
[2020-04-15T12:12:10.413+0200][3,628s] GC(6) Pause Young (Normal) (G1 Evacuation Pause) 182M->35M(512M) 5,961ms
[2020-04-15T12:12:10.413+0200][3,628s] GC(6) User=0,04s Sys=0,00s Real=0,00s
[2020-04-15T12:18:27.079+0200][380,294s] GC(7) Pause Young (Normal) (G1 Evacuation Pause)
[2020-04-15T12:18:27.087+0200][380,302s] GC(7) Using 8 workers of 8 for evacuation
[2020-04-15T12:18:27.127+0200][380,342s] GC(7)   Pre Evacuate Collection Set: 0,0ms
[2020-04-15T12:18:27.127+0200][380,342s] GC(7)   Evacuate Collection Set: 19,1ms
[2020-04-15T12:18:27.127+0200][380,342s] GC(7)   Post Evacuate Collection Set: 20,1ms
[2020-04-15T12:18:27.127+0200][380,342s] GC(7)   Other: 8,1ms
[2020-04-15T12:18:27.127+0200][380,342s] GC(7) Eden regions: 197->0(294)
[2020-04-15T12:18:27.127+0200][380,342s] GC(7) Survivor regions: 8->13(26)
[2020-04-15T12:18:27.127+0200][380,342s] GC(7) Old regions: 24->24
[2020-04-15T12:18:27.127+0200][380,342s] GC(7) Humongous regions: 8->8
[2020-04-15T12:18:27.127+0200][380,342s] GC(7) Metaspace: 46066K->46066K(1091584K)
[2020-04-15T12:18:27.127+0200][380,342s] GC(7) Pause Young (Normal) (G1 Evacuation Pause) 235M->43M(512M) 47,307ms
[2020-04-15T12:18:27.127+0200][380,342s] GC(7) User=0,17s Sys=0,01s Real=0,05s
[2020-04-15T16:40:22.899+0200][10913,117s] Heap
[2020-04-15T16:40:22.900+0200][10913,117s]  garbage-first heap   total 524288K, used 258342K [0x00000000e0000000, 0x0000000100000000)
[2020-04-15T16:40:22.900+0200][10913,117s]   region size 1024K, 223 young (228352K), 13 survivors (13312K)
[2020-04-15T16:40:22.900+0200][10913,117s]  Metaspace       used 47187K, capacity 48241K, committed 48432K, reserved 1091584K
[2020-04-15T16:40:22.900+0200][10913,117s]   class space    used 5541K, capacity 5996K, committed 6016K, reserved 1048576K
