[2020-04-15T11:48:11.327+0200][0.006s] Heap region size: 1M
[2020-04-15T11:48:11.337+0200][0.016s] Using G1
[2020-04-15T11:48:11.337+0200][0.016s] Heap address: 0x00000000e0000000, size: 512 MB, Compressed Oops mode: 32-bit
[2020-04-15T11:48:11.338+0200][0.016s] Mark closed archive regions in map: [0x00000000fff00000, 0x00000000fff69ff8]
[2020-04-15T11:48:11.338+0200][0.016s] Mark open archive regions in map: [0x00000000ffe00000, 0x00000000ffe46ff8]
[2020-04-15T11:48:11.812+0200][0,490s] GC(0) Pause Young (Normal) (G1 Evacuation Pause)
[2020-04-15T11:48:11.812+0200][0,491s] GC(0) Using 8 workers of 8 for evacuation
[2020-04-15T11:48:11.821+0200][0,500s] GC(0)   Pre Evacuate Collection Set: 0,0ms
[2020-04-15T11:48:11.821+0200][0,500s] GC(0)   Evacuate Collection Set: 8,3ms
[2020-04-15T11:48:11.821+0200][0,500s] GC(0)   Post Evacuate Collection Set: 0,8ms
[2020-04-15T11:48:11.821+0200][0,500s] GC(0)   Other: 0,5ms
[2020-04-15T11:48:11.821+0200][0,500s] GC(0) Eden regions: 30->0(303)
[2020-04-15T11:48:11.821+0200][0,500s] GC(0) Survivor regions: 0->4(4)
[2020-04-15T11:48:11.821+0200][0,500s] GC(0) Old regions: 2->2
[2020-04-15T11:48:11.821+0200][0,500s] GC(0) Humongous regions: 0->0
[2020-04-15T11:48:11.821+0200][0,500s] GC(0) Metaspace: 8022K->8022K(1056768K)
[2020-04-15T11:48:11.821+0200][0,500s] GC(0) Pause Young (Normal) (G1 Evacuation Pause) 30M->3M(512M) 9,703ms
[2020-04-15T11:48:11.821+0200][0,500s] GC(0) User=0,07s Sys=0,00s Real=0,01s
[2020-04-15T11:48:12.794+0200][1,473s] GC(1) Pause Young (Concurrent Start) (Metadata GC Threshold)
[2020-04-15T11:48:12.794+0200][1,473s] GC(1) Using 8 workers of 8 for evacuation
[2020-04-15T11:48:12.806+0200][1,484s] GC(1)   Pre Evacuate Collection Set: 0,0ms
[2020-04-15T11:48:12.806+0200][1,484s] GC(1)   Evacuate Collection Set: 10,3ms
[2020-04-15T11:48:12.806+0200][1,484s] GC(1)   Post Evacuate Collection Set: 1,3ms
[2020-04-15T11:48:12.806+0200][1,484s] GC(1)   Other: 0,2ms
[2020-04-15T11:48:12.806+0200][1,484s] GC(1) Eden regions: 103->0(95)
[2020-04-15T11:48:12.806+0200][1,484s] GC(1) Survivor regions: 4->19(39)
[2020-04-15T11:48:12.806+0200][1,484s] GC(1) Old regions: 2->2
[2020-04-15T11:48:12.806+0200][1,484s] GC(1) Humongous regions: 4->4
[2020-04-15T11:48:12.806+0200][1,484s] GC(1) Metaspace: 20429K->20429K(1069056K)
[2020-04-15T11:48:12.806+0200][1,484s] GC(1) Pause Young (Concurrent Start) (Metadata GC Threshold) 110M->23M(512M) 11,756ms
[2020-04-15T11:48:12.806+0200][1,484s] GC(1) User=0,06s Sys=0,00s Real=0,01s
[2020-04-15T11:48:12.806+0200][1,484s] GC(2) Concurrent Cycle
[2020-04-15T11:48:12.806+0200][1,484s] GC(2) Concurrent Clear Claimed Marks
[2020-04-15T11:48:12.806+0200][1,484s] GC(2) Concurrent Clear Claimed Marks 0,039ms
[2020-04-15T11:48:12.806+0200][1,484s] GC(2) Concurrent Scan Root Regions
[2020-04-15T11:48:12.810+0200][1,489s] GC(2) Concurrent Scan Root Regions 4,481ms
[2020-04-15T11:48:12.811+0200][1,489s] GC(2) Concurrent Mark (1,489s)
[2020-04-15T11:48:12.811+0200][1,489s] GC(2) Concurrent Mark From Roots
[2020-04-15T11:48:12.811+0200][1,489s] GC(2) Using 2 workers of 2 for marking
[2020-04-15T11:48:12.813+0200][1,491s] GC(2) Concurrent Mark From Roots 2,076ms
[2020-04-15T11:48:12.813+0200][1,491s] GC(2) Concurrent Preclean
[2020-04-15T11:48:12.813+0200][1,491s] GC(2) Concurrent Preclean 0,037ms
[2020-04-15T11:48:12.813+0200][1,491s] GC(2) Concurrent Mark (1,489s, 1,491s) 2,139ms
[2020-04-15T11:48:12.813+0200][1,491s] GC(2) Pause Remark
[2020-04-15T11:48:12.815+0200][1,493s] GC(2) Cleaned string and symbol table, strings: 9416 processed, 0 removed, symbols: 59000 processed, 27 removed
[2020-04-15T11:48:12.815+0200][1,493s] GC(2) Pause Remark 23M->23M(512M) 2,220ms
[2020-04-15T11:48:12.815+0200][1,493s] GC(2) User=0,01s Sys=0,00s Real=0,01s
[2020-04-15T11:48:12.815+0200][1,493s] GC(2) Concurrent Rebuild Remembered Sets
[2020-04-15T11:48:12.817+0200][1,496s] GC(2) Concurrent Rebuild Remembered Sets 2,375ms
[2020-04-15T11:48:12.818+0200][1,496s] GC(2) Pause Cleanup
[2020-04-15T11:48:12.818+0200][1,496s] GC(2) Pause Cleanup 24M->24M(512M) 0,099ms
[2020-04-15T11:48:12.818+0200][1,496s] GC(2) User=0,00s Sys=0,00s Real=0,00s
[2020-04-15T11:48:12.818+0200][1,496s] GC(2) Concurrent Cleanup for Next Mark
[2020-04-15T11:48:12.818+0200][1,497s] GC(2) Concurrent Cleanup for Next Mark 0,646ms
[2020-04-15T11:48:12.818+0200][1,497s] GC(2) Concurrent Cycle 12,477ms
[2020-04-15T11:48:13.610+0200][2,289s] GC(3) Pause Young (Normal) (G1 Evacuation Pause)
[2020-04-15T11:48:13.610+0200][2,289s] GC(3) Using 8 workers of 8 for evacuation
[2020-04-15T11:48:13.625+0200][2,304s] GC(3)   Pre Evacuate Collection Set: 0,0ms
[2020-04-15T11:48:13.625+0200][2,304s] GC(3)   Evacuate Collection Set: 14,0ms
[2020-04-15T11:48:13.625+0200][2,304s] GC(3)   Post Evacuate Collection Set: 1,0ms
[2020-04-15T11:48:13.625+0200][2,304s] GC(3)   Other: 0,1ms
[2020-04-15T11:48:13.625+0200][2,304s] GC(3) Eden regions: 90->0(156)
[2020-04-15T11:48:13.625+0200][2,304s] GC(3) Survivor regions: 19->6(14)
[2020-04-15T11:48:13.625+0200][2,304s] GC(3) Old regions: 2->20
[2020-04-15T11:48:13.625+0200][2,304s] GC(3) Humongous regions: 4->4
[2020-04-15T11:48:13.625+0200][2,304s] GC(3) Metaspace: 31787K->31787K(1079296K)
[2020-04-15T11:48:13.625+0200][2,304s] GC(3) Pause Young (Normal) (G1 Evacuation Pause) 113M->28M(512M) 15,226ms
[2020-04-15T11:48:13.625+0200][2,304s] GC(3) User=0,10s Sys=0,01s Real=0,02s
[2020-04-15T11:48:13.991+0200][2,670s] GC(4) Pause Young (Concurrent Start) (Metadata GC Threshold)
[2020-04-15T11:48:13.991+0200][2,670s] GC(4) Using 8 workers of 8 for evacuation
[2020-04-15T11:48:13.998+0200][2,676s] GC(4)   Pre Evacuate Collection Set: 0,1ms
[2020-04-15T11:48:13.998+0200][2,676s] GC(4)   Evacuate Collection Set: 5,8ms
[2020-04-15T11:48:13.998+0200][2,676s] GC(4)   Post Evacuate Collection Set: 0,3ms
[2020-04-15T11:48:13.998+0200][2,676s] GC(4)   Other: 0,1ms
[2020-04-15T11:48:13.998+0200][2,676s] GC(4) Eden regions: 80->0(173)
[2020-04-15T11:48:13.998+0200][2,676s] GC(4) Survivor regions: 6->11(21)
[2020-04-15T11:48:13.998+0200][2,676s] GC(4) Old regions: 20->20
[2020-04-15T11:48:13.998+0200][2,676s] GC(4) Humongous regions: 6->5
[2020-04-15T11:48:13.998+0200][2,676s] GC(4) Metaspace: 34807K->34807K(1081344K)
[2020-04-15T11:48:13.998+0200][2,676s] GC(4) Pause Young (Concurrent Start) (Metadata GC Threshold) 110M->34M(512M) 6,391ms
[2020-04-15T11:48:13.998+0200][2,676s] GC(4) User=0,03s Sys=0,00s Real=0,01s
[2020-04-15T11:48:13.998+0200][2,676s] GC(5) Concurrent Cycle
[2020-04-15T11:48:13.998+0200][2,676s] GC(5) Concurrent Clear Claimed Marks
[2020-04-15T11:48:13.998+0200][2,676s] GC(5) Concurrent Clear Claimed Marks 0,050ms
[2020-04-15T11:48:13.998+0200][2,676s] GC(5) Concurrent Scan Root Regions
[2020-04-15T11:48:14.000+0200][2,679s] GC(5) Concurrent Scan Root Regions 2,199ms
[2020-04-15T11:48:14.000+0200][2,679s] GC(5) Concurrent Mark (2,679s)
[2020-04-15T11:48:14.000+0200][2,679s] GC(5) Concurrent Mark From Roots
[2020-04-15T11:48:14.000+0200][2,679s] GC(5) Using 2 workers of 2 for marking
[2020-04-15T11:48:14.015+0200][2,693s] GC(5) Concurrent Mark From Roots 14,657ms
[2020-04-15T11:48:14.015+0200][2,693s] GC(5) Concurrent Preclean
[2020-04-15T11:48:14.015+0200][2,693s] GC(5) Concurrent Preclean 0,118ms
[2020-04-15T11:48:14.015+0200][2,693s] GC(5) Concurrent Mark (2,679s, 2,693s) 14,826ms
[2020-04-15T11:48:14.015+0200][2,694s] GC(5) Pause Remark
[2020-04-15T11:48:14.020+0200][2,699s] GC(5) Cleaned string and symbol table, strings: 16287 processed, 23 removed, symbols: 102587 processed, 82 removed
[2020-04-15T11:48:14.021+0200][2,699s] GC(5) Pause Remark 39M->39M(512M) 5,506ms
[2020-04-15T11:48:14.021+0200][2,699s] GC(5) User=0,03s Sys=0,00s Real=0,00s
[2020-04-15T11:48:14.021+0200][2,699s] GC(5) Concurrent Rebuild Remembered Sets
[2020-04-15T11:48:14.028+0200][2,706s] GC(5) Concurrent Rebuild Remembered Sets 7,281ms
[2020-04-15T11:48:14.028+0200][2,706s] GC(5) Pause Cleanup
[2020-04-15T11:48:14.028+0200][2,707s] GC(5) Pause Cleanup 40M->40M(512M) 0,118ms
[2020-04-15T11:48:14.028+0200][2,707s] GC(5) User=0,00s Sys=0,00s Real=0,00s
[2020-04-15T11:48:14.028+0200][2,707s] GC(5) Concurrent Cleanup for Next Mark
[2020-04-15T11:48:14.029+0200][2,708s] GC(5) Concurrent Cleanup for Next Mark 0,877ms
[2020-04-15T11:48:14.029+0200][2,708s] GC(5) Concurrent Cycle 31,302ms
[2020-04-15T11:48:14.522+0200][3,201s] GC(6) Pause Young (Normal) (G1 Evacuation Pause)
[2020-04-15T11:48:14.522+0200][3,201s] GC(6) Using 8 workers of 8 for evacuation
[2020-04-15T11:48:14.528+0200][3,207s] GC(6)   Pre Evacuate Collection Set: 0,0ms
[2020-04-15T11:48:14.528+0200][3,207s] GC(6)   Evacuate Collection Set: 5,3ms
[2020-04-15T11:48:14.528+0200][3,207s] GC(6)   Post Evacuate Collection Set: 0,4ms
[2020-04-15T11:48:14.528+0200][3,207s] GC(6)   Other: 0,1ms
[2020-04-15T11:48:14.528+0200][3,207s] GC(6) Eden regions: 185->0(231)
[2020-04-15T11:48:14.528+0200][3,207s] GC(6) Survivor regions: 11->12(25)
[2020-04-15T11:48:14.528+0200][3,207s] GC(6) Old regions: 20->20
[2020-04-15T11:48:14.528+0200][3,207s] GC(6) Humongous regions: 5->5
[2020-04-15T11:48:14.528+0200][3,207s] GC(6) Metaspace: 37699K->37699K(1083392K)
[2020-04-15T11:48:14.528+0200][3,207s] GC(6) Pause Young (Normal) (G1 Evacuation Pause) 219M->35M(512M) 5,943ms
[2020-04-15T11:48:14.528+0200][3,207s] GC(6) User=0,04s Sys=0,00s Real=0,00s
[2020-04-15T12:10:02.352+0200][1311,031s] GC(7) Pause Young (Normal) (G1 Evacuation Pause)
[2020-04-15T12:10:02.352+0200][1311,031s] GC(7) Using 8 workers of 8 for evacuation
[2020-04-15T12:10:02.364+0200][1311,043s] GC(7)   Pre Evacuate Collection Set: 0,0ms
[2020-04-15T12:10:02.364+0200][1311,043s] GC(7)   Evacuate Collection Set: 7,3ms
[2020-04-15T12:10:02.364+0200][1311,043s] GC(7)   Post Evacuate Collection Set: 4,1ms
[2020-04-15T12:10:02.364+0200][1311,043s] GC(7)   Other: 0,1ms
[2020-04-15T12:10:02.364+0200][1311,043s] GC(7) Eden regions: 229->0(276)
[2020-04-15T12:10:02.364+0200][1311,043s] GC(7) Survivor regions: 12->17(31)
[2020-04-15T12:10:02.364+0200][1311,043s] GC(7) Old regions: 20->20
[2020-04-15T12:10:02.364+0200][1311,043s] GC(7) Humongous regions: 8->8
[2020-04-15T12:10:02.364+0200][1311,043s] GC(7) Metaspace: 46699K->46699K(1091584K)
[2020-04-15T12:10:02.364+0200][1311,043s] GC(7) Pause Young (Normal) (G1 Evacuation Pause) 267M->43M(512M) 11,638ms
[2020-04-15T12:10:02.364+0200][1311,043s] GC(7) User=0,06s Sys=0,01s Real=0,02s
[2020-04-15T12:10:02.437+0200][1311,115s] Heap
[2020-04-15T12:10:02.437+0200][1311,115s]  garbage-first heap   total 524288K, used 54747K [0x00000000e0000000, 0x0000000100000000)
[2020-04-15T12:10:02.437+0200][1311,115s]   region size 1024K, 28 young (28672K), 17 survivors (17408K)
[2020-04-15T12:10:02.437+0200][1311,115s]  Metaspace       used 46999K, capacity 48092K, committed 48432K, reserved 1091584K
[2020-04-15T12:10:02.437+0200][1311,115s]   class space    used 5548K, capacity 5996K, committed 6016K, reserved 1048576K
