id,level,title,page,extent,children
0,0,"Table of contents",1,331,"1,2,3,9,13,18,22,31"
1,1,"Page de titre",7,8,
2,1,INTRODUCTION,9,95,
3,1,"LES VIVANTES",96,131,"4,5,6,7,8"
4,2,"[intro] LES VIVANTES",96,97,
5,2,"I. Primavera",98,111,
6,2,"II. La Pietosa",112,117,
7,2,"III. Nella",118,124,
8,2,"IV. Genlucca",125,131,
9,1,"DANS LA FORET OBSCURE",132,165,"10,11,12"
10,2,"[intro] DANS LA FORET OBSCURE",132,137,
11,2,"I. Influences du Ciel",138,146,
12,2,"II. La Rencontre",147,165,
13,1,"LES MORTES",166,185,"14,15,16,17"
14,2,"[intro] LES MORTES",166,167,
15,2,"I. Marcia",168,173,
16,2,"II. Francesca",174,179,
17,2,"III. Manto",180,185,
18,1,"AMES SOUFFRANTES",186,199,"19,20,21"
19,2,"[intro] AMES SOUFFRANTES",186,187,
20,2,"I. La Pia",188,193,
21,2,"II. Sapia",194,199,
22,1,"LES IMMORTELLES",200,299,"23,24,25,26,27,28,29,30"
23,2,"[intro] LES IMMORTELLES",200,207,
24,2,"I. Lia et Rachel",208,214,
25,2,"II. Marthe et Marie",215,218,
26,2,"III. Les saintes Femmes au Tombeau",219,224,
27,2,"IV. Mathilde",225,233,
28,2,"V. Béatrice dans «LA DIVINE COMÉDIE»",234,286,
29,2,"VI. Piccarda",287,292,
30,2,"VII. Cunizza",293,299,
31,1,"LE DERNIER CHANT",300,331,
