id,level,title,page,extent,children
0,0,"Table of contents",1,188,"1,2,3,8,9,23,24,27,29"
1,1,"Portrait de Boccace d’après une peinture d'Andrea del Castagno (XV° siècle)",6,6,
2,1,"Page de titre",7,12,
3,1,"Introduction / Henri HAUVETTE",13,34,"4,5,6,7"
4,2,"§ I. — Vie de Boccace",13,18,
5,2,"§ II. — L’oeuvre de Boccace",19,28,
6,2,"§ III. — Importance de l’oeuvre de Boccace dans la littérature de la Renaissance",29,32,
7,2,"§ IV. — Observations sur les présents extraits",33,34,
8,1,"Extrait du NINFALE FIESOLANO",35,54,
9,1,"Extrait du DECAMERON",55,158,"10,11,12,13,14,15,16,17,18,19,20,21,22"
10,2,"[intro] Extrait du DECAMERON",55,56,
11,2,"I. — La peste de Florence (Introduction)",57,64,
12,2,"II. — Les interlocuteurs (Introduction)",65,72,
13,2,"III. — Les trois anneaux (I, 3)",73,78,
14,2,"IV. — Bergamino (1, 7)",79,86,
15,2,"V. — Ballade de la première journée",87,88,
16,2,"VI. — Andreuccio da Perugia (II, 5)",89,109,
17,2,"VII. — Simone (IV, 7)",110,115,
18,2,"VIII. — Le Faucon (V, 9)",116,125,
19,2,"IX. — l.e Malin cuisinier (VI, 4)",126,129,
20,2,"X. — Calandrino, chercheur de pierres précieuses (VIII, 3)",130,143,
21,2,"XI. — Vengeance d’un pique-assiette (IX, 8)",144,149,
22,2,"XII. — Le Boi Pierre d’Aragon (X, 7)",150,158,
23,1,"Extrait du CORBAGGIO",159,166,
24,1,"Extrait de la VITA DI DANTE",167,173,"25,26"
25,2,"I. Beatrice",167,170,
26,2,"II. Portrait de Dante",171,173,
27,1,"Extrait du COMMENTO SOPRA LA COMEDIA DI DANTE ALIGHIERI",174,180,28
28,2,"Le commerce et la poésie",174,180,
29,1,"Table des matièes",181,188,
