id,level,title,page,extent,children
0,0,"Table of contents",1,110,"1,2,3,7,12,13"
1,1,"Page de titre",9,9,
2,1,Introduction,10,42,
3,1,"Lettres écrites d’Italie à Geoffroy D’Estissac, Évêque de Maillezais",43,91,"4,5,6"
4,2,"Lettre I (30 décembre 1535)",43,61,
5,2,"Lettre II (28 janvier 1536)",62,74,
6,2,"Lettre III (15 février 1536)",75,91,
7,1,Appendice,92,101,"8,9,10,11"
8,2,"I. Lettres de Charles Hémard de Denonville(décembre 1535-février 1536)",92,97,
9,2,"II. Sauf-conduit accordé par Paul III aux serviteurs de Jean du Bellay",98,98,
10,2,"III. Lettre de Charles Juvénal des Ursins à Jeandu Bellay (12 avril 1536)",99,100,
11,2,"IV. Fac-similé du manuscrit Morrison",101,101,
12,1,"Index des noms de personnes et de lieux",102,109,
13,1,"Table des matières",110,110,
