id,level,title,page,extent,children
0,0,"Table of contents",1,172,"1,2,3,4,5,6"
1,1,"Page de titre",9,10,
2,1,"Dramatis personae",11,12,
3,1,"Atto primo",13,68,
4,1,"Atto secondo",69,102,
5,1,"Atto terzo",103,140,
6,1,"Atto quarto",141,172,
