dcterms:contributor,dcterms:creator,dcterms:date,dcterms:description,dcterms:format,dcterms:language,dcterms:publisher,dcterms:rights,dcterms:source,dcterms:subject,dcterms:identifier,dcterms:title,dcterms:type,dcterms:hasFormat
"Doderet, André (1879-1949). Traducteur","D'Annunzio, Gabriele (1863-1938)",1928,,,fre| ita,Calmann-Lévy,Domaine public,SID UGA INP BU Droit et Lettres ,Théâtre (genre littéraire) italien -- 20e siècle -- Traductions françaises,384212101_122319_1927_196,La torche sous le boisseau,texte| monographie imprimée,https://www.fontegaia.eu/omeka-s/files/manifests/384212101_122319_1927_196/manifest.json
"Panckoucke, Charles-Joseph (1736-1798). Traducteur| Framery, Nicolas-Étienne (1745-1810). Traducteur| Latour, Antoine de (1808-1881). Editeur scientifique","Arioste, L' (1474-1533) ",1842,,,fre,P. Masgana,Domaine public,SID UGA INP BU Droit et Lettres ,Littérature italienne – Ouvrages avant 1800,384212101_22431_1,"Roland furieux, Tome I ",texte| monographie imprimée,https://www.fontegaia.eu/omeka-s/files/manifests/384212101_22431_1/manifest.json
,"Union intellectuelle franco-italienne, Paris",1920,,,fre,Ernest Leroux,Domaine public,SID UGA INP BU Droit et Lettres ,Littérature romane -- Périodiques,384212101_XFP042_1920,Etudes italiennes : publiées par l'Union intellectuelle franco-italienne / dir. Henri Hauvette,texte| monographie imprimée,https://www.fontegaia.eu/omeka-s/files/manifests/384212101_XFP042_1920/manifest.json
,"Costaing de Pusignan, Jean Joseph François (1770?-1820)",1819,,,fre,Avignon : Bonnet,Domaine public,SID UGA INP BU Droit et Lettres ,Pétrarque (1304-1374)  – Critique et interprétation – 14e siècle| Laure (personnage fictif),384212101_30909,La Muse de Pétrarque ou Laure des Baux,texte| monographie imprimée,https://www.fontegaia.eu/omeka-s/files/manifests/384212101_30909/manifest.json
"Hérelle, Georges (1848-1935). Traducteur","D'Annunzio, Gabriele (1863-1938)",1928,,,fre,Calmann-Lévy,Domaine public,SID UGA INP BU Droit et Lettres ,Littérature italienne -- 20e siècle -- Traductions françaises,384212101_39298,Contemplation de la mort,texte| monographie imprimée,https://www.fontegaia.eu/omeka-s/files/manifests/384212101_39298/manifest.json
,"D'Annunzio, Gabriele (1863-1938)",1910,,,fre| ita,Calmann-Lévy,Domaine public,SID UGA INP BU Droit et Lettres ,Théâtre (genre littéraire) italien -- 20e siècle,384212101_32625,Francesca da Rimini,texte| monographie imprimée,https://www.fontegaia.eu/omeka-s/files/manifests/384212101_32625/manifest.json
,Boccace (1313-1375),1824,,,ita,Ciardetti,Domaine public,SID UGA INP BU Droit et Lettres ,Prose italienne – 14e siècle,384212101_31692_1 ,"Il Decameron, tome I",texte| monographie imprimée,https://www.fontegaia.eu/omeka-s/files/manifests/384212101_31692_1/manifest.json 
,Boccace (1313-1375),1824,,,ita,Ciardetti,Domaine public,SID UGA INP BU Droit et Lettres ,Prose italienne – 14e siècle,384212101_31692_2 ,"Il Decameron, tome II",texte| monographie imprimée,https://www.fontegaia.eu/omeka-s/files/manifests/384212101_31692_2/manifest.json 
,Boccace (1313-1375),1824,,,ita,Ciardetti,Domaine public,SID UGA INP BU Droit et Lettres ,Prose italienne -- 14e siècle ,384212101_31692_3 ,"Il Decameron, tome III",texte| monographie imprimée,https://www.fontegaia.eu/omeka-s/files/manifests/384212101_31692_3/manifest.json 
,Boccace (1313-1375),1824,,,ita,Ciardetti,Domaine public,SID UGA INP BU Droit et Lettres ,Prose italienne -- 14e siècle ,384212101_31692_4 ,"Il Decameron, tome IV",texte| monographie imprimée,https://www.fontegaia.eu/omeka-s/files/manifests/384212101_31692_4/manifest.json 
,Boccace (1313-1375) ,1824,,,ita,Ciardetti,Domaine public,SID UGA INP BU Droit et Lettres ,Prose italienne -- 14e siècle ,384212101_31692_5,"Il Decameron, tome V",texte| monographie imprimée,https://www.fontegaia.eu/omeka-s/files/manifests/384212101_31692_5/manifest.json
,"D'Annunzio, Gabriele (1863-1938)",1911,,,fre,Calmann-Lévy,Domaine public,SID UGA INP BU Droit et Lettres ,Théâtre (genre littéraire) italien -- 20e siècle,384212101_122319_1911_181,Le martyre de Saint Sébastien : mystère composé en rythme français / par Gabriele D'Annunzio : et joué à Paris sur la scène du Châtelet le XXII mai MCMXI avec la musique de Claude Debussy,texte| monographie imprimée,https://www.fontegaia.eu/omeka-s/files/manifests/384212101_122319_1911_181/manifest.json
"Hérelle, Georges (1848-1935). Traducteur","D'Annunzio, Gabriele (1863-1938)",1899,,,fre,Calmann-Lévy,Domaine public,SID UGA INP BU Droit et Lettres ,Théâtre (genre littéraire) italien -- 20e siècle -- Traductions françaises,384212101_XF350898,Les victoires mutilées,texte| monographie imprimée,https://www.fontegaia.eu/omeka-s/files/manifests/384212101_XF350898/manifest.json
"Hérelle, Georges (1848-1935). Traducteur","D'Annunzio, Gabriele (1863-1938)",1897,,,fre| ita,Callmann Lévy,Domaine public,SID UGA INP BU Droit et Lettres ,Poésie italienne -- 20e siècle -- Traductions françaises,384212101_61280,Les vierges aux rochers,texte| monographie imprimée,https://www.fontegaia.eu/omeka-s/files/manifests/384212101_61280/manifest.json
"Tressan, Louis-Élisabeth de La Vergne (1705-1783 ; comte de) ","Arioste, L' (1474-1533)",1787,,,fre,"Pissot, libraire",Domaine public,SID UGA INP BU Droit et Lettres ,Littérature italienne -- Ouvrages avant 1800 ,384212101_30209_4 ,"Roland furieux, poëme héroïque de l'Arioste. Tome IV.| Nouvelle traduction, Par M. le Comte de Tressan",texte| monographie imprimée,https://www.fontegaia.eu/omeka-s/files/manifests/384212101_30909_4/manifest.json 
"Tressan, Louis-Élisabeth de La Vergne (1705-1783 ; comte de) ","Arioste, L' (1474-1533) ",1787,,,fre,"Pissot, libraire",Domaine public,SID UGA INP BU Droit et Lettres ,Littérature italienne -- Ouvrages avant 1800 ,384212101_30209_3 ,"Roland furieux, poëme héroïque de l'Arioste. Tome III.| Nouvelle traduction, Par M. le Comte de Tressan",texte| monographie imprimée,https://www.fontegaia.eu/omeka-s/files/manifests/384212101_30909_3/manifest.json 
"Tressan, Louis-Élisabeth de La Vergne (1705-1783 ; comte de) ","Arioste, L' (1474-1533)",1787,,,fre,"Pissot, libraire",Domaine public,SID UGA INP BU Droit et Lettres ,Littérature italienne -- Ouvrages avant 1800 ,384212101_30209_2 ,"Roland furieux, poëme héroïque de l'Arioste. Tome II.| Nouvelle traduction, Par M. le Comte de Tressan",texte| monographie imprimée,https://www.fontegaia.eu/omeka-s/files/manifests/384212101_30909_2/manifest.json 
"Tressan, Louis-Élisabeth de La Vergne (1705-1783 ; comte de) ","Arioste, L' (1474-1533) ",1787,,,fre,"Pissot, libraire",Domaine public,SID UGA INP BU Droit et Lettres ,Littérature italienne -- Ouvrages avant 1800 ,384212101_30209_1 ,"Roland furieux, poëme héroïque de l'Arioste. Tome I.| Nouvelle traduction, Par M. le Comte de Tressan",texte| monographie imprimée,https://www.fontegaia.eu/omeka-s/files/manifests/384212101_30909_1/manifest.json 
,"Carducci, Giosuè (1835-1907)",1897,,,ita,Zanichelli,Domaine public,SID UGA INP BU Droit et Lettres ,Risorgimento| Italie -- 1849-1870,384212101_28297,Letture del Risorgimento italiano,texte| monographie imprimée,https://www.fontegaia.eu/omeka-s/files/manifests/384212101_28297/manifest.json
"Melegari, Dora (1849-1924). Editeur scientifique","Mazzini, Giuseppe (1805-1872)",1895,,,fre,Perrin,Domaine public,SID UGA INP BU Droit et Lettres ,"Mazzini, Giuseppe (1805-1872) -- Correspondance",384212101_22446,Lettres intimes de Joseph Mazzini,texte| monographie imprimée,https://www.fontegaia.eu/omeka-s/files/manifests/384212101_22446/manifest.json
,"D'Annunzio, Gabriele (1863-1938) ",1911,,,fre,L'Illustration théâtrale,Domaine public,SID UGA INP BU Droit et Lettres ,Théâtre (genre littéraire) italien -- 20e siècle,384212101_32153,Le martyre de Saint Sébastien,texte| monographie imprimée,https://www.fontegaia.eu/omeka-s/files/manifests/384212101_32153/manifest.json
,Sabba da Castiglione (1480?-1554) ,1561,,,ita,Appresso di Giovann' Antonio de gli Antonii,Domaine public,SID UGA INP BU Droit et Lettres ,Morale pratique -- Ouvrages avant 1800 ,384212101_41867,"Ricordi overo ammaestramenti di monsignor Saba Castiglione cavalier gierosolimitano, ne quali con prudenti, e christiani discorsi si ragiona di tutte le materie honorate, che si ricercano à un vero gentil'huomo",texte| monographie imprimée,https://www.fontegaia.eu/omeka-s/files/manifests/384212101_41867/manifest.json
,"Rabelais, François (1494?-1553)",1910,,,frm| fr,H. Champion,Domaine public,SID UGA INP BU Droit et Lettres ,Récits de voyages français -- 16e siècle| Italie – Descriptions de voyages -- 16e siècle  ,384212101_28302,Lettres écrites d'Italie,texte| monographie imprimée,https://www.fontegaia.eu/omeka-s/files/manifests/384212101_28302/manifest.json
,"Félix-Faure Goyau, Lucie (1866-1913) ",1902,,,fre,Didier| Perrin,Domaine public,SID UGA INP BU Droit et Lettres ,Dante Alighieri (1265-1321) -- Critique et interprétation,384212101_32778,Les femmes dans l'œuvre de Dante,texte| monographie imprimée,https://www.fontegaia.eu/omeka-s/files/manifests/384212101_32778/manifest.json
"Doderet, André (1879-1949). Traducteur","D'Annunzio, Gabriele (1863-1938) ",1928,,,fre| ita,Calmann-Lévy,Domaine public,SID UGA INP BU Droit et Lettres ,Théâtre (genre littéraire) italien -- 20e siècle -- Traductions françaises,384212101_XF4070,La torche sous le boisseau     ,texte| monographie imprimée,https://www.fontegaia.eu/omeka-s/files/manifests/384212101_XF4070/manifest.json
,"Bisi, Alceste",1914,,,fre,Albrighi|Segati,Domaine public,SID UGA INP BU Droit et Lettres ,Romantisme -- France| Littérature française -- Influence italienne -- 19e siècle| Romantisme (mouvement littéraire) -- France,384212101_40265,L'Italie et le romantisme français,texte| monographie imprimée,https://www.fontegaia.eu/omeka-s/files/manifests/384212101_40265/manifest.json
,"Del Balzo, Carlo (1853-1908) ",1907,,,ita,Soc. Tipo Ed. Nazionale,Domaine public,SID UGA INP BU Droit et Lettres ,"Littérature française -- Thèmes, motifs| Italie -- Dans la littérature",384212101_28277_2,L'Italia nella letteratura francese dalla morte di Enrico IV alla rivoluzione. Tome II.,texte| monographie imprimée,https://www.fontegaia.eu/omeka-s/files/manifests/384212101_28277_2/manifest.json
,"Calderini De-Marchi, Rita",1914,,,fre,Ulrico Hoepli,Domaine public,SID UGA INP BU Droit et Lettres ,"Corbinelli, Jacopo (1568-1580)| Pinelli, Giovanni Vincenzo (1535-1601)",384212101_33354,Jacopo Corbinelli et les érudits français d'après la correspondance inédite Corbinelli-Pinelli (1566-1587)     ,texte| monographie imprimée,https://www.fontegaia.eu/omeka-s/files/manifests/384212101_33354/manifest.json
,"Ortelius, Abraham (1527-1598)",1598,,,ita| lat,Compagnia Bresciana,Domaine public,SID UGA INP BU Droit et Lettres ,Atlas -- Ouvrages avant 1800,384212101_C768,"Il theatro del mondo di Abraamo Ortelio. Nelquale distintamente si dimostrano in tavole tutte le provincie, regni, & paesi del mondo, al present conosciuti ;| con la descrittione delle citta, castelli, monti, mari, laghi, et fiumi di essi; le popolationi; i costumi, le ricchezze, et altri particolari desiderabili.| Ridotto dalla forma grande in questa piccola, per maggior commodità di ogniuno.| Con una tavola delle cose piu degne che nell'opera si contengono.",texte| monographie imprimée,https://www.fontegaia.eu/omeka-s/files/manifests/384212101_C768/manifest.json
,Boccace (1313-1375),1665,,,ita,[s.n.],Domaine public,SID UGA INP BU Droit et Lettres ,Prose italienne -- 14e siècle ,384212101_29399,Il Decameron di messer Giovanni Boccaccio citadino fiorentino. Si come lo diedero alle stampe gli SSri Giunti l'anno 1527,texte| monographie imprimée,https://www.fontegaia.eu/omeka-s/files/manifests/384212101_29399/manifest.json
,"D'Annunzio, Gabriele (1863-1938)",1909,,,ita,Fratelli Treves,Domaine public,SID UGA INP BU Droit et Lettres ,Théâtre (genre littéraire) italien -- 20e siècle,384212101_28312,Fedra,texte| monographie imprimée,https://www.fontegaia.eu/omeka-s/files/manifests/384212101_28312/manifest.json
"Hauvette, Henri (1865-1935). Editeur scientifique",Boccace (1313-1375),1901,,,ita,Garnier Frères,Domaine public,SID UGA INP BU Droit et Lettres ,Boccace (1313-1375) -- Critique et interprétation,384212101_24191,Extraits de Boccace (en italien),texte| monographie imprimée,https://www.fontegaia.eu/omeka-s/files/manifests/384212101_24191/manifest.json
,,1919,,,fre,Ernest Leroux,Domaine public,SID UGA INP BU Droit et Lettres ,Littérature romane| Périodiques,384212101_XFP042_1919,Etudes italiennes     ,texte| monographie imprimée,https://www.fontegaia.eu/omeka-s/files/manifests/384212101_XFP042_1919/manifest.json
,"D'Annunzio, Gabriele (1863-1938) ",1904,,,ita,Fratelli Treves,Domaine public,SID UGA INP BU Droit et Lettres ,Poésie italienne -- 20e siècle ,384212101_XE354950,"Laudi del cielo, del mare, del la terra e degli eroi. II . Libro terzo : Alcione",texte| monographie imprimée,https://www.fontegaia.eu/omeka-s/files/manifests/384212101_XE354950/manifest.json
,"Alamanni, Luigi (1495-1556)",1570,,,ita,"In Firenze nella stamperia di Filippo Giunti, e fratelli. MDLXX",Domaine public,SID UGA INP BU Droit et Lettres ,Poésie italienne -- 16e siècle ,384212101_23157,"La Avarchide del S. Luigi Alamanni, gentilhuomo fiorentino, alla sereniss. Madama Margherita di Francia duchessa di Savoia, e di Berri. Nuovamente stampata.| Con licenza, e privilegii di N.S. Pio Quinto, e del serenissimo gran Duca di Toscana.     ",texte| monographie imprimée,https://www.fontegaia.eu/omeka-s/files/manifests/384212101_23157/manifest.json
,"Colomb de Batines, Paul (1811-1855)",1845,,,ita| fre,Tipografia Aldina,Domaine public,SID UGA INP BU Droit et Lettres ,Dante Alighieri (1265-1321) -- Bibliographie| Dante Alighieri (1265-1321) -- Divina commedia,384212101_56822_2,Bibliografia dantesca. Tome II.     ,texte| monographie imprimée,https://www.fontegaia.eu/omeka-s/files/manifests/384212101_56822_2/manifest.json
,"Colomb de Batines, Paul (1811-1855)",1845,,,ita| fre,Tipografia Aldina,Domaine public,SID UGA INP BU Droit et Lettres ,Dante Alighieri (1265-1321) -- Bibliographie| Dante Alighieri (1265-1321) -- Divina commedia,384212101_56822_1_2,Bibliografia dantesca. Tome I.II,texte| monographie imprimée,https://www.fontegaia.eu/omeka-s/files/manifests/384212101_56822_1_2/manifest.json
,"Del Balzo, Carlo (1853-1908)",1905,,,ita,Casa Editrice Nazionale| Roux et Viarengo,Domaine public,SID UGA INP BU Droit et Lettres ,"Littérature française -- Thèmes, motifs| Italie -- Dans la littérature",384212101_28277_1 ,L'Italia nella letteratura francese dalla caduta dell'impero romano alla morte di Enrico IV. Tome I.,texte| monographie imprimée,https://www.fontegaia.eu/omeka-s/files/manifests/384212101_28277_1/manifest.json 
,"Colomb de Batines, Paul (1811-1855)",1845,,,ita| fre,Tipografia Aldina,Domaine public,SID UGA INP BU Droit et Lettres ,Dante Alighieri (1265-1321) -- Bibliographie| Dante Alighieri (1265-1321) -- Divina commedia,384212101_56822_1_1,Bibliografia dantesca. Tome I.I,texte| monographie imprimée,https://www.fontegaia.eu/omeka-s/files/manifests/384212101_56822_1_1/manifest.json
,"Alamanni, Luigi (1495-1556)",1548,,,lat,"Stampato in Parigi da Rinaldo Calderio, & Claudio suo figliuolo",Domaine public,SID UGA INP BU Droit et Lettres ,Poésie italienne -- 16e siècle ,384212101_23156,"Gyrone il cortese di Luigi Alamanni al christianissimo, et invittissimo re Arrigo secondo",texte| monographie imprimée,https://www.fontegaia.eu/omeka-s/files/manifests/384212101_23156/manifest.json
"Chappuys, Gabriel (1546?-1613?). Traducteur","Castiglione, Baldassare (1478-1529)",1585,,,ita| frm,Chez Claude Micard,Domaine public,SID UGA INP BU Droit et Lettres ,Cour et courtisans| Littérature italienne -- 16e siècle ,384212101_20232,"Le Parfait courtisan du comte Baltazar Castillonnois, es deux langues, respondans par deux colomnes l'une à l'autre, pour ceux qui veulent avoir l'intelligence de l'une d'icelles.| De la traduction de Gabriel Chapuis Tourangeau",texte| monographie imprimée,https://www.fontegaia.eu/omeka-s/files/manifests/384212101_20232/manifest.json
,"D'Annunzio, Gabriele (1863-1938) ",1905,,,ita,Fratelli Treves,Domaine public,SID UGA INP BU Droit et Lettres ,Théâtre (genre littéraire) italien -- 20e siècle,384212101_28360,La fiaccola sotto il moggio : tragedia    ,texte| monographie imprimée,https://www.fontegaia.eu/omeka-s/files/manifests/384212101_28360/manifest.json
,"Nolhac, Pierre de (1859-1936)",1925,,,fre,Les Cahiers de Paris,Domaine public,SID UGA INP BU Droit et Lettres ,Érasme (1469-1536) -- Appréciation -- Italie,384212101_39397,Erasme et l'Italie,texte| monographie imprimée,https://www.fontegaia.eu/omeka-s/files/manifests/384212101_39397/manifest.json
,"Passano, Giacomo (17..-1772?)              ",1743/1750,, ,ita,SID UGA INP,domaine public,SID UGA INP BU Droit et Lettres| MS 61,Correspondance |                                               ,384212101_MS61,Lettere del 1743 fino al 1750,texte| manuscrit,https://www.fontegaia.eu/omeka-s/files/manifests/384212101_MS61/manifest.json
,"Fantini, Luigi (17..-1...)                         ",1788,,,ita,SID UGA INP,domaine public,SID UGA INP BU Droit et Lettres| MS 59,Mathématiques--Manuels d'enseignement |,384212101_MS59,Elementi di Matematica,texte| manuscrit,https://www.fontegaia.eu/omeka-s/files/manifests/384212101_MS59/manifest.json
"Pagani Cesa, Giuseppe Urbano (1757-1835). Traducteur ","Gessner, Salomon (1730-1788) | Pagani Cesa, Giuseppe Urbano (1757-1835) | Haller, Albrecht von (1708-1777) | Mercier, Louis-Sébastien (1740-1814) |                                               ",1794,,,ita,SID UGA INP,domaine public,SID UGA INP BU Droit et Lettres| MS 58,Poésie--18 ème siècle |,384212101_MS58,[Recueil de textes littéraires] | Gl' Idilli del Sig. Gessner tradotti dal Sig. Giuseppe Urbano Pagani Cesa con altre opere del traduttore 1794 |,texte| manuscrit,https://www.fontegaia.eu/omeka-s/files/manifests/384212101_MS58/manifest.json
,"Planes, Bartolomeo (17..-1…)             ",[1788/1799],,,ita,SID UGA INP,domaine public,SID UGA INP BU Droit et Lettres| MS 57,Poésie--18 ème siècle |,384212101_MS57,[Recueil de textes littéraires] | Poesie di Bartolomeo Planes |,texte| manuscrit,https://www.fontegaia.eu/omeka-s/files/manifests/384212101_MS57/manifest.json
"Galletti, Paolo Gino (17..-….) Ex-libris","Galletti, Giacinto Maria (17..-1...)          ",[1701/1799],Ex-libris Paolo Gino Galletti 1772,,ita,SID UGA INP,domaine public,SID UGA INP BU Droit et Lettres| MS 55,Poésie lyrique--18 ème siècle |,384212101_MS55,Gerusalemme compianta dal profeta Geremia | Poema lirico del padre fra Giacinto Maria Galletti del sagro Ordine de Predicatori |,texte| manuscrit,https://www.fontegaia.eu/omeka-s/files/manifests/384212101_MS55/manifest.json
"Galletti, Paolo Gino (17..-….) Ex-libris","Galletti, Giacinto Maria (17..-1…)",1742,Ex-libris Paolo Gino Galletti 1772,,ita,SID UGA INP,domaine public,SID UGA INP BU Droit et Lettres| MS 54,Poésie lyrique--18 ème siècle |,384212101_MS54,"Poesie liriche sacre e profane | composte da fra Jacinto Maria Galletti dell’Ordine de Predicatori, zio del Cav.re Domenico Galletti | ",texte| manuscrit,https://www.fontegaia.eu/omeka-s/files/manifests/384212101_MS54/manifest.json
,Anonyme,[1750/1799],,,ita,SID UGA INP,domaine public,SID UGA INP BU Droit et Lettres| MS 51,Poésie lyrique--18 ème siècle |,384212101_MS51,[Recueil poétique],texte| manuscrit,https://www.fontegaia.eu/omeka-s/files/manifests/384212101_MS51/manifest.json
,"Ricciotti, Padre (17..-1…) Ricciotti, Padre                     ",[1780/1799],,,ita,SID UGA INP,domaine public,SID UGA INP BU Droit et Lettres| MS 50,Géographie astronomique--Manuels d'enseignement | Astronomie| Astrologie |,384212101_MS50,Geografia sacra e profana con altre relazioni appartenenti ad essa Overo Insegniamenti geografici | del molto R .R.P. Ricciotti genovese nel' Convento di S. Maria Novella di Firenzze divisa in quattro libri per maggior facilita con la manièra di trovare la linea meridiana e di constuire un orologio solare orizzontale |,texte| manuscrit,https://www.fontegaia.eu/omeka-s/files/manifests/384212101_MS50/manifest.json
,"[Borgo, Carlo (1731-1794)] | [Ricci, Lorenzo (1703-1775)] ",[1750/1799],,,ita,SID UGA INP,domaine public,SID UGA INP BU Droit et Lettres| MS 49,Mémoires (genre littéraire) |  |Polémique |Jésuites |,384212101_MS49,Memoria cattolica da presentarsi a Sua Santità | opera postuma | ,texte| manuscrit,https://www.fontegaia.eu/omeka-s/files/manifests/384212101_MS49/manifest.json
,"Caccianemici Buttari, Filippo (1673-1749)                                                  ",[1721/1749],,,ita,SID UGA INP,domaine public,SID UGA INP BU Droit et Lettres| MS 48,Polémique |Jésuites | Antijésuitisme |,384212101_MS48,Gesuiteide,texte| manuscrit,https://www.fontegaia.eu/omeka-s/files/manifests/384212101_MS48/manifest.json
"Accademia Segrada (Bergame) | Bolgeni, Pier Ottavio (17..-1…)",Anonyme,1751,,,ita,SID UGA INP,domaine public,SID UGA INP BU Droit et Lettres| MS 47,Littérature chrétienne | Hagiographie chrétienne | Poésie religieuse italienne--18ème siècle |,384212101_MS47,Componimenti in lode di Ss. Fermo e Rustico | fatti da rettorici scolari del molto R. Sig.D. Ottavio Bolgeni nell'Accademia Segrada e recitati nella V. Chiesa di S. Maria Maddalena a 23. Luglio 1751 |,texte| manuscrit,https://www.fontegaia.eu/omeka-s/files/manifests/384212101_MS47/manifest.json
"Spada, Leonido Maria (1686-1763)","Spada, Sigismondo (1622-1675)            ",1684,,,ita,SID UGA INP,domaine public,SID UGA INP BU Droit et Lettres| MS 44,Littérature chrétienne |,384212101_MS44,Del sacramento della penitenza e del modo di recitare l’Hore Canoniche | Trattati spirituali dove si risolvono varii dubii spettanti a queste materie |,texte| manuscrit,https://www.fontegaia.eu/omeka-s/files/manifests/384212101_MS44/manifest.json
,"Bruni, Leonardo (1370-1444)",[1560/1580 ],,,ita,SID UGA INP,domaine public,SID UGA INP BU Droit et Lettres| MS 43,Florence (Italie) | Politique et littérature--Italie,384212101_MS43,Difesa di Lionardo Bruni d'Arezzo Segretario della Repubblica contro i reprensori del popolo fiorentino nell'impresa di Lucca | fatta l'anno del Signore … |,texte| manuscrit,https://www.fontegaia.eu/omeka-s/files/manifests/384212101_MS43/manifest.json
,"Antonin (saint, 1389-1459)",[1450/1499],,,ita,SID UGA INP,domaine public,SID UGA INP BU Droit et Lettres| MS 41,Littérature chrétienne | Confession |,384212101_MS41,Confessionale | Omnis Mortalium cura |,texte| manuscrit,https://www.fontegaia.eu/omeka-s/files/manifests/384212101_MS41/manifest.json
,"Crébillon, Claude-Prosper Jolyot de (1707-1777) Crébillon                                             ",[1730/1799],,,ita,SID UGA INP,domaine public,SID UGA INP BU Droit et Lettres| MS 60,,384212101_MS60,"Il silfo, o sogno di Madama de R. … ",texte| manuscrit,https://www.fontegaia.eu/omeka-s/files/manifests/384212101_MS60/manifest.json
,"Magalotti, Lorenzo (1637-1712) | Pochini, Firmiano (1630-1710)",1786,,,ita,SID UGA INP,domaine public,SID UGA INP BU Droit et Lettres| MS 56,,384212101_MS56,Istoria degli amori pudichi di Sigismondo Co. d'Arco,texte| manuscrit,https://www.fontegaia.eu/omeka-s/files/manifests/384212101_MS56/manifest.json
,"Azzolini, Lorenzo (1583-1632) | Marino, Giambattista (1569-1625)",[1750/1799],,,ita,SID UGA INP,domaine public,SID UGA INP BU Droit et Lettres| MS 53,,384212101_MS53,[Satire e poesie giocose],texte| manuscrit,https://www.fontegaia.eu/omeka-s/files/manifests/384212101_MS53/manifest.json
,"Dotti, Bartolomeo (1651?-1713)",[1700/1749],,,ita,SID UGA INP,domaine public,SID UGA INP BU Droit et Lettres| MS 52,,384212101_MS52,Sonetti e rime del'K. Bartolameo Doti ,texte| manuscrit,https://www.fontegaia.eu/omeka-s/files/manifests/384212101_MS52/manifest.json
,Anonyme,[1700/1749],,,ita,SID UGA INP,domaine public,SID UGA INP BU Droit et Lettres| MS 46,,384212101_MS46,Dialogo Fra S: Domenico e S: Ignazio sopra il probabilismo,texte| manuscrit,https://www.fontegaia.eu/omeka-s/files/manifests/384212101_MS46/manifest.json
,"[Pozzolo, Giacomo]",[1677/1749],,,ita,SID UGA INP,domaine public,SID UGA INP BU Droit et Lettres| MS 45,,384212101_MS45,"Avvertimenti semplici, e ricordi, che li scrivo a miei successori | occiò in ogni tempo li tengano a memoria, e almeno una volta l'anno di legano, e osservino |",texte| manuscrit,https://www.fontegaia.eu/omeka-s/files/manifests/384212101_MS45/manifest.json
,Anonyme,[1500/1549],,,ita,SID UGA INP,domaine public,SID UGA INP BU Droit et Lettres| MS 42,,384212101_MS42,Ongi gintil singnor,texte| manuscrit,https://www.fontegaia.eu/omeka-s/files/manifests/384212101_MS42/manifest.json
