1	M.
2	Mlle
3	signore
4	Mme
5	baron
6	sieur
7	marquis
8	impératrice
9	comte
10	chevalier
11	princesse
12	citoyen
13	duc
14	comtesse
15	prince
16	marquise
17	abbé
18	père
19	Lady
20	reine
21	Mrs
22	vicomte
23	dame
24	Monsieur
25	Mr
26	capitaine
27	citoyenne
28	commandant
29	dom
30	Dr
31	duchesse
32	frère
33	Herr
34	maréchal
35	Monseigneur
36	président
37	Revd
38	seigneur
39	señor
