﻿id	parent_id	name	address	geonames	start_min	start_max	end_min	end_max	original_id	authorities	sources
1		A la muette							102137	[]	[]
2	1149	à la cour							104665	[]	[]
3		Comédie-Française							101666	[]	[]
4	1150	Comédie-Française							101662	[]	[]
5	1151	Cour à Cassel							104689	[]	[]
6	1152	Cour à Lunéville							104919	[]	[]
7	1153	Cour de Vienne							104900	[]	[]
8		En certain lieu							101530	[]	[]
9	1150	Foire Saint-Germain							101889	[]	[]
10		S. Moyse							102248	[]	[]
11		En société							101531	[]	[]
12		Spectacle de carnaval							101660	[]	[]
13		Théâtre de Château							102295	[]	[]
14	1150	une résidence particulière							132622	[]	[]
15		un collège							101720	[]	[]
16	1150	un théâtre							132689	[]	[]
17		[Troupe de Molière en province]							132873	[]	[]
18	1155	Théâtre d’Alençon	Palais de Justice		1779-02-16	1779-02-16	1809-01-01	1809-12-31	104627	[]	[]
19	1150	A la cour							104614	[]	[]
20	1150	Abbaye de Pentémont	rue de Grenelle		1671-01-01	1671-12-31	1790-01-01	1790-12-31	132696	[]	[]
21	1156	Académie de musique							104846	[]	[]
22	1157	Académie des Beaux Arts			1714-01-01	1714-12-31			104623	[]	[]
23	1153	Académie des langues orientales							132670	[]	[]
24	1150	Académie des mélophilites							102101	[]	[]
25	1157	Académie Royale (Opéra) de Lyon (Jeu de paume)	rue Pizay		1687-01-01	1687-12-31	1688-11-29	1688-11-29	320270	[]	[]
26	1157	Académie royale de Musique							102065	[]	[]
27	1150	Académie royale de Musique							200597	[]	[]
28	1158	un théâtre							132516	[]	[]
29	1159	un théâtre							132704	[]	[]
30	1625	chez la comtesse d’Amblimont							101540	[]	[]
31	1150	Amphithéâtre d’Astley (ou Manège anglais)	Boulevard du Temple		1782-01-01	1782-12-31	1790-01-01	1799-12-31	101585	[]	[]
32	1150	Amphithéâtre National							200596	[]	[]
33	1160	un théâtre							104637	[]	[]
34	1161	Nouveau théâtre de société			1789-01-01	1789-12-31	1791-01-01	1791-12-31	104640	[]	[]
35	1163	une résidence particulière							104643	[]	[]
36	1164	un théâtre							104645	[]	[]
37	1150	Arsenal							101557	[]	[]
38	1165	Auberge du Chevalet (Hostal del Caballet)							320310	[]	[]
39	1166	une résidence particulière							101568	[]	[]
40	1494	un théâtre							132523	[]	[]
41	1168	Auditoire des juges de la châtellenie			1652-01-01	1652-12-31			320236	[]	[]
42	1169	une résidence particulière							104650	[]	[]
43	1169	chez Favier							101571	[]	[]
44	1169	chez la famille de Boufflers							101575	[]	[]
45	1169	chez les Mlles. de Verrières							101574	[]	[]
46	1170	une résidence particulière							101583	[]	[]
47	1171	une résidence particulière							101586	[]	[]
48	1171	chez Mme la marquise de Mauconseil			1700-01-01	1799-12-31			102097	[]	[]
49	1172	une résidence particulière							101589	[]	[]
50	1173	une résidence particulière							101590	[]	[]
51	1150	Barrière de Monceaux							104613	[]	[]
52	1150	Barrière de Sèvres							316399	[]	[]
53	1150	Barrière du combat	chemin de Pantin		1781-01-01	1781-12-31			101594	[]	[]
54	1150	Barrière du Temple	Boulevard du Temple		1756-08-25	1756-08-25			101529	[]	[]
55	1174	à la cour							104663	[]	[]
56	1149	un théâtre							104664	[]	[]
57	1150	Bertrand pont de l’Hôtel-Dieu	près du pont de l’Hôtel-Dieu						132448	[]	[]
58	1150	Bibliothèque du roi							101619	[]	[]
59	1150	"Bordel, rue de Clichy"	"Maison de la barrière blanche, rue de Clichy"						101630	[]	[]
60	1150	Boulevard du Temple							101633	[]	[]
61	1176	un théâtre							132682	[]	[]
62	1177	"Breuilport, résidence particulière"							104673	[]	[]
63	1178	un théâtre ou la cour							101655	[]	[]
64	1153	Burgtheater							132668	[]	[]
65	1180	Café de la Comédie			1779-01-01	1779-12-31			340340	[]	[]
66	1181	Calais et Dunkerque							104686	[]	[]
67	1182	un théâtre							104687	[]	[]
68	1165	Casa de las Comedias	rue de la Main de Fer et rue de l’Ancienne Comédie				1600-01-01	1699-12-31	320309	[]	[]
69	1150	Cathédrale de Paris							104986	[]	[]
70	1184	un théâtre							104693	[]	[]
71	1185	Château de Chambord							132709	[]	[]
72	1150	Champs-Élysées							316969	[]	[]
73	1186	un théâtre							104696	[]	[]
74	1150	Chantier de la Paix							101670	[]	[]
75	1187	à la cour							101671	[]	[]
76	1189	à la cour							104700	[]	[]
77	1190	chez le Camus de Mézières							101674	[]	[]
78	1191	un théâtre							101675	[]	[]
79	1192	Château d’Anet							101547	[]	[]
80	1193	Château d’Arcueil							101554	[]	[]
81	1194	Château d’Argenton							104644	[]	[]
82	1195	Château d’Etioles							101789	[]	[]
83	1196	Château d’Eu							320260	[]	[]
84		Château d’Ombreval							320296	[]	[]
85		Château de Bar							338509	[]	[]
86	1197	Château de Bel Oeil							104705	[]	[]
87	1198	Château de Bélébat							101606	[]	[]
88	1199	Château de Bellevue			1751-01-27	1751-01-27			101607	[]	[]
89	1200	Château de Bercy							101609	[]	[]
90	1201	Château de Berny	près route d’Orléans (à 3 lieues au sud de Paris)		1640-01-01	1640-12-31	1771-01-01	1771-12-31	101610	[]	[]
91	1202	Château de Bidache							132711	[]	[]
92	1175	Château de Blois							304370	[]	[]
93	1203	Château de Boussy-Saint-Antoine							104712	[]	[]
94	1204	Château de Brunoy							101653	[]	[]
95		Château de Carrouges	dans l’Orne						338713	[]	[]
96	1205	Château de Castelnau d’Estretefond							334639	[]	[]
97		"Château de Challes, chez le comte de Montrevel"	en Bresse		1770-01-01	1779-12-31			338721	[]	[]
98	1206	Château de Chamblay							104713	[]	[]
99		Château de Champs-sur-Marne							306576	[]	[]
100	1207	Château de Châtenay							101677	[]	[]
101	1208	Château de Choisy							101676	[]	[]
102	1209	Château de Cirey (chez Mme du Châtelet)							332045	[]	[]
103		Château de Clisson							101717	[]	[]
104	1210	Château de Commercy							104716	[]	[]
105	1211	Château de Compiègne							320252	[]	[]
106	1212	Château de Comteney							101759	[]	[]
107	1213	Château de Conflans des ducs de Richelieu							320249	[]	[]
108	1214	Château de Courtenay							101767	[]	[]
109	1215	Château de Dreux							304090	[]	[]
110	1216	Château de Fontainebleau							101823	[]	[]
111	1217	Château de Friedrichfelds							104718	[]	[]
112	1218	Château de L’Aigle			1780-01-01	1780-12-31			338712	[]	[]
113	1150	Château de l’Ermitage							101787	[]	[]
114	1150	Château de la Chevrette							101689	[]	[]
115	1219	Château de La Chevrette (chez M. de Magnanville)							104720	[]	[]
116		Château de la Cour Neuve							101766	[]	[]
117	1220	Château de La Grange-des-Près							320314	[]	[]
118		Château de La Malgrange					1739-01-01	1739-12-31	307377	[]	[]
119	1221	Château de la princesse Palatine							320317	[]	[]
120		Château de La Roche-Guyon	(Val d’Oise)						303036	[]	[]
121	1153	Château de Laxenburg							104725	[]	[]
122		château de Limours	voisinage de Rochefort-en-Yvelines		1775-01-01	1775-12-31	1792-04-03	1792-04-03	339375	[]	[]
123	1222	Château de Livry							102048	[]	[]
124		château de Louveciennes			1771-01-01	1771-12-31			339412	[]	[]
125	1223	Château de Lussany							104726	[]	[]
126	1224	Château de Mannheim							104727	[]	[]
127		Château de Marimont							102092	[]	[]
128	1225	Château de Marly							102093	[]	[]
129		château de Merville							308712	[]	[]
130		Château de Meudon							307975	[]	[]
131	1226	Château de Monceau							104729	[]	[]
132		Château de Morville	(Eure et Loire) près d’Epernon						102132	[]	[]
133	1227	Château de Nantes							320290	[]	[]
134	1228	Château de Nérac							320293	[]	[]
135	1229	Château de Neufbourg							132698	[]	[]
136	1230	Château de Pierre							104731	[]	[]
137		Château de Raincy-Livry	actuel département de Seine-Saint-Denis		1640-01-01	1640-12-31	1854-01-01	1854-12-31	102219	[]	[]
138	1231	Château de Rheinsberg							104733	[]	[]
139		Château de Saint-Fargeau							320325	[]	[]
140	1232	Château de Saint-Hubert							104735	[]	[]
141	1233	Château de Saint-Lô							132692	[]	[]
142	1234	Château de Saint-Maur							102258	[]	[]
143		Château de Saint-Maur-des-Fossés							320326	[]	[]
144	1235	Château de Saint-Ouen							102259	[]	[]
145	1236	Château de Sceaux							101774	[]	[]
146	1237	Château de Séverac (château des ducs d’Arpajon)							320330	[]	[]
147	1238	Château de Soindre							104738	[]	[]
148	1239	Château de Sully-sur-Loire							308711	[]	[]
149	1240	Château de Vaujours							102357	[]	[]
150		Château de Vaux-le-Vicomte							320343	[]	[]
151	1241	Château de Versailles							102365	[]	[]
152	1242	Château de Villers-Cotterets							102395	[]	[]
153	1243	Château de Vincennes							102398	[]	[]
154	1244	Château de Weissenstein							104741	[]	[]
155	1245	Château des ducs d’Epernon							320238	[]	[]
156	1246	Château des ducs de Richelieu							320324	[]	[]
157	1184	Château des ducs de Savoie							320242	[]	[]
158	1247	Château des Reich de Pennautier							320308	[]	[]
159	1169	Château du Coq							101763	[]	[]
160		Château du duc d’Aiguillon	province de Guyenne		1776-01-01	1776-12-31			310680	[]	[]
161	1150	Château du Louvre							132862	[]	[]
162	1248	Château-Trompette							303155	[]	[]
163	1249	une résidence particulière							104742	[]	[]
164	1150	Chaussée d’Antin	Rue de la Chaussée d’Antin						101551	[]	[]
165	1250	une résidence particulière							104743	[]	[]
166	1251	une résidence particulière							101688	[]	[]
167	1150	Chez Bernard de Rieux							104620	[]	[]
168	1252	Chez du Barry							101701	[]	[]
169	1253	Chez Fanny de Beauharnais							104857	[]	[]
170	1150	Chez Fauron	Faubourg Saint-Germain						101796	[]	[]
171	1150	Chez G.							102075	[]	[]
172	1213	Chez Gueullette	près Charenton						102079	[]	[]
173	1252	Chez Gueullette							101697	[]	[]
174	1150	Chez Jean-Marie Filz	"Faubourg S. Germain, rue de Seve"		1667-01-01	1667-12-31	1673-01-01	1673-12-31	304344	[]	[]
175	1150	Chez Jean-Marie Filz	au Cloître Saint Germain l’Auxerrois						304357	[]	[]
176	1156	Chez l’Abbé Liébault							104850	[]	[]
177		Chez l’Intendant de Bourgogne							132713	[]	[]
178		Chez la comtesse d’Armagnac							300021	[]	[]
179	1150	Chez la comtesse de Fontaine-Martel			1731-01-01	1731-12-31	1732-01-01	1732-12-31	101819	[]	[]
180	1241	Chez la Dauphine							102389	[]	[]
181		Chez la duchesse de Bourbon							101642	[]	[]
182	1241	Chez la duchesse de Bourgogne							132658	[]	[]
183	1150	Chez la duchesse de Ferté							132714	[]	[]
184	1254	Chez la duchesse de Mazarin							101694	[]	[]
185		Chez la duchesse de Villeroy							102392	[]	[]
186		Chez la maréchale de Luxembourg							102062	[]	[]
187		Chez la marquise d’Estissac							304413	[]	[]
188	1150	Chez la marquise de Gerbevillers							104844	[]	[]
189	1150	Chez la marquise de Lambert	rue de Richelieu		1710-01-01	1710-12-31	1733-01-01	1733-12-31	102039	[]	[]
190	1150	Chez la marquise de Montesson	Chaussée d’Antin		1773-01-01	1773-12-31			102125	[]	[]
191	1241	Chez la reine							102370	[]	[]
192	1255	Chez le baron de Beaujeu							132715	[]	[]
193	1150	Chez le baron de Bezanval							104752	[]	[]
194	1150	Chez le chevalier Christophe-Louis Pajot de Villers	"grande rue Taranne, faubourg St-Germain, paroisse St-Sulpice"						309237	[]	[]
195	1150	Chez le chevalier d’Arcq			1767-01-01	1767-12-31	1767-01-01	1767-12-31	104753	[]	[]
196	1150	Chez le chevalier de Saint-Mars							104754	[]	[]
197	1256	"Chez le comte Cheremetev, à Kouskovo"			1700-01-01	1799-12-31			353207	[]	[]
198		Chez le comte d’Albaret							303042	[]	[]
199		Chez le Comte d’Argental							101555	[]	[]
200	1150	Chez le comte d’Artois							104756	[]	[]
201		Chez le comte de Beaujolais							101598	[]	[]
202	1201	Chez le comte de Clermont			1737-01-01	1737-12-31	1771-01-01	1771-12-31	104668	[]	[]
203	1150	Chez le comte de Clermont	rue de la Roquette (faubourg Saint Antoine)		1753-01-01	1753-12-31	1771-01-01	1771-12-31	104759	[]	[]
204	1150	Chez le comte de Clermont							101709	[]	[]
205		Chez le comte de Dufort de Cheverny							338206	[]	[]
206		Chez le comte de Flamarens							101805	[]	[]
207		Chez le comte de Flavigny							343092	[]	[]
208	1257	Chez le comte de Montrevel (ensuite : théâtre municipal)			1772-03-01	1772-03-31			104936	[]	[]
209	1150	Chez le comte de Noailles							104761	[]	[]
210	1169	Chez le comte de Rohault							104651	[]	[]
211	1258	Chez le comte Petr Borisovitch Cheremetev							353202	[]	[]
212		Chez le duc d’Antin							303044	[]	[]
213	1259	Chez le duc d’Ayen							132482	[]	[]
214	1260	Chez le duc d’Orléans							104661	[]	[]
215	1150	Chez le duc d’Orléans							102165	[]	[]
216		Chez le duc de Durac							101781	[]	[]
217	1261	Chez le duc de Grammont							102211	[]	[]
218	1150	Chez le limonadier Beaulieu	boulevard du Temple						316073	[]	[]
219	1262	Chez le marquis d’Ossun							318113	[]	[]
220	1170	Chez le marquis de Blauvac							339009	[]	[]
221	1263	Chez le marquis de Maillebois							104973	[]	[]
222		Chez le marquis de Richelieu			1600-01-01	1699-12-31	1600-01-01	1699-12-31	304016	[]	[]
223	1255	Chez le marquis du Châtelet							132717	[]	[]
224	1264	Chez le président Hénault							102063	[]	[]
225		Chez le président Tubeuf							305871	[]	[]
226	1265	Chez le prince d’Hénin							104766	[]	[]
227	1187	Chez le prince de Condé							104699	[]	[]
228	1266	Chez les Caraman							309570	[]	[]
229	1267	Chez les Carmelites							132480	[]	[]
230		Chez les demoiselles de l’enfant Jésus							101773	[]	[]
231	1268	Chez les Demoiselles Pensionnaires							104955	[]	[]
232	1269	Chez les Filles de Saint François de Sales							132644	[]	[]
233	1270	Chez les pères bénédictins de S. Nicolas							320479	[]	[]
234	1271	Chez M. Begon							132718	[]	[]
235	1150	Chez M. Bouland	rue Saint-Antoine						318290	[]	[]
236		"Chez M. Cattelan, Secretaire du Conseil"							304009	[]	[]
237	1150	Chez M. Corberon-Campdeville							104744	[]	[]
238		Chez M. de Beaumanoir							101605	[]	[]
239		Chez M. de Bonneval							334652	[]	[]
240	1272	Chez M. de Cougoulin							320336	[]	[]
241	1150	Chez M. de Cury			1753-01-01	1753-12-31			343511	[]	[]
242		Chez M. de la Garde							102033	[]	[]
243	1273	Chez M. de la Haye							132866	[]	[]
244	1274	Chez M. de la Popelinière							102034	[]	[]
245		Chez M. de Meuers							304025	[]	[]
246	1195	Chez M. de Meulan							101791	[]	[]
247	1176	Chez M. de Montgeron							306560	[]	[]
248		Chez M. de Montpensier							307009	[]	[]
249	1150	Chez M. de Rions							132720	[]	[]
250		Chez M. de Salavette							102262	[]	[]
251	1150	Chez M. de Savalette							104776	[]	[]
252		Chez M. de Verneuil							306311	[]	[]
253	1150	Chez M. de Villeroy							104777	[]	[]
254		Chez M. Francastel							322795	[]	[]
255	1150	Chez M. Hesselin							305695	[]	[]
256	1150	Chez M. L. B.							104621	[]	[]
257		Chez M. Labé de Richelieu							304023	[]	[]
258	1150	Chez M. Laporte	Rue des Noyers						132444	[]	[]
259		Chez M. le duc de Montbazon							305004	[]	[]
260	1275	Chez M. Louis Hesselin (château de Chantemerle)							132721	[]	[]
261	1276	Chez M. Muret							304940	[]	[]
262		Chez M. Poinsinet de Sivry							338207	[]	[]
263	1150	Chez M. Voltaire	Rue Traversière Saint-Honoré						104745	[]	[]
264		Chez Madame de Graffigny							338208	[]	[]
265	1150	Chez Maurepas							102076	[]	[]
266	1277	Chez Mlle Dangeville							101768	[]	[]
267	1169	Chez Mlle de Clermont							101572	[]	[]
268	1150	Chez Mlle Duménil	"rue Blanche, sur l’emplacement des nos. 22-28"						101780	[]	[]
269		Chez Mlle Guimard	Pantin						357865	[]	[]
270	1150	Chez Mlle Montansier							104785	[]	[]
271	1157	Chez Mlle Poulletier							104930	[]	[]
272	1150	Chez Mlle Quinault							102073	[]	[]
273	1150	Chez Mlle Raucourt							104746	[]	[]
274	1150	Chez Mme de Brianne							336196	[]	[]
275		Chez Mme de Caraman							101659	[]	[]
276	1150	Chez Mme de Cassini							101661	[]	[]
277		Chez Mme de Genlis							101981	[]	[]
278		Chez Mme de la Trimouille							304014	[]	[]
279	1241	Chez Mme de Maintenon							102372	[]	[]
280	1241	Chez Mme de Marck							102373	[]	[]
281	1208	Chez Mme de Mazarin							101698	[]	[]
282	1150	Chez Mme de Méaux							102099	[]	[]
283		Chez Mme de Mirepoix							102109	[]	[]
284		Chez Mme de Staremberg							102289	[]	[]
285	1150	Chez Mme de Thiange							132722	[]	[]
286	1149	Chez Mme de Troussel							104666	[]	[]
287		Chez Mme de Villemur (à Chantemerle)	Chantemerle						322370	[]	[]
288	1150	Chez Mme Le Marchand			1727-01-01	1727-12-31	1732-01-01	1732-12-31	347336	[]	[]
289	1150	Chez Nicolet							101693	[]	[]
290	1278	Chez Préville							101828	[]	[]
291	1150	Chez Renard-Saint-Merri							102227	[]	[]
292	1150	Chez Sévère Mordant			1762-01-01	1762-12-31			104612	[]	[]
293	1150	Chez sieur Ferrère							104647	[]	[]
294	1256	Chez Stepan Stepanovitch Apraksine							353227	[]	[]
295	1279	une résidence particulière							104793	[]	[]
296	1252	un théâtre							104795	[]	[]
297	1150	Cirque du Palais-Royal	Palais-Royal		1789-09-08	1789-09-08	1799-01-01	1799-12-31	101706	[]	[]
298	1150	Cirque Royal	"nouveaux boulevards, près le Luxembourg"		1777-01-01	1777-12-31			309190	[]	[]
299	1150	Cirques Olympiques	Faubourg du Temple		1782-01-01	1782-12-31	1862-01-01	1862-12-31	368079	[]	[]
300	1280	à la cour							101707	[]	[]
301	1281	un théâtre							104801	[]	[]
302	1282	une résidence particulière							101715	[]	[]
303	1283	Collège d’Anjou des Prêtres de l’Oratoire							304229	[]	[]
304	1284	Collège d’Embrun			1583-01-01	1583-12-31	1763-01-01	1763-12-31	104886	[]	[]
305	1285	Collège d’Evreux							101721	[]	[]
306	1150	Collège d’Harcourt			1280-01-01	1280-12-31	1793-01-01	1793-12-31	101722	[]	[]
307	1286	Collège d’Orléans							101723	[]	[]
308	1241	Collège d’Orléans							101724	[]	[]
309	1287	Collège de Bayeux							132724	[]	[]
310	1288	Collège de Beauvais							104805	[]	[]
311	1289	Collège de Bourbon							104806	[]	[]
312	1179	Collège de Bourbon							104680	[]	[]
313	1290	Collège de Chabeuil							132726	[]	[]
314	1150	Collège de Clermont			1560-01-01	1560-12-31	1682-01-01	1682-12-31	101710	[]	[]
315	1248	Collège de Guyenne							104809	[]	[]
316	1291	Collège de l’Oratoire			1600-01-01	1699-12-31	1700-01-01	1799-12-31	132736	[]	[]
317	1292	Collège de l’Oratoire							132737	[]	[]
318	1293	Collège de l’Oratoire							104810	[]	[]
319	1271	Collège de l’Oratoire			1625-01-01	1625-12-31	1792-01-01	1792-12-31	132739	[]	[]
320	1294	Collège de l’Oratoire							132740	[]	[]
321	1220	Collège de l’Oratoire							132741	[]	[]
322	1276	Collège de l’Oratoire							132742	[]	[]
323	1295	Collège de l’Oratoire							132743	[]	[]
324	1296	Collège de l’Oratoire							101733	[]	[]
325	1297	Collège de l’Oratoire (Collège Saint-Nicolas)			1530-01-01	1530-12-31	1792-01-01	1792-12-31	132744	[]	[]
326	1298	Collège de la communauté de Sauveuze							101542	[]	[]
327	1299	Collège de la Doctrine chrétienne							132746	[]	[]
328	1300	Collège de la Doctrine chrétienne							132747	[]	[]
329	1301	Collège de la Doctrine chrétienne							132749	[]	[]
330	1302	Collège de la Doctrine chrétienne							132750	[]	[]
331	1303	Collège de la Doctrine chrétienne (dit de l’Esquille)	rue de l’Esquille						132748	[]	[]
332	1150	Collège de la Flèche							101727	[]	[]
333	1150	Collège de la Marche			1362-01-01	1362-12-31	1790-01-01	1790-12-31	101728	[]	[]
334	1304	Collège de la paroisse							132751	[]	[]
335	1157	Collège de la Sainte Trinité			1565-01-01	1565-12-31			101729	[]	[]
336	1305	Collège de Meaux			1556-01-01	1556-12-31	1791-01-01	1791-12-31	132727	[]	[]
337	1305	Collège de Meaux							132728	[]	[]
338	1150	Collège de Montaigu			1317-01-01	1317-12-31	1792-01-01	1792-12-31	132753	[]	[]
339	1306	Collège de Montauban							104813	[]	[]
340		Collège de Parthenay							102188	[]	[]
341	1233	Collège de Saint-Lô							104817	[]	[]
342	1307	Collège de Saint-Maixent							104818	[]	[]
343	1308	Collège de Saint-Paul							132628	[]	[]
344	1309	Collège de Soignies							104820	[]	[]
345	1310	Collège de Thouars							101732	[]	[]
346	1311	Collège de Valognes							104823	[]	[]
347	1312	Collège de Vernon							101734	[]	[]
348	1179	Collège des Arts							101735	[]	[]
349	1269	Collège des Augustins							132756	[]	[]
350	1313	Collège des Barnabites							132757	[]	[]
351	1314	Collège des Barnabites			1620-01-01	1620-12-31			102123	[]	[]
352	1315	Collège des Barnabites							132759	[]	[]
353	1316	Collège des Bons Enfants de l’Université							132466	[]	[]
354	1317	Collège des Bons-Enfants							307306	[]	[]
355	1318	Collège des Chanoines Réguliers			1637-01-01	1637-12-31	1792-01-01	1792-12-31	101736	[]	[]
356	1319	Collège des Eudistes							132761	[]	[]
357	1150	Collège des Grassins			1584-01-01	1584-12-31	1789-01-01	1789-12-31	132762	[]	[]
358	1320	Collège des Humanistes							104909	[]	[]
359	1321	Collège des Jésuites							104626	[]	[]
360	1298	Collège des Jésuites			1608-01-01	1608-12-31	1761-01-01	1761-12-31	101543	[]	[]
361	1322	Collège des Jésuites							132763	[]	[]
362	1323	Collège des Jésuites							132764	[]	[]
363	1324	Collège des Jésuites							132766	[]	[]
364	1155	Collège des Jésuites							132767	[]	[]
365	1325	Collège des Jésuites							132768	[]	[]
366	1162	Collège des Jésuites							104642	[]	[]
367	1164	Collège des Jésuites							132769	[]	[]
368	1326	Collège des Jésuites			1603-01-01	1603-12-31	1762-01-01	1762-12-31	132770	[]	[]
369	1494	Collège des Jésuites							132771	[]	[]
370	1327	Collège des Jésuites							132731	[]	[]
371	1328	Collège des Jésuites							132772	[]	[]
372	1170	Collège des Jésuites							104658	[]	[]
373	1329	Collège des Jésuites							132774	[]	[]
374	1330	Collège des Jésuites							132775	[]	[]
375	1331	Collège des Jésuites							132776	[]	[]
376	1304	Collège des Jésuites							132777	[]	[]
377	1175	Collège des Jésuites			1623-01-01	1623-12-31	1762-01-01	1762-12-31	132778	[]	[]
378	1248	Collège des Jésuites			1572-01-01	1572-12-31	1762-01-01	1762-12-31	101738	[]	[]
379	1332	Collège des Jésuites							132780	[]	[]
380	1176	Collège des Jésuites							104672	[]	[]
381	1333	Collège des Jésuites							132783	[]	[]
382	1182	Collège des Jésuites			1562-01-01	1562-12-31	1765-04-01	1765-04-01	132784	[]	[]
383	1334	Collège des Jésuites			1608-01-01	1608-12-31	1768-01-01	1768-12-31	132785	[]	[]
384	1151	Collège des Jésuites							132786	[]	[]
385	1335	Collège des Jésuites							132787	[]	[]
386	1183	Collège des Jésuites							132788	[]	[]
387	1336	Collège des Jésuites							104807	[]	[]
388	1184	Collège des Jésuites			1565-01-01	1565-12-31	1729-01-01	1729-12-31	132790	[]	[]
389	1188	Collège des Jésuites							132791	[]	[]
390	1337	Collège des Jésuites							132792	[]	[]
391	1338	Collège des Jésuites							132793	[]	[]
392	1211	Collège des Jésuites			1654-01-01	1654-12-31	1762-01-01	1762-12-31	132794	[]	[]
393	1156	Collège des Jésuites							104808	[]	[]
394	1339	Collège des Jésuites							132796	[]	[]
395	1340	Collège des Jésuites							132797	[]	[]
396	1341	Collège des Jésuites			1631-01-01	1631-12-31	1762-01-01	1762-12-31	132798	[]	[]
397	1196	Collège des Jésuites							132799	[]	[]
398	1342	Collège des Jésuites							132800	[]	[]
399	1284	Collège des Jésuites			1651-01-01	1651-12-31	1762-01-01	1762-12-31	104887	[]	[]
400	1343	Collège des Jésuites							132802	[]	[]
401	1593	Collège des Jésuites			1604-01-01	1604-12-31	1762-01-01	1762-12-31	104811	[]	[]
402	1344	Collège des Jésuites							132804	[]	[]
403	1345	Collège des Jésuites							132805	[]	[]
404	1346	Collège des Jésuites			1592-01-01	1592-12-31	1765-01-01	1765-12-31	104911	[]	[]
405	1264	Collège des Jésuites							104920	[]	[]
406	1271	Collège des Jésuites							104944	[]	[]
407	1347	Collège des Jésuites							132808	[]	[]
408	1348	Collège des Jésuites							132809	[]	[]
409	1349	Collège des Jésuites							132810	[]	[]
410	1350	Collège des Jésuites							132811	[]	[]
411	1351	Collège des Jésuites							132812	[]	[]
412	1352	Collège des Jésuites							104814	[]	[]
413	1353	Collège des Jésuites							132814	[]	[]
414	1354	Collège des Jésuites							104976	[]	[]
415	1355	Collège des Jésuites							132815	[]	[]
416	1356	Collège des Jésuites							132817	[]	[]
417	1357	Collège des Jésuites							132455	[]	[]
418	1316	Collège des Jésuites			1606-01-01	1606-12-31			102226	[]	[]
419	1358	Collège des Jésuites			1536-01-01	1536-12-31	1762-01-01	1762-12-31	104816	[]	[]
420	1359	Collège des Jésuites							132822	[]	[]
421	1317	Collège des Jésuites			1593-01-01	1593-12-31	1762-01-01	1762-12-31	101739	[]	[]
422	1360	Collège des Jésuites							132824	[]	[]
423	1308	Collège des Jésuites							132629	[]	[]
424	1361	Collège des Jésuites							132755	[]	[]
425	1362	Collège des Jésuites							132631	[]	[]
426	1363	Collège des Jésuites							132826	[]	[]
427	1269	Collège des Jésuites			1591-01-01	1591-12-31	1765-01-01	1765-12-31	104822	[]	[]
428	1364	Collège des Jésuites			1630-01-01	1630-12-31	1762-01-01	1762-12-31	132647	[]	[]
429	1365	Collège des Jésuites							132829	[]	[]
430	1153	Collège des Jésuites							132830	[]	[]
431	1366	Collège des Jésuites							338587	[]	[]
432	1303	Collège des Jésuites (dit de la Maison Professe)							104821	[]	[]
433	1367	Collège des Jésuites (Université)							132639	[]	[]
434	1368	Collège des Oratoriens							101740	[]	[]
435	1272	Collège des Oratoriens							132831	[]	[]
436	1369	Collège des Pères de la Doctrine chrétienne							132832	[]	[]
437	1150	Collège des Quatre Nations							102218	[]	[]
438	1179	Collège du Bois							104684	[]	[]
439	1150	Collège du Cardinal Lemoine							132833	[]	[]
440	1179	Collège du Mont							104681	[]	[]
441	1150	Collège du Plessis-Sorbonne			1323-01-01	1323-12-31	1790-01-01	1799-12-31	101743	[]	[]
442	1346	Collège du Séminaire (S. Pierre)							104912	[]	[]
443	1370	Collège et séminaire de Lisieux							322318	[]	[]
444		Collège jésuite							101744	[]	[]
445	1150	Collège Louis-le-Grand			1682-01-01	1682-12-31			101731	[]	[]
446	1150	Collège Mazarin			1661-01-01	1661-12-31	1793-01-01	1793-12-31	101749	[]	[]
447	1331	Collège près de Besançon							104843	[]	[]
448	1150	Collège royal de Navarre			1304-01-01	1304-12-31	1793-01-01	1793-12-31	104815	[]	[]
449	1371	Collège Wallon des Jésuites							132835	[]	[]
450	1179	Collèges des Jésuites							104683	[]	[]
451	1268	Collèges des Jésuites							104956	[]	[]
452	1296	Comédie de la Grande-Rue			1754-01-01	1754-12-31	1775-01-01	1775-12-31	132634	[]	[]
453	1352	Comédie de Nancy			1710-01-01	1719-12-31	1730-01-01	1739-12-31	339453	[]	[]
454		Comédie de Nancy	rue Saint-Dizier		1734-02-01	1734-02-28	1750-01-01	1750-12-31	339471	[]	[]
455	1352	Comédie de Nancy			1750-02-09	1750-02-09	1755-01-01	1755-12-31	339487	[]	[]
456	1303	Comédie du Logis de l’Ecu	rue des Imagiers (rue de la Pomme)		1600-01-01	1699-12-31			320337	[]	[]
457	1372	Comédie-Française de la Haye							104833	[]	[]
458	1150	Comédie-Italienne							101703	[]	[]
459	1150	Comédiens de bois	Palais-Royal		1791-01-28	1791-01-28	1791-01-01	1791-12-31	318401	[]	[]
460	1150	Comédiens des Menus Plaisirs du Roi							104836	[]	[]
461	1150	Concert de la Société des Enfants d’Apollon							104838	[]	[]
462	1150	Concert spirituel							329604	[]	[]
463	1298	Congrès d’Amiens							374556	[]	[]
464	1373	un théâtre							104839	[]	[]
465	1374	Cormeil en Parisis							101764	[]	[]
466	1375	une résidence particulière							101765	[]	[]
467		Cour (France)							101567	[]	[]
468		Cour (Paris)							101534	[]	[]
469	1376	Cour de Dresde							104854	[]	[]
470	1143	Cour de Prusse							104617	[]	[]
471	1377	Cour de Savoie							305725	[]	[]
472		Cour rue du Coq	rue du Coq		1600-01-01	1600-12-31			325506	[]	[]
473	1150	Couvent des Capucines	Rue des Petits Champs						344239	[]	[]
474	1150	Criticomanie	"chez la Satyre, rue de Bons Avis, à la Vérité"						104842	[]	[]
475	1150	Cul-de-sac de la rue des Quatre-Vents	"Foire Saint-Germain, cul-de-sac"						101855	[]	[]
476	1378	un théâtre							104851	[]	[]
477	1340	un théâtre							104852	[]	[]
478	1627	Amphithéâtre de Doué							178340	[]	[]
479	1376	un théâtre							104853	[]	[]
480	1150	Echiquier							200599	[]	[]
481	1379	une résidence particulière							305726	[]	[]
482	1380	Église abandonnée des Jésuites			1780-01-01	1780-12-31			331683	[]	[]
483	1303	Eglise métropolitaine Saint-Etienne							306545	[]	[]
484	1316	Eglise Saint-Antoine							319938	[]	[]
485	1271	Elèves privilégiés du duc d’Orléans							104947	[]	[]
486	1150	Elysée							200600	[]	[]
487	1381	un théâtre							104856	[]	[]
488		En province							104858	[]	[]
489		En société							104861	[]	[]
490	1157	En société							104933	[]	[]
491	1271	En société							104945	[]	[]
492	1157	Enseigne de la Vérité							104922	[]	[]
493		Étienne De Lancey							331697	[]	[]
494	1382	Everly	chez le duc de Mortemart (à 6 km de Bray sur la route de Provins)						309579	[]	[]
495	1150	Faubourg du Temple							316457	[]	[]
496	1150	Faubourg Saint-Honoré							102078	[]	[]
497	1383	chez Voltaire							101798	[]	[]
498	1259	Foire des loges	dans la forêt						102050	[]	[]
499	1150	Foire Saint-Germain							101840	[]	[]
500	1150	Foire Saint-Laurent							101907	[]	[]
501	1150	Foire Saint-Laurent							101927	[]	[]
502	1150	Foire Saint-Ovide							104867	[]	[]
503	1384	une résidence particulière							104870	[]	[]
504	1385	une résidence particulière							101829	[]	[]
505	1386	un théâtre							132535	[]	[]
506	1387	un théâtre							104876	[]	[]
507	1388	un théâtre							104877	[]	[]
508	1389	chez le comte de Vaudreuil							101979	[]	[]
509	1390	une résidence particulière							104878	[]	[]
510	1391	une résidence particulière							104879	[]	[]
511	1303	Grand Consistoire de l’Hôtel de ville							342917	[]	[]
512	1150	Grand jeu	Foire Saint-Laurent						101921	[]	[]
513	1155	Grand jeu de paume							174553	[]	[]
514	1263	Grand jeu de paume							320297	[]	[]
515	1328	Grand jeu de paume de la ville							320218	[]	[]
516	1176	Grand jeu de paume des Quatre Piliers							320237	[]	[]
517	1157	Grand Théâtre							102067	[]	[]
518	1224	Grand Théâtre							104940	[]	[]
519	1362	Grand Théâtre	rue de la Scellerie		1796-01-01	1796-12-31			339008	[]	[]
520	1271	Grand Théâtre (Opéra de Marseille)			1787-10-31	1787-10-31	1919-11-13	1919-11-13	104882	[]	[]
521	1317	"Grand Théâtre (Théâtre de la Montagne, Théâtre des Arts)"			1776-01-01	1776-12-31			338963	[]	[]
522	1248	Grand Théâtre de Bordeaux	Place de la Comédie		1780-01-01	1780-12-31			338974	[]	[]
523	1178	Grand Théâtre de la Monnaie			1700-01-01	1700-12-31			104676	[]	[]
524	1331	Grande salle de l’hôtel consistorial			1674-01-01	1674-12-31			320224	[]	[]
525	1392	Grande salle de l’hôtel de ville							320228	[]	[]
526		Grange du château d’Einville	Lorraine		1700-01-01	1700-12-31			307376	[]	[]
527	1269	Halle aux Grains							320342	[]	[]
528	1393	théâtre ou cour							329323	[]	[]
529	1376	Hoftheater							104855	[]	[]
530	1220	Hôtel d’Alfonce							320313	[]	[]
531	1150	Hôtel d’Aligre	rue d’Orléans-Saint-Honoré						310459	[]	[]
532	1150	Hôtel d’Argent	rue de la Verrerie						325763	[]	[]
533	1150	Hôtel d’Auberval							101569	[]	[]
534	1150	Hôtel de Belle-Isle							104888	[]	[]
535	1184	Hôtel de Bellegarde							104694	[]	[]
536	1150	Hôtel de Bouillon							101631	[]	[]
537	1150	Hôtel de Brancas	"Rue de Lille, 19"						101645	[]	[]
538	1350	Hôtel de Castries							320285	[]	[]
539		Hôtel de Chevreuse							304289	[]	[]
540	1150	Hötel de Chevreuse							305024	[]	[]
541	1150	Hôtel de Clermont-Tonnerre	Marais						101713	[]	[]
542		Hôtel de Condé							306382	[]	[]
543	1241	Hôtel de Conti							101532	[]	[]
544	1150	Hôtel de Créqui	Place Vendôme (No. 7)		1704-01-01	1704-12-31			132848	[]	[]
545	1150	Hôtel de Jobak	Rue Saint-Merry						102026	[]	[]
546	1366	Hôtel de l’Intendance							104904	[]	[]
547	1297	Hôtel de l’Intendance							104747	[]	[]
548	1362	Hôtel de La Bourdaisière							320339	[]	[]
549	1150	Hôtel de La Guette	rue du Four-Saint-Germain						309159	[]	[]
550	1150	Hôtel de la Guimard							101994	[]	[]
551	1156	Hôtel de Langres							104849	[]	[]
552	1150	Hôtel de Lauzun							303057	[]	[]
553	1184	Hôtel de Mareste							104695	[]	[]
554	1150	Hôtel de Montalambert	rue de la Roquette						102121	[]	[]
555	1150	Hôtel de Montmorency							132850	[]	[]
556	1150	Hôtel de Nevers	Rue de Richelieu						102144	[]	[]
557	1150	Hôtel de Pontchartrain	Rue Fromenteau (Place du Carrousel)		1640-01-01	1640-12-31	1707-01-01	1707-12-31	102200	[]	[]
558	1150	Hôtel de Richelieu							104891	[]	[]
559	1241	Hôtel de Richelieu							132659	[]	[]
560	1150	Hôtel de Saïd Mehemet							104898	[]	[]
561	1352	Hôtel de Salm							320288	[]	[]
562	1150	Hôtel de Sassenage							102269	[]	[]
563	1150	Hôtel de Soissons							102282	[]	[]
564	1150	Hôtel de Soubise			1769-01-01	1769-12-31	1781-01-01	1781-01-31	336162	[]	[]
565	1150	Hôtel de Soyecourt	Faubourg Saint-Honoré						102283	[]	[]
566	1150	Hôtel de Tonnerre							104893	[]	[]
567	1322	Hôtel de Ville			1656-01-01	1656-12-31			174548	[]	[]
568	1394	Hôtel de ville							306093	[]	[]
569	1157	Hôtel de Ville							104923	[]	[]
570	1150	Hôtel de ville							304826	[]	[]
571	1346	Hôtel de ville							320269	[]	[]
572	1356	Hôtel de ville							320303	[]	[]
573	1395	Hôtel de ville							320332	[]	[]
574	1153	Hôtel de ville							320345	[]	[]
575	1150	Hôtel des Dlles Verrières	Rue de la Chaussée d’Antin						102364	[]	[]
576	1150	Hôtel des Menus	Rue Bergère						102105	[]	[]
577	1150	Hôtel des Menus Plaisirs du Roi	rue Bergère						318322	[]	[]
578		Hôtel du Duc de Sully							340048	[]	[]
579	1150	Hôtel du Marais du Temple							102086	[]	[]
580	1248	Hôtel du Président Pichon							320232	[]	[]
581	1248	Hôtel du Président Pontac							320233	[]	[]
582	1150	Hôtel Duras	Rue d’Aguesseau (No 1)		1719-01-01	1719-12-31	1928-01-01	1928-12-31	132849	[]	[]
583	1150	Hôtel Lejay	près rue Garancière		1705-01-01	1705-12-31			102042	[]	[]
584	1150	Hôtel Montalembert	rue de la Roquette (faubourg Saint Antoine)		1784-01-01	1784-12-31	1786-01-01	1786-12-31	303059	[]	[]
585	1396	Hôtellerie Saint-Nicolas de la veuve Vitart			1670-01-01	1670-12-31			320251	[]	[]
586	1397	une résidence particulière							104894	[]	[]
587	1258	Institut Smolni (Smolny)			1771-01-01	1771-12-31			362176	[]	[]
588	1398	une résidence particulière							104896	[]	[]
589	1150	Jardin de Ruggieri	"anciennement, rue des Porcherons"		1765-01-01	1765-12-31			102247	[]	[]
590		Jardin du sieur Renard							305870	[]	[]
591		Jeu de Belair (ou l’Opéra-Comique de Belair)	"rue des Quatre-Vents, FSG"						316568	[]	[]
592	1322	Jeu de paume							174547	[]	[]
593	1298	Jeu de paume							174554	[]	[]
594	1325	Jeu de paume							320213	[]	[]
595	1291	Jeu de paume							320223	[]	[]
596	1331	Jeu de paume							320225	[]	[]
597	1392	Jeu de paume							320227	[]	[]
598	1184	Jeu de paume							320243	[]	[]
599	1188	Jeu de paume							320248	[]	[]
600	1399	Jeu de paume							320259	[]	[]
601	1342	Jeu de paume							320261	[]	[]
602	1366	Jeu de paume							320264	[]	[]
603	1350	Jeu de paume							320283	[]	[]
604	1400	Jeu de paume							320292	[]	[]
605	1220	Jeu de paume							320312	[]	[]
606	1272	Jeu de paume							320335	[]	[]
607	1401	Jeu de paume							320341	[]	[]
608	1153	Jeu de paume							320344	[]	[]
609	1227	Jeu de paume	rue St Leonard		1687-01-01	1687-12-31			339001	[]	[]
610	1349	Jeu de paume Chatin							320281	[]	[]
611	1150	Jeu de paume d’Orléans	"Foire Saint-Germain, rue des Quatre-Vents"						101846	[]	[]
612	1248	Jeu de paume de Barbarin			1600-01-01	1699-12-31	1716-01-01	1716-12-31	320231	[]	[]
613	1150	Jeu de paume de Becquet	rue de Vaugirard		1646-07-01	1646-07-31			332998	[]	[]
614	1150	Jeu de paume de Belair	Rue de Vaugirard (No 13)		1672-11-15	1672-11-15			101858	[]	[]
615	1321	Jeu de paume de Bellegarde	hors les murs						174549	[]	[]
616	1150	Jeu de paume de Berthaud	Impasse Berthaud (rue Beaubourg)		1629-01-01	1629-12-31	1632-01-01	1632-12-31	132852	[]	[]
617	1296	Jeu de paume de Braque							320340	[]	[]
618	1271	Jeu de paume de Castellane	rue Tubaneau		1680-09-01	1680-09-30			320277	[]	[]
619	1150	Jeu de paume de Chérier			1643-01-01	1643-12-31			327074	[]	[]
620	1321	Jeu de paume de Delourme							174552	[]	[]
621	1150	Jeu de paume de l’Etoile	Foire Saint-Germain						101862	[]	[]
622	1284	Jeu de paume de l’Hôpital							320263	[]	[]
623	1353	Jeu de paume de l’hôtel de ville							320294	[]	[]
624	1402	Jeu de paume de l’Hôtellerie de la Perle							320265	[]	[]
625	1403	Jeu de paume de la Biche							320266	[]	[]
626	1150	Jeu de paume de la Bouteille	Rue Mazarine (Nos 42-44)		1670-01-01	1670-12-31	1687-01-01	1687-12-31	102028	[]	[]
627	1150	Jeu de paume de la Croix Noire	"32, quai des Célestins"		1645-01-01	1645-12-31			327075	[]	[]
628	1317	Jeu de paume de la Cuillère-à-Pot							320323	[]	[]
629	1150	Jeu de paume de la Fontaine	Rue Michel-le-Comte (No 25?)		1632-03-15	1632-03-15	1634-03-15	1634-03-15	132853	[]	[]
630	1362	Jeu de paume de la Moquerie							320338	[]	[]
631	1286	Jeu de paume de la Perle							320301	[]	[]
632	1156	Jeu de paume de la Poissonnerie							320256	[]	[]
633	1358	Jeu de paume de la Poulaillerie	rue de la Poulaillerie						320319	[]	[]
634	1150	Jeu de paume de la rue de Buci (Bussy)	Foire Saint-Germain		1726-02-01	1726-02-28			101656	[]	[]
635	1271	Jeu de paume de la rue du Pavillon					1695-01-01	1695-12-31	320276	[]	[]
636	1156	Jeu de paume de la Salamandre							320257	[]	[]
637	1150	Jeu de paume de la Sphère	Rue Vieille-du-Temple		1631-12-12	1631-12-12	1632-03-15	1632-03-15	132909	[]	[]
638	1284	Jeu de paume de Lesdiguières							320262	[]	[]
639	1404	Jeu de paume de Maubec					1741-01-01	1741-12-31	320221	[]	[]
640	1170	Jeu de paume de Mignard							320220	[]	[]
641	1349	Jeu de paume de Nexirue							320280	[]	[]
642	1404	Jeu de paume de Nyert							320222	[]	[]
643	1170	Jeu de Paume de Pompée Catilina	Place Crillon		1622-01-01	1622-12-31			339016	[]	[]
644	1317	Jeu de paume de Saint-Eustache							320322	[]	[]
645	1357	Jeu de paume de Saint-Jacques							320315	[]	[]
646	1326	Jeu de paume de Watelet							320217	[]	[]
647	1271	Jeu de paume des Accoules							320275	[]	[]
648	1317	Jeu de paume des Braques							320321	[]	[]
649	1227	Jeu de paume des Carmes							320289	[]	[]
650	1317	Jeu de paume des Deux-Maures	"rue des Charettes, au coin de la rue Herbière"		1650-01-01	1650-12-31			320320	[]	[]
651	1357	Jeu de paume des Flageolles							320316	[]	[]
652	1353	Jeu de paume des Gascoing							320295	[]	[]
653	1338	Jeu de paume des Gras							320253	[]	[]
654	1283	Jeu de paume des Halles							320215	[]	[]
655	1150	Jeu de paume des Métayers	"rue Mazarine, n ° 10, 12, 14"		1643-01-01	1643-12-31			327073	[]	[]
656	1286	Jeu de paume du Bleu							320300	[]	[]
657	1286	Jeu de paume du Caud							320299	[]	[]
658	1356	Jeu de paume du château							320302	[]	[]
659	1358	Jeu de paume du Cheval Noir							320318	[]	[]
660	1170	Jeu de paume du Colonel							320219	[]	[]
661	1150	Jeu de paume du Dauphin	"Foire Saint-Germain, rue des Quatre-Vents"						101848	[]	[]
662	1178	Jeu de Paume du Gracht	Fossé-aux-Loups						344536	[]	[]
663	1179	Jeu de paume du Grand Roch							320239	[]	[]
664	1150	Jeu de paume du Marais	rue Vieille-du-Temple		1630-01-01	1639-12-31	1644-01-15	1644-01-15	327072	[]	[]
665	1150	Jeu de paume du Moutardier	rue Bourg-l’Abbé						326644	[]	[]
666	1150	Jeu de paume du Petit Couvert							332954	[]	[]
667	1150	Jeu de paume du Petit-Louvre			1632-01-01	1632-12-31			132855	[]	[]
668	1403	Jeu de paume du Porc-Epic							320267	[]	[]
669	1295	Jeu de paume du Portail des Billanges							320328	[]	[]
670	1150	Jeu de Saint Edme	Foire Saint-Germain						101868	[]	[]
671		Jeu de Terradoire	Foire Saint-Laurent						316706	[]	[]
672	1150	Jeu des Victoires	Foire Saint-Laurent						101939	[]	[]
673	1153	Kärntnertor							324168	[]	[]
674	1405	une résidence particulière							104864	[]	[]
675		L. R. à la campagne							102030	[]	[]
676		La Chevallerie							338715	[]	[]
677	1406	La Comédie d’Avenay			1748-01-01	1748-12-31			343510	[]	[]
678		La Comédie de Boulogne					1738-01-01	1738-12-31	343509	[]	[]
679	1407	La Coupe d’or			1769-01-01	1769-12-31			346385	[]	[]
680	1372	un théâtre							104901	[]	[]
681	1408	une résidence particulière							104902	[]	[]
682	1150	La Redoute chinoise	Foire Saint-Laurent		1781-01-01	1781-12-31			101942	[]	[]
683	1150	La Roquette	"rue de la Roquette, chez le duc de Noailles (faubourg Saint Antoine)"		1708-01-01	1708-12-31			102037	[]	[]
684	1409	La Solitude							104905	[]	[]
685	1241	Labyrinthe de Versailles							102038	[]	[]
686	1410	Le bordel de Mlle Delacroix							132457	[]	[]
687	1150	Le Colisée	Champs-Elysées		1771-05-23	1771-05-23	1779-03-19	1779-03-19	101718	[]	[]
688	1150	Le Vaudeville de Boulevard							200601	[]	[]
689	1303	Le Vauxhall			1700-01-01	1799-12-31	1776-01-01	1776-12-31	335889	[]	[]
690	1320	un théâtre							104908	[]	[]
691	1154	Little Theatre in the Haymarket							101998	[]	[]
692	1150	Loge d’Alard	Foire Saint-Laurent						101932	[]	[]
693	1150	Loge d’Audinot	Foire Saint-Germain						101870	[]	[]
694	1150	Loge d’Endric (Hendrick)	Foire Saint-Germain						309454	[]	[]
695	1150	Loge de Bertrand	Foire Saint-Germain						101859	[]	[]
696	1150	Loge de Bertrand	"Foire Saint-Laurent, préau"						101617	[]	[]
697	1150	Loge de Bertrand et Dolet	Foire Saint-Germain						101856	[]	[]
698	1150	Loge de Bertrand et Dolet	Foire Saint-Laurent						101926	[]	[]
699	1150	Loge de Bertrand et Selles	Foire Saint-Germain						101853	[]	[]
700	1150	Loge de Bertrand et Selles	Foire Saint-Laurent						101933	[]	[]
701	1150	Loge de Blampignon	Foire Saint-Germain						101620	[]	[]
702	1150	Loge de Francisque	Foire Saint-Germain						101876	[]	[]
703	1150	Loge de Francisque	Foire Saint-Laurent						101912	[]	[]
704	1150	Loge de Garnier	"Foire Saint-Germain, rue Chaudronnière"		1751-01-01	1751-12-31			310158	[]	[]
705	1150	Loge de John Riner (Risner)	Foire Saint-Germain (Jeu de Paume de la rue des Fossés Monsieur-le-Prince)		1726-02-01	1726-02-28			389917	[]	[]
706		Loge de Lalauze et associés	Foire Saint-Laurent		1721-01-01	1721-12-31	1721-01-01	1721-12-31	316565	[]	[]
707	1150	Loge de Nicolas Bienfait	Foire Saint-Germain						101877	[]	[]
708	1150	Loge de Nicolet	Foire Saint-Germain						101878	[]	[]
709	1150	Loge de Nicolet	Foire Saint-Laurent						101963	[]	[]
710	1150	Loge de Péclavé	Foire Saint-Laurent		1711-01-01	1711-12-31	1718-01-01	1718-12-31	101935	[]	[]
711	1150	Loge de Pellegrin	Foire Saint-Laurent						101915	[]	[]
712		Loge de Restier père	Foire Saint-Germain		1700-01-01	1709-12-31			316524	[]	[]
713	1150	Loge de Saint Edme	Foire Saint-Laurent						101937	[]	[]
714		Loge de Selles	préau de la Foire Saint-Germain		1700-01-01	1709-12-31			316507	[]	[]
715	1150	Loge de Selles et Lajoute	rue de la ruelle St-Laurent		1708-06-01	1708-06-30			310506	[]	[]
716		Loge de Sorin (Saurin) et Baxter	Foire Saint-Laurent						316562	[]	[]
717	1150	Loge du côté des Recollets	Foire Saint-Laurent						102224	[]	[]
718	1150	Loge du préau	Foire Saint-Germain						101879	[]	[]
719	1150	Loge du sieur Lagrelet	"rue Mercière, foire Saint-Germain"						310503	[]	[]
720	1286	Logis de la Grande Mademoiselle							320298	[]	[]
721	1150	Logis de M. le Grand							132857	[]	[]
722	1154	un théâtre							104914	[]	[]
723	1412	un théâtre							104917	[]	[]
724	1150	Lycée Dramatique (salle des Elèves de l’Opéra)	"boulevard du Temple, n° 46"		1791-05-12	1791-05-12	1792-06-24	1792-06-24	200602	[]	[]
725	1157	un théâtre							102064	[]	[]
726	1371	Magasin de la rue du Plomb	rue du Plomb						320351	[]	[]
727	1157	Maison Chaponay	place Bellecour		1691-01-01	1691-12-31			320271	[]	[]
728	1400	Maison consulaire							320291	[]	[]
729	1157	Maison d’éducation de M. Maintignieux							104934	[]	[]
730		Maison de Boisfranc à Saint-Ouen	Saint-Ouen		1600-01-01	1699-12-31			325281	[]	[]
731	1150	Maison de M. Lauverjon	au bas de la rue de Condé						308640	[]	[]
732	1413	Maison de récréation des Jésuites							101983	[]	[]
733	1175	Maison de ville							320229	[]	[]
734	1182	Maison de ville							320240	[]	[]
735	1306	Maison de ville							320282	[]	[]
736	1165	Maison de ville							320311	[]	[]
737	1340	Maison des Trois Dauphins							320258	[]	[]
738	1350	Maison du gouverneur							320284	[]	[]
739	1338	Maison du Président du tribunal des Grands jours							320254	[]	[]
740	1325	Maison du seigneur Puyrenaud							320214	[]	[]
741	1350	Maison du trésorier de Girard							320286	[]	[]
742	1346	Maison échevinale							320268	[]	[]
743	1150	Maison Egalité							200603	[]	[]
744	1150	Maison Ruggieri							200604	[]	[]
745	1414	une résidence particulière							102081	[]	[]
746	1247	Manège de l’Académie d’équitation							320241	[]	[]
747	1150	Manège de l’Hôtel de Langres	rue Saint-Antoine		1601-12-28	1601-12-28			325494	[]	[]
748	1224	un théâtre							104937	[]	[]
749	1150	Marais du Temple							132858	[]	[]
750	1415	une résidence particulière							104942	[]	[]
751	1416	une résidence particulière							104949	[]	[]
752	1305	un théâtre							104950	[]	[]
753	1349	en société							102107	[]	[]
754	1417	une résidence particulière							104952	[]	[]
755	1352	Monastère							132437	[]	[]
756	1268	une résidence particulière							104954	[]	[]
757	1314	société							104957	[]	[]
758	1306	un théâtre							102124	[]	[]
759	1236	Montgent							102128	[]	[]
760	1350	un théâtre							102131	[]	[]
761	1380	un théâtre							331688	[]	[]
762	1256	un théâtre							102136	[]	[]
763	1420	un théâtre							104964	[]	[]
764	1422	un théâtre							104966	[]	[]
765	1423	une résidence particulière							102143	[]	[]
766	1424	un théâtre							104970	[]	[]
767	1263	un théâtre							102148	[]	[]
768	1150	Opéra							102156	[]	[]
769	1150	Opéra (salle de la Porte Saint-Martin)			1781-10-27	1781-10-27			102161	[]	[]
770	1248	Opéra de Bordeaux	Cours Victor Hugo		1735-01-01	1735-12-31	1756-01-01	1756-12-31	338973	[]	[]
771	1346	Opéra de Lille			1787-01-01	1787-12-31	1903-01-01	1903-12-31	338995	[]	[]
772	1154	Opéra de Londres							102159	[]	[]
773	1271	Opéra de Marseille	rue Vacon		1733-01-01	1733-12-31	1787-01-01	1787-12-31	338955	[]	[]
774	1271	Opéra de Marseille (le premier)			1694-01-01	1694-12-31	1707-01-01	1707-12-31	338971	[]	[]
775	1352	Opéra de Nancy			1709-01-01	1709-12-31	1738-01-01	1738-12-31	338957	[]	[]
776	1227	Opéra de Nantes (Théâtre Graslin)			1788-03-23	1788-03-23	1796-01-01	1796-12-31	339005	[]	[]
777	1425	Opéra de Venise							102160	[]	[]
778	1178	Opéra du Quai au Foin			1682-02-01	1682-02-28	1697-01-01	1697-12-31	323775	[]	[]
779	1170	Palais d’Avignon							305315	[]	[]
780	1150	Palais de Luxembourg	sur un modèle de théâtre						132512	[]	[]
781		Palais de Saint Marc							178275	[]	[]
782	1150	Palais des Variétés							104981	[]	[]
783	1352	Palais ducal			1600-01-01	1609-12-31			320287	[]	[]
784	1150	Palais-Cardinal	(Palais-Royal)		1634-01-01	1634-12-31	1643-01-01	1643-12-31	132880	[]	[]
785	1150	Palais-Royal							340385	[]	[]
786	1150	Palais-Royal (cour)			1634-01-01	1634-12-31			132881	[]	[]
787	1426	un théâtre							104983	[]	[]
788	1150	Panthéon			1785-01-01	1785-12-31	1790-11-01	1790-11-01	102180	[]	[]
789	1283	Parc des Jeux							320216	[]	[]
790		"Parc du Palais ducal, Nancy"			1707-01-01	1707-12-31	1818-01-01	1818-12-31	307378	[]	[]
791	1274	une résidence particulière							102189	[]	[]
792	1150	pavillon de l’Échiquier	rue l’Échiquier						344600	[]	[]
793	1371	Pension des écoles chrétiennes							132485	[]	[]
794	1257	Petit jeu de paume							320273	[]	[]
795	1150	Petit préau	Foire Saint-Laurent						101910	[]	[]
796	1395	Petit Théâtre (Théâtre des Drapiers)			1733-01-01	1733-12-31			338956	[]	[]
797	1178	Petit Théâtre du Coffy	Grand’Place		1704-01-01	1704-12-31	1767-01-01	1767-12-31	352132	[]	[]
798	1150	Petit-Bourbon					1660-10-01	1660-10-31	132856	[]	[]
799	1241	Petit-Trianon							132451	[]	[]
800	1150	"Petite maison du comte de Clermont, rue de la Roquette"	rue de La Roquette						337196	[]	[]
801	1427	une résidence particulière							132452	[]	[]
802	1428	une résidence particulière							132453	[]	[]
803	1150	Place Royale	(Place des Vosges)						178272	[]	[]
804	1395	Poêle de la Tribu des Maçons							320331	[]	[]
805	1429	Poêle des tonneliers			1680-01-01	1680-12-31			320329	[]	[]
806	1357	un théâtre							132454	[]	[]
807	1150	Pont de l’Hôtel-Dieu							102201	[]	[]
808	1135	Port-Royal							320006	[]	[]
809	1430	un théâtre							132458	[]	[]
810	1431	en société							132459	[]	[]
811	1150	Pratique de Christophe							101816	[]	[]
812	1432	un théâtre							132460	[]	[]
813	1433	Prieuré de Beaumont-en-Auge			1600-01-01	1699-12-31	1794-01-01	1794-12-31	303470	[]	[]
814	1210	Prieuré du Breuil							132697	[]	[]
815	1150	Quai de la Ferraille							101801	[]	[]
816	1434	résidence particulière ou théâtre							329961	[]	[]
817	1435	une résidence particulière							132462	[]	[]
818	1436	une résidence particulière							102222	[]	[]
819	1150	Ranleigh							102223	[]	[]
820	1150	Rendez-vous des Champs-Élysées	place Louis XV		1790-01-01	1790-12-31			308678	[]	[]
821	1438	chez Poisson							102234	[]	[]
822	1440	un théâtre							132476	[]	[]
823		rue Cadet							337189	[]	[]
824	1150	Rue de la Bucherie	près le pont de l’Hôtel-Dieu						316591	[]	[]
825	1150	Rue Traversière	chez Voltaire						102317	[]	[]
826	1246	un théâtre							132690	[]	[]
827	1443	à la cour							102252	[]	[]
828	1444	Maison royale de Saint-Cyr			1686-08-02	1686-08-02			102254	[]	[]
829	1259	à la cour							102249	[]	[]
830	1445	une résidence particulière							132903	[]	[]
831	1446	une résidence particulière							102261	[]	[]
832	1447	Sainte-Foye	maison Sainte-Foye						309584	[]	[]
833	1395	Salle de comédie ou maison de l’Opéra (Comédie française)	Place Broglie		1701-01-01	1701-12-31	1800-01-01	1800-12-31	320334	[]	[]
834	1248	Salle de l’ancien Arsenal			1680-01-01	1680-12-31	1698-01-01	1698-12-31	320235	[]	[]
835	1248	Salle de l’archevêché							320234	[]	[]
836	1303	Salle de l’Hôtel de ville (Capitole)			1737-05-11	1737-05-11	1807-01-01	1807-12-31	132896	[]	[]
837	1448	Salle de l’hôtel du gouverneur de Bretagne							320346	[]	[]
838	1303	"Salle de l’Opéra (Salle du Concert, puis l’Athénée)"			1680-01-01	1689-12-31	1870-01-01	1879-12-31	327910	[]	[]
839	1346	Salle de la comédie	rue des Fossés		1702-01-01	1702-12-31			320355	[]	[]
840	1371	Salle de la Halle							320327	[]	[]
841	1322	Salle de spectacle (ancien local de l’élection)			1768-01-01	1768-12-31			333809	[]	[]
842	1325	Salle de spectacle d’Angoulême			1780-06-24	1780-06-24	1870-01-01	1879-12-31	333660	[]	[]
843	1325	Salle de spectacle d’Angoulême (ancienne)					1700-01-01	1799-12-31	333640	[]	[]
844	1449	salle de spectacle de Digoine	château de Digoine		1700-01-01	1799-12-31			343494	[]	[]
845	1150	"Salle de spectacles (Spectacle Marin ; Antoine Fouré ; Jean-Baptiste Nicolas)"	Boulevard du Temple						310081	[]	[]
846	1450	Salle de théâtre du château des comtes de Soissons							320230	[]	[]
847	1150	Salle des concerts	Tuileries						101760	[]	[]
848	1157	Salle des enfants de choeur à l’Archevêché							320272	[]	[]
849	1356	Salle des Halles							320304	[]	[]
850	1150	Salle des machines	Tuileries		1662-02-07	1662-02-07			102069	[]	[]
851	1150	Salle des rempart							177328	[]	[]
852	1157	Salle du Gouvernement (Hôtel du Gouvernement)					1700-01-01	1799-12-31	132695	[]	[]
853	1241	Salle du Manège	château de Versailles		1737-01-01	1737-12-31			343588	[]	[]
854	1150	Salle du sieur d’Ormetz	Boulevard du Temple						309358	[]	[]
855	1156	Salle du Tripot des barres							101776	[]	[]
856	1180	Salle Kerdannet	rue Ferrand				1780-01-01	1780-12-31	340333	[]	[]
857	1150	Salle Lebrun (Le Brun)	"96, rue de Cléry"						327244	[]	[]
858	1395	Salle provisoire sur le Marché aux chevaux							320333	[]	[]
859	1150	Salle rue de Bondy							309823	[]	[]
860	1303	Salle Saint-Martial (puis Théâtre de l’Egalité et de la Liberté)			1791-01-01	1791-12-31	1820-01-01	1829-12-31	327890	[]	[]
861	1150	Salon de Curtius	Boulevard du Temple						102266	[]	[]
862	1150	Salon de Mme Chevallier	Rue St Thomas du Louvre						101686	[]	[]
863	1451	une résidence particulière							132490	[]	[]
864	1153	Schönbrunn							132492	[]	[]
865	1452	un théâtre							132493	[]	[]
866	1191	Séminaire de Tyron							132900	[]	[]
867	1453	Séminaire des Chanoines réguliers de Saint-Vincent							104819	[]	[]
868	1150	Séminaire Saint-Charles							132902	[]	[]
869	1360	un théâtre							132495	[]	[]
870		Société de l’Amitié							102279	[]	[]
871	1150	Société de l’Amitié							104985	[]	[]
872	1150	Société du bout du banc							101644	[]	[]
873	1454	une résidence particulière							132497	[]	[]
874	1150	Spectacle militaire	boulevard du Temple		1767-01-01	1767-12-31			311191	[]	[]
875	1395	un théâtre							102290	[]	[]
876	1409	un théâtre							132509	[]	[]
877	1455	une résidence particulière							102291	[]	[]
878	1434	Taverne du Chien d’or			1791-01-01	1791-12-31			331681	[]	[]
879	1150	Temple							102292	[]	[]
880	1150	Temple (chez Louis-François de Conti)							354018	[]	[]
881	1410	Théâtre aux Porcherons							101533	[]	[]
882	1150	Théâtre Bienfaisance							200606	[]	[]
883	1456	Théâtre d’Abbeville							101536	[]	[]
884	1298	Théâtre d’Amiens							101544	[]	[]
885	1283	Théâtre d’Angers							101550	[]	[]
886	1283	Théâtre d’Angers			1738-01-01	1738-12-31			339007	[]	[]
887	1162	Théâtre d’Anvers							101552	[]	[]
888	1326	Théâtre d’Arras							101556	[]	[]
889	1494	Théâtre d’Auch			1761-01-01	1761-12-31			321213	[]	[]
890	1150	Théâtre d’Audinot	Boulevard du Temple		1769-07-09	1769-07-09	1786-01-01	1786-12-31	101570	[]	[]
891		Théâtre d’Augervilliers							303048	[]	[]
892	1150	Théâtre d’Avenet	rue Michel-le-Comte		1632-01-01	1632-12-31	1633-01-01	1633-12-31	174585	[]	[]
893	1150	Théâtre d’Emulation (salle du Théâtre Doyen)	rue Notre-Dame de Nasareth		1791-05-29	1791-05-29	1791-07-23	1791-07-23	327071	[]	[]
894	1150	Théâtre d’Emulation (salle Louvois)			1798-04-17	1798-04-17	1798-12-31	1798-12-31	101785	[]	[]
895	1150	Théâtre d’Octave I	Foire Saint-Germain						101841	[]	[]
896	1150	Théâtre d’Octave II	Foire Saint-Germain						101842	[]	[]
897	1286	Théâtre d’Orléans							102166	[]	[]
898	1150	Théâtre dans la rue Blanche	"Rue Blanche, sur l’emplacement des nos. 22-28"						101621	[]	[]
899	1260	Théâtre de Bagnolet	chez le duc d’Orléans						101591	[]	[]
900	1404	Théâtre de Bayonne							101595	[]	[]
901	1331	Théâtre de Besançon							101618	[]	[]
902	1331	Théâtre de Besançon (nouveau)			1786-01-01	1786-12-31			339019	[]	[]
903	1248	Théâtre de Bordeaux							101627	[]	[]
904	1457	Théâtre de Brest			1766-12-07	1766-12-07			101651	[]	[]
905	1179	Théâtre de Caen (Théâtre national de Caen)			1760-01-01	1769-12-31	1800-01-01	1899-12-31	104679	[]	[]
906		Théâtre de campagne du comte de Clermont							101711	[]	[]
907	1247	Théâtre de Carcassonne							132529	[]	[]
908	1388	Théâtre de Carrouge							104688	[]	[]
909	1151	Théâtre de Cassel							132530	[]	[]
910	1458	Théâtre de Champrosay							101668	[]	[]
911		Théâtre de Chantemesle	chez Mme de Villemure						101669	[]	[]
912	1459	Théâtre de Coblence							310618	[]	[]
913	1211	Théâtre de Compiègne							101755	[]	[]
914	1156	Théâtre de Dijon							101775	[]	[]
915	1150	Théâtre de Dominique	Foire Saint-Laurent				1716-09-01	1716-09-30	101777	[]	[]
916	1216	Théâtre de Fontainebleau	rue de Nemours		1766-01-01	1766-12-31			132534	[]	[]
917	1460	Théâtre de Gand							101977	[]	[]
918	1284	Théâtre de Grenoble							101991	[]	[]
919	1461	Théâtre de Grillon							101992	[]	[]
920		Théâtre de Grimarest							101993	[]	[]
921	1462	Théâtre de Hambourg							342903	[]	[]
922	1150	Théâtre de Jean-Jacques Rousseau							200607	[]	[]
923	1150	Théâtre de l’Ambigu-Comique	Boulevard du Temple		1769-07-09	1769-07-09	1827-07-13	1827-07-13	101537	[]	[]
924	1157	Théâtre de l’Ambigu-Comique							104632	[]	[]
925	1150	Théâtre de l’Estrapade							101788	[]	[]
926	1150	Théâtre de l’Estrapade à Pantheon							200608	[]	[]
927	1336	Théâtre de l’Etape			1771-01-01	1771-12-31	1971-01-01	1971-12-31	104692	[]	[]
928	1258	Théâtre de l’Hermitage							132502	[]	[]
929	1150	Théâtre de l’Hôtel de Bourgogne	Rue Mauconseil		1548-08-30	1548-08-30	1783-04-05	1783-04-05	101999	[]	[]
930	1150	Théâtre de l’Hôtel Guénégaud	Rue Mazarine		1671-01-01	1671-12-31	1689-01-01	1689-12-31	102013	[]	[]
931		Théâtre de l’Isle-Adam (chez les Conti)	chez le prince Conti						102014	[]	[]
932	1150	Théâtre de l’Odéon			1782-04-09	1782-04-09			101830	[]	[]
933	1150	Théâtre de l’Opéra-Comique	Foire Saint-Germain						101813	[]	[]
934	1150	Théâtre de l’Opéra-Comique	Foire Saint-Laurent						101914	[]	[]
935	1160	Théâtre de l’Overtoomsche Weg							104638	[]	[]
936	1150	Théâtre de la Cité	Rue de la Barillerie		1792-10-20	1792-10-20			200609	[]	[]
937	1150	Théâtre de la Concorde							101761	[]	[]
938	1373	Théâtre de la Cour							104840	[]	[]
939	1258	Théâtre de la cour							132503	[]	[]
940	1150	Théâtre de la Croix-Blanche			1650-01-01	1650-12-31	1650-01-01	1650-12-31	174586	[]	[]
941	1150	Théâtre de la Gaîté	Boulevard du Temple						101637	[]	[]
942	1150	Théâtre de la Gaîté							101973	[]	[]
943	1241	Théâtre de la Grande Ecurie							102379	[]	[]
944	1150	Théâtre de la Liberté							200610	[]	[]
945	1150	Théâtre de la liberté et de l’égalité							102044	[]	[]
946	1150	Théâtre de la Montagne							200611	[]	[]
947	1178	Théâtre de la Montagne Sainte-Elisabeth			1652-01-01	1652-12-31	1697-01-01	1697-12-31	344528	[]	[]
948	1274	Théâtre de la Muette							132544	[]	[]
949	1150	Théâtre de la Nation (Française)							200612	[]	[]
950	1282	Théâtre de la petite maison	chez le duc de Grammont						101716	[]	[]
951	1403	Théâtre de la place des Jacobins			1776-05-28	1776-05-28	1842-01-01	1842-12-31	104907	[]	[]
952	1248	Théâtre de la Porte Dauphine							375963	[]	[]
953	1296	Théâtre de la Porte Madeleine			1777-01-01	1777-12-31	1860-01-01	1860-12-31	132633	[]	[]
954	1241	Théâtre de la Reine au Trianon			1780-06-01	1780-06-01			343098	[]	[]
955	1150	Théâtre de la République							102229	[]	[]
956	1317	Théâtre de la République (Théâtre du Vieux-Marché)							319872	[]	[]
957	1150	Théâtre de la République des Arts							200613	[]	[]
958	1366	Théâtre de La Rochelle							102035	[]	[]
959	1317	Théâtre de la Rougemare	"maison de Saint-Louis, place de la Rougemare"		1796-01-01	1796-12-31			319852	[]	[]
960	1150	Théâtre de la rue de Boissy	"Foire Saint-Germain, rue de Boissy"						101626	[]	[]
961	1150	Théâtre de la rue de Louvois	rue de Louvois		1791-08-16	1791-08-16	1794-01-01	1794-12-31	102059	[]	[]
962	1150	Théâtre de la rue des Fossés Saint-Germain			1689-04-18	1689-04-18	1770-03-31	1770-03-31	101831	[]	[]
963	1150	Théâtre de la rue des Martyres							102246	[]	[]
964	1150	Théâtre de la rue du Four							101837	[]	[]
965	1317	Théâtre de la rue Eau-de-Robec	rue Eau-de-Robec		1775-01-01	1775-12-31			319788	[]	[]
966	1150	Théâtre de la rue Martin							200614	[]	[]
967	1317	Théâtre de la rue Poisson	"couvent de Saint-Joseph, rue Poisson"		1799-11-01	1799-11-30			319874	[]	[]
968	1150	Théâtre de la rue Popincourt							102203	[]	[]
969	1271	Théâtre de la rue Saint-Ferréol	rue Saint-Ferréol		1695-01-01	1695-12-31	1733-01-01	1733-12-31	320279	[]	[]
970	1463	Théâtre de la Savonnerie							101667	[]	[]
971	1150	Théâtre de la Société Libre des amis des Belles-Lettres							370227	[]	[]
972	1274	Théâtre de la station thermale							102191	[]	[]
973	1150	Théâtre de la veuve Maurice	faubourg St-Germain						311076	[]	[]
974	1241	Théâtre de la ville							102391	[]	[]
975	1150	Théâtre de Lécluze			1778-08-17	1778-08-17	1779-04-12	1779-04-12	315975	[]	[]
976	1346	Théâtre de Lille							102046	[]	[]
977	1180	Théâtre de Lorient			1780-01-01	1780-12-31			132551	[]	[]
978	1150	Théâtre de lycée au Palais Egalité							200615	[]	[]
979	1150	Théâtre de M. d’Auvillier	Bois de Boulogne et Hôtel du Ranelagh						101582	[]	[]
980	1464	Théâtre de Maestricht							102071	[]	[]
981	1241	Théâtre de Manège							102084	[]	[]
982	1150	Théâtre de Marché	Foire Saint-Germain						102089	[]	[]
983	1150	Théâtre de Mareux							102090	[]	[]
984	1150	Théâtre de Marionnettes	Foire Saint-Germain						101897	[]	[]
985	1271	Théâtre de Marseille							102095	[]	[]
986	1349	Théâtre de Metz			1752-02-01	1752-02-28			102108	[]	[]
987	1150	Théâtre de Monnet (Opéra-Comique à la Foire Saint-Laurent)			1752-01-01	1752-12-31			346867	[]	[]
988	1150	Théâtre de Monsieur			1789-01-26	1789-01-26	1791-01-06	1791-01-06	102114	[]	[]
989	1150	Théâtre de Montansier			1790-04-12	1790-04-12			102122	[]	[]
990	1306	Théâtre de Montauban							436264	[]	[]
991	1350	Théâtre de Montpellier			1755-01-01	1755-12-31			339025	[]	[]
992	1352	Théâtre de Nancy (Le Pavillon de la Comédie)	place Royale (ensuite place de Stanislas)		1755-11-26	1755-11-26	1906-01-01	1906-12-31	102138	[]	[]
993	1227	Théâtre de Nantes							102142	[]	[]
994	1150	Théâtre de Nicolet	Boulevard du Temple		1759-01-01	1759-12-31	1772-01-01	1772-12-31	102147	[]	[]
995	1263	Théâtre de Nîmes							132571	[]	[]
996	1150	Théâtre de Nivelon	"Foire Saint-Germain, rue de Tournon"						101851	[]	[]
997		Théâtre de Pantin							102133	[]	[]
998		Théâtre de Pierre Routier	boulevard Montparnasse		1770-01-01	1779-12-31			316301	[]	[]
999	1316	Théâtre de Reims							102225	[]	[]
1000	1358	Théâtre de Rennes							102228	[]	[]
1001	1150	Théâtre de Restier et Lavigne	Foire Saint-Germain						101903	[]	[]
1002	1317	Théâtre de Rouen	rue de Charrettes						102240	[]	[]
1003	1465	Théâtre de Saint-Quentin							102260	[]	[]
1004	1295	Théâtre de Saumur	24 rue de la Comédie		1788-09-27	1788-09-27	1863-01-01	1863-12-31	102270	[]	[]
1005	1150	Théâtre de société de Momus	à la Nouvelle France						132580	[]	[]
1006	1157	Théâtre de Soufflot	dans le jardin derrière l’Hôtel de Ville		1756-08-30	1756-08-30	1827-01-01	1827-12-31	132553	[]	[]
1007		Théâtre de Spa							102284	[]	[]
1008	1150	Théâtre de Tabarin	Place Dauphine		1618-01-01	1618-12-31	1623-01-01	1623-12-31	326320	[]	[]
1009	1272	Théâtre de Toulon	rue de la Comédie ( rue Denfert Rochereau)		1765-01-01	1765-12-31			102312	[]	[]
1010	1303	Théâtre de Toulouse							102314	[]	[]
1011	1362	Théâtre de Tours							102316	[]	[]
1012	1241	Théâtre de Trianon							102319	[]	[]
1013	1466	Théâtre de Varsovie							132584	[]	[]
1014	1150	Théâtre des amis de la patrie	"Rue de Louvois, 6"						101545	[]	[]
1015	1150	Théâtre des Amis des arts	"11, rue de la Couture Sainte-Catherine [rue de Sévigné]"		1793-01-01	1793-12-31			174588	[]	[]
1016	1150	Théâtre des Amis des arts et des Elèves de l’Opéra-Comique	Rue Saint-Martin		1798-01-01	1798-12-31	1800-01-01	1800-12-31	174589	[]	[]
1017	1150	Théâtre des Amusements-Comiques	Boulevard du Temple		1787-01-01	1787-12-31	1790-01-01	1790-12-31	101546	[]	[]
1018	1150	Théâtre des Arts	Rue Richelieu		1796-01-01	1796-12-31			101558	[]	[]
1019	1150	Théâtre des Associés	Boulevard du Temple		1774-01-01	1774-12-31	1787-01-01	1787-12-31	101561	[]	[]
1020	1150	Théâtre des Beaujolais	Palais-Royal		1784-10-23	1784-10-23	1790-02-22	1790-02-22	101596	[]	[]
1021	1150	Théâtre des Bluettes comiques et lyriques	boulevard du Temple		1780-01-01	1789-12-31	1789-01-01	1789-12-31	101622	[]	[]
1022	1150	Théâtre des Danseurs de Corde							101814	[]	[]
1023	1150	Théâtre des Délassements Comiques	boulevard du Temple		1785-01-01	1785-12-31			101769	[]	[]
1024		Théâtre des élèves de Thalie	boulevard du Temple		1792-01-22	1792-01-22	1792-03-01	1792-03-31	327148	[]	[]
1025	1150	Théâtre des Elèves Dramatiques							200617	[]	[]
1026	1150	Théâtre des Elèves pour la danse de l’Opéra	Boulevard du Temple		1779-01-07	1779-01-07	1780-09-04	1780-09-04	101783	[]	[]
1027	1150	Théâtre des Enfants Comiques	boulevard du Temple						200618	[]	[]
1028	1150	Théâtre des Fantocchini	Boulevard du Temple		1773-01-01	1773-12-31	1784-01-01	1784-12-31	101795	[]	[]
1029	1150	Théâtre des Grands Danseurs (Gaité)			1792-09-22	1792-09-22			200619	[]	[]
1030	1150	Théâtre des Grands Danseurs de Corde	Foire Saint-Laurent						104873	[]	[]
1031	1150	Théâtre des Grands-Amours							132598	[]	[]
1032	1377	Théâtre des Grands-Danseurs							132600	[]	[]
1033	1150	Théâtre des Grands-Danseurs du roi			1772-04-23	1772-04-23	1792-09-22	1792-09-22	101984	[]	[]
1034	1150	Théâtre des Grands-Danseurs du roi à la foire							310082	[]	[]
1035	1150	Théâtre des Jeunes Artistes							102024	[]	[]
1036	1150	Théâtre des Jeunes Elèves							200620	[]	[]
1037	1150	Théâtre des menus plaisirs	faubourg Poissonnière						102103	[]	[]
1038	1150	Théâtre des Ombres chinoises	Boulevard du Temple						102155	[]	[]
1039	1150	Théâtre des Ombres chinoises de Séraphin	Palais-Royal		1774-09-01	1774-09-30			102154	[]	[]
1040		Théâtre des Ombres chinoises de Séraphin	Foire Saint-Laurent		1774-07-01	1774-07-31	1774-08-01	1774-08-31	316527	[]	[]
1041	1150	Théâtre des Ombres de Jean-Jacques Rousseau							200621	[]	[]
1042	1241	Théâtre des Petits Cabinets	palais de Versailles		1747-01-17	1747-01-17	1748-03-30	1748-03-30	323712	[]	[]
1043	1150	Théâtre des petits comédiens du Bois de Boulogne			1777-01-01	1777-12-31	1781-01-01	1781-12-31	101625	[]	[]
1044	1150	Théâtre des petits comédiens du Marais	"rue Saintonge, boulevard du Temple"		1749-01-01	1749-12-31			101886	[]	[]
1045	1150	"Théâtre des Petits Comédiens du Palais Royal (Théâtre des enfants du sieur Moreau, Théâtre du Palais-Royal)"	"Palais-Royal, sous les galeries n° 101"		1791-02-28	1791-02-28			200605	[]	[]
1046	1241	Théâtre des Petits-Appartements	Palais de Versailles		1748-11-27	1748-11-27	1750-04-01	1750-04-30	101553	[]	[]
1047	1150	Théâtre des Pygmées français	Palais-Royal		1785-01-01	1785-12-31			102214	[]	[]
1048	1150	Théâtre des Sans-Culottes							102268	[]	[]
1049	1150	Théâtre des Troubadours			1799-05-04	1799-05-04			200622	[]	[]
1050	1248	Théâtre des Variétés							132614	[]	[]
1051	1150	Théâtre des Variétés	Palais-Royal		1785-01-01	1785-01-01	1791-01-01	1791-12-31	102346	[]	[]
1052	1150	"Théâtre des variétés (Variétés dramatiques, salle des Elèves de l’Opéra)"	"boulevard du Temple, n° 46"		1792-01-05	1792-01-05	1792-04-15	1792-04-15	327076	[]	[]
1053	1150	Théâtre des Variétés-Amusantes	Foire Saint-Laurent		1779-01-01	1779-12-31			101965	[]	[]
1054	1150	Théâtre des Variétés-Amusantes	au coin des rues de Lancry et de Bondy		1779-07-15	1779-07-15			102341	[]	[]
1055	1150	Théâtre des Victoires							200623	[]	[]
1056	1150	Théâtre des Victoires							200624	[]	[]
1057	1150	Théâtre des vrais Fantoccini italiens	Palais-Royal		1700-01-01	1799-12-31			309042	[]	[]
1058		Théâtre Doyen							101778	[]	[]
1059	1231	Théâtre du Cavalierhaus							132615	[]	[]
1060	1467	Théâtre du château d’Asnières							101559	[]	[]
1061	1150	Théâtre du cirque national au Palais-Royal			1791-10-22	1791-10-22	1792-01-16	1792-01-16	200598	[]	[]
1062	1256	Théâtre du comte Cheremetev	rue Nikolskaia		1779-01-11	1779-01-11			361535	[]	[]
1063	1150	Théâtre du Conservatoire	Rue du Conservatoire		1784-01-01	1784-12-31			368080	[]	[]
1064	1150	Théâtre du faubourg Saint-Germain	Foire Saint-Germain						101899	[]	[]
1065		Théâtre du Faubourg Saint-Martin							337190	[]	[]
1066	1150	Théâtre du Lycée des Arts							200616	[]	[]
1067	1403	Théâtre du Mans							102040	[]	[]
1068	1150	Théâtre du Marais (ancien)	Rue Vieille-du-Temple		1644-10-01	1644-10-31	1673-01-01	1673-12-31	318338	[]	[]
1069	1150	Théâtre du Marais (nouveau)	"rue Culture Sainte-Catherine, quartier Saint-Antoine"		1791-08-31	1791-08-31	1807-01-01	1807-12-31	102085	[]	[]
1070	1321	Théâtre du marquis de Barben	sur l’emplacement d’un ancien jeu de paume		1758-01-01	1758-01-01			104625	[]	[]
1071	1150	Théâtre du Mont-Parnasse			1791-07-10	1791-07-10			102120	[]	[]
1072	1150	Théâtre du nouveau spectacle pantomime	Foire Saint-Germain		1746-01-01	1746-12-31	1749-01-01	1749-12-31	310551	[]	[]
1073	1150	Théâtre du nouveau spectacle pantomime	Foire Saint-Laurent		1746-01-01	1746-12-31	1749-01-01	1749-12-31	101964	[]	[]
1074	1150	Théâtre du Palais-Royal			1789-01-01	1789-01-01			101664	[]	[]
1075	1178	Théâtre du Parc	Parc Royal		1782-01-01	1782-12-31			337589	[]	[]
1076		Théâtre du sieur Gaudon							101978	[]	[]
1077	1150	Théâtre du Temple							132450	[]	[]
1078	1150	Théâtre du Vaudeville	rue de Chartres		1792-01-12	1792-01-12			102354	[]	[]
1079	1150	Théâtre Feydeau			1791-01-06	1791-01-06			101802	[]	[]
1080	1150	Théâtre français comique et lyrique	au coin des rues de Bondy et de Lancry		1790-06-26	1790-06-26	1793-01-01	1793-12-31	101838	[]	[]
1081	1150	Théâtre français de la rue de Richelieu			1791-04-27	1791-04-27			102233	[]	[]
1082	1154	Théâtre français de Londres							132619	[]	[]
1083	1258	Théâtre français de St Petersbourg							132620	[]	[]
1084	1150	Théâtre Italien (salle Favart)	entre les rues Favart et Marivaux		1783-04-28	1783-04-28			200627	[]	[]
1085	1258	Théâtre Kamenni			1783-01-01	1783-12-31			362210	[]	[]
1086	1468	"Théâtre Maccarini (Théâtre Royal, Théâtre de la Montagne)"			1777-01-01	1777-12-31	1826-01-01	1826-12-31	338978	[]	[]
1087	1150	Théâtre Molière	rue Saint-Martin		1791-06-11	1791-06-11			102111	[]	[]
1088	1256	Théâtre na Znamenke (Znamenski)	"rue Znamenka, chez le comte R. I. Vorontzov"		1770-01-01	1779-12-31	1780-01-01	1780-12-31	362211	[]	[]
1089	1150	Théâtre National (Richelieu)							200628	[]	[]
1090	1150	Théâtre Olympique	Rue Chantereine		1801-01-01	1801-12-31	1807-01-01	1807-12-31	368078	[]	[]
1091	1150	Théâtre Patriotique							102193	[]	[]
1092	1256	Théâtre Petrovski							353225	[]	[]
1093		Théâtre près du camp de St-Omer			1780-01-01	1789-12-31			342200	[]	[]
1094	1150	Théâtre rue Antoine							200629	[]	[]
1095	1150	Théâtre Sans Prétention			1790-01-01	1790-12-31			102267	[]	[]
1096	1248	"Théâtre-Mayeur, ou de la Montagne, ou des Sans-Culottes"			1793-12-01	1793-12-31			338690	[]	[]
1097	1150	Tivoli							200630	[]	[]
1098	1308	un théâtre							132627	[]	[]
1099	1362	une résidence particulière							132907	[]	[]
1100	1257	Tripot Saint-Antoine							320274	[]	[]
1101	1258	Tsarkoé Sélo							132504	[]	[]
1102	1150	Tuileries			1662-01-01	1662-12-31			132906	[]	[]
1103	1469	un théâtre							132636	[]	[]
1104	1377	un théâtre							132638	[]	[]
1105	1470	un théâtre							132640	[]	[]
1106	1269	un théâtre							102332	[]	[]
1107	1269	en société							102333	[]	[]
1108	1471	un théâtre							102335	[]	[]
1109	1472	une résidence particulière							102336	[]	[]
1110	1150	"Variétes Amusantes, Comiques et Lyriques"							200631	[]	[]
1111	1153	Variétés-Amusantes							132665	[]	[]
1112	1466	à la cour							132654	[]	[]
1113	1473	une résidence particulière							102356	[]	[]
1114	1474	une résidence particulière							132913	[]	[]
1115	1150	Vaux-hall de Torré	boulevard Saint-Martin		1764-01-01	1764-12-31			101635	[]	[]
1116	1150	Vauxhall d’été	au bout de la rue de Bondy ( boulevard Saint-Martin)		1785-07-07	1785-07-07			102361	[]	[]
1117	1150	Vauxhall d’hiver	Foire Saint-Germain		1768-01-01	1768-12-31	1785-01-01	1785-12-31	101905	[]	[]
1118	1179	Vauxhall de Caen			1700-01-01	1799-12-31			342503	[]	[]
1119	1425	"Venise, carnaval"							102362	[]	[]
1120	1150	Viellée de Thalie							200632	[]	[]
1121	1153	une résidence particulière							102390	[]	[]
1122	1475	un théâtre							132672	[]	[]
1123	1302	en société							132676	[]	[]
1124	1476	un théâtre							132679	[]	[]
1125	1477	un théâtre							132680	[]	[]
1126	1150	une résidence particulière							102074	[]	[]
1127		France							436265	[]	[]
1128		Allemagne							436267	[]	[]
1129		Lorraine							436268	[]	[]
1130		Autriche							436269	[]	[]
1131		Pays-Bas							436271	[]	[]
1132		Espagne							436272	[]	[]
1133		Russie							436273	[]	[]
1134		Danemark							436275	[]	[]
1135		Canada							436276	[]	[]
1136		États-Unis							436277	[]	[]
1137		Italie							436278	[]	[]
1138		Suisse							436279	[]	[]
1139		Angleterre							436280	[]	[]
1140		Pologne							436281	[]	[]
1141		Belgique							436282	[]	[]
1142		Pays-Bays							436283	[]	[]
1143	1128	Prusse							436284	[]	[]
1144		Grèce							436285	[]	[]
1145		Bohème							436287	[]	[]
1146		Suède							436288	[]	[]
1147		Irlande							436289	[]	[]
1148		Écosse							436290	[]	[]
1149	1128	Berlin							436293	[]	[]
1150	1127	Paris							436294	[]	[]
1151	1128	Cassel							436295	[]	[]
1152	1129	Lunéville							436296	[]	[]
1153	1130	Vienne							436297	[]	[]
1154	1139	Londres							436298	[]	[]
1155	1127	Alençon							436299	[]	[]
1156	1127	Dijon							436300	[]	[]
1157	1127	Lyon							436301	[]	[]
1158		Aix-la-Chapelle							436302	[]	[]
1159		Alise-Sainte-Reine							436303	[]	[]
1160	1131	Amsterdam							436304	[]	[]
1161	1381	Anspach							436305	[]	[]
1162	1131	Anvers							436306	[]	[]
1163		Argenteuil							436307	[]	[]
1164		Arles							436308	[]	[]
1165	1127	Perpignan							436309	[]	[]
1166	1127	Aubert-Villiers							436310	[]	[]
1167	1127	Gers							436311	[]	[]
1168	1127	Bourbon-l’Archambault							436312	[]	[]
1169	1533	Auteuil							436313	[]	[]
1170	1127	Avignon							436314	[]	[]
1171	1127	Bagatelle							436315	[]	[]
1172	1127	Bagnères-de-Bigorre							436316	[]	[]
1173	1127	Bagneux							436317	[]	[]
1174	1128	Bayreuth							436318	[]	[]
1175	1127	Blois							436319	[]	[]
1176	1127	Bourges							436320	[]	[]
1177		Breuilport							436321	[]	[]
1178	1131	Bruxelles							436322	[]	[]
1179	1127	Caen							436323	[]	[]
1180	1127	Lorient							436324	[]	[]
1181		Calais							436325	[]	[]
1182	1127	Cambrai							436326	[]	[]
1183		Chalon-sur-Saône							436327	[]	[]
1184	1127	Chambéry							436328	[]	[]
1185		Chambord							436329	[]	[]
1186		Chanteloup							436330	[]	[]
1187	1127	Chantilly							436331	[]	[]
1188	1127	Charleville							436332	[]	[]
1189	1128	Charlottenburg							436333	[]	[]
1190	1127	Charonne							436334	[]	[]
1191	1127	Chartres							436335	[]	[]
1192	1127	Anet							436336	[]	[]
1193	1127	Arcueil							436337	[]	[]
1194		Argenton							436338	[]	[]
1195	1127	Étiolles							436339	[]	[]
1196	1127	Eu							436340	[]	[]
1197		Bel Oeil							436341	[]	[]
1198	1127	Belebat							436342	[]	[]
1199	1127	Bellevue							436343	[]	[]
1200	1127	Bercy							436344	[]	[]
1201	1127	Berny							436345	[]	[]
1202		Bidache							436346	[]	[]
1203		Boussy-Saint-Antoine							436347	[]	[]
1204	1127	Brunoy							436348	[]	[]
1205	1628	Castelnau d’Estretefond							436349	[]	[]
1206		Chamblay							436350	[]	[]
1207	1127	Châtenay							436351	[]	[]
1208	1127	Choisy							436352	[]	[]
1209	1620	Cirey-sur-Blaise							436353	[]	[]
1210		Commercy							436354	[]	[]
1211	1127	Compiègne							436355	[]	[]
1212	1127	Comteney							436356	[]	[]
1213	1127	Charenton							436357	[]	[]
1214	1127	Courtenay							436358	[]	[]
1215		Dreux							436359	[]	[]
1216	1127	Fontainebleau							436360	[]	[]
1217	1128	Friedrichfelds							436361	[]	[]
1218	1127	L’Aigle							436362	[]	[]
1219		La Chevrette							436363	[]	[]
1220	1127	Pezenas							436364	[]	[]
1221	1127	Le Raincy							436365	[]	[]
1222	1127	Livry							436366	[]	[]
1223		Lussany							436367	[]	[]
1224	1128	Mannheim							436368	[]	[]
1225	1127	Marly							436369	[]	[]
1226		Monceau							436370	[]	[]
1227	1127	Nantes							436371	[]	[]
1228	1127	Nérac							436372	[]	[]
1229		Neufbourg							436373	[]	[]
1230		Pierre							436374	[]	[]
1231	1128	Rheinsberg							436375	[]	[]
1232		Saint-Hubert							436376	[]	[]
1233		Saint-Lô							436377	[]	[]
1234	1127	Saint-Maur							436378	[]	[]
1235	1127	Saint-Ouen							436379	[]	[]
1236	1127	Sceaux							436380	[]	[]
1237	1127	Séverac-le-Château							436381	[]	[]
1238		Soindre							436382	[]	[]
1239	1127	Sully							436383	[]	[]
1240	1127	Vaujours							436384	[]	[]
1241	1127	Versailles							436385	[]	[]
1242	1127	Villers-Cotterêts							436386	[]	[]
1243	1127	Vincennes							436387	[]	[]
1244	1128	Weissenstein							436388	[]	[]
1245	1127	Cadillac							436389	[]	[]
1246	1127	Rueil							436390	[]	[]
1247	1127	Carcassonne							436391	[]	[]
1248	1127	Bordeaux							436392	[]	[]
1249		Chatillon							436393	[]	[]
1250		Chenonceaux							436394	[]	[]
1251	1127	Cheverny							436395	[]	[]
1252	1127	Choisy-le-Roi							436396	[]	[]
1253		Poitou							436397	[]	[]
1254	1127	Chilly							436398	[]	[]
1255	1127	Franche-Comté							436399	[]	[]
1256	1133	Moscou							436400	[]	[]
1257	1127	Mâcon							436401	[]	[]
1258	1133	Saint-Petersbourg							436402	[]	[]
1259	1127	Saint-Germain-en-Laye							436403	[]	[]
1260	1127	Bagnolet							436404	[]	[]
1261	1127	Puteaux							436405	[]	[]
1262		Madrid							436406	[]	[]
1263	1127	Nîmes							436407	[]	[]
1264	1264	Luxembourg							436408	[]	[]
1265		Hénin							436409	[]	[]
1266	1127	Roissy							436410	[]	[]
1267		Saint-Denis							436411	[]	[]
1268		Mons							436412	[]	[]
1269	1127	Valenciennes							436413	[]	[]
1270	1127	Saint-NIcolas-de-Port							436414	[]	[]
1271	1127	Marseille							436415	[]	[]
1272	1127	Toulon							436416	[]	[]
1273		Issy							436417	[]	[]
1274	1127	Passy							436418	[]	[]
1275		Essonnes							436419	[]	[]
1276	1127	Riom							436420	[]	[]
1277	1127	Vaugirard							436421	[]	[]
1278	1127	Fontenay-sous-Bois							436422	[]	[]
1279		Chignin							436423	[]	[]
1280	1127	Clagny-les-Versailles							436424	[]	[]
1281		Clermont							436425	[]	[]
1282	1127	Clichy							436426	[]	[]
1283	1127	Angers							436427	[]	[]
1284	1127	Grenoble							436428	[]	[]
1285	1127	Évreux							436429	[]	[]
1286	1127	Orléans							436430	[]	[]
1287		Bayeux							436431	[]	[]
1288		Beauvais							436432	[]	[]
1289		Aix							436433	[]	[]
1290		Chabeuil							436434	[]	[]
1291	1127	Beaune							436435	[]	[]
1292		Boulogne-sur-Mer							436436	[]	[]
1293		Juilly							436437	[]	[]
1294		Montbrisson							436438	[]	[]
1295	1127	Saumur							436439	[]	[]
1296	1127	Troyes							436440	[]	[]
1297		Soissons							436441	[]	[]
1298	1127	Amiens							436442	[]	[]
1299		Avallon							436443	[]	[]
1300		Noyon							436444	[]	[]
1301		Treignac							436445	[]	[]
1302		Vitry							436446	[]	[]
1303	1127	Toulouse							436447	[]	[]
1304		Béthune							436448	[]	[]
1305	1621	Meaux							436449	[]	[]
1306	1127	Montauban							436450	[]	[]
1307		Saint-Maixent							436451	[]	[]
1308		Tournay							436452	[]	[]
1309		Soignies							436453	[]	[]
1310	1127	Thouars							436454	[]	[]
1311	1127	Valognes							436455	[]	[]
1312	1127	Vernon							436456	[]	[]
1313		Annecy							436457	[]	[]
1314	1127	Montargis							436458	[]	[]
1315		Thonon							436459	[]	[]
1316	1127	Reims							436460	[]	[]
1317	1127	Rouen							436461	[]	[]
1318	1127	Nanterre							436462	[]	[]
1319		Avranches							436463	[]	[]
1320	1131	Liège							436464	[]	[]
1321	1127	Aix-en-Provence							436465	[]	[]
1322	1127	Agen							436466	[]	[]
1323		Aire-sur-la-Lys							436467	[]	[]
1324		Albi							436468	[]	[]
1325	1127	Angoulême							436469	[]	[]
1326	1127	Arras							436470	[]	[]
1327		Autun							436471	[]	[]
1328	1127	Auxerre							436472	[]	[]
1329		Bar-le-Duc							436473	[]	[]
1330		Bergues							436474	[]	[]
1331	1127	Besançon							436475	[]	[]
1332		Bourg-en-Bresse							436476	[]	[]
1333		Cahors							436477	[]	[]
1334		Carpentras							436478	[]	[]
1335		Castres							436479	[]	[]
1336		Châlons-sur-Marne							436480	[]	[]
1337		Chaumont							436481	[]	[]
1338	1127	Clermont-Ferrand							436482	[]	[]
1339		Dole							436483	[]	[]
1340	1127	Douai							436484	[]	[]
1341		Dunkerque							436485	[]	[]
1342	1127	Fontenay-le-Comte							436486	[]	[]
1343		Hesdin							436487	[]	[]
1344		Langres							436489	[]	[]
1345		Le Puy							436490	[]	[]
1346	1127	Lille							436491	[]	[]
1347		Mauriac							436492	[]	[]
1348		Mende							436493	[]	[]
1349	1127	Metz							436494	[]	[]
1350	1127	Montpellier							436495	[]	[]
1351		Moulins							436496	[]	[]
1352	1127	Nancy							436497	[]	[]
1353	1127	Nevers							436498	[]	[]
1354		Nivelles							436499	[]	[]
1355		Pamiers							436500	[]	[]
1356	1127	Pau							436501	[]	[]
1357	1127	Poitiers							436502	[]	[]
1358	1127	Rennes							436503	[]	[]
1359		Rodez							436504	[]	[]
1360		Sens							436505	[]	[]
1361		Tournon							436506	[]	[]
1362	1127	Tours							436507	[]	[]
1363		Tulle							436508	[]	[]
1364		Vannes							436509	[]	[]
1365		Verdun							436510	[]	[]
1366	1127	La Rochelle							436511	[]	[]
1367		Pont-à-Mousson							436512	[]	[]
1368	1127	Niort							436513	[]	[]
1369		Castelnaudary							436514	[]	[]
1370	1127	Lisieux							436515	[]	[]
1371	1127	Saint-Omer							436516	[]	[]
1372	1131	La Haye							436517	[]	[]
1373	1134	Copenhague							436518	[]	[]
1374	1127	Cormeil-en-Parisis							436519	[]	[]
1375	1127	Coulombières							436520	[]	[]
1376	1128	Dresde							436521	[]	[]
1377	1137	Turin							436523	[]	[]
1378		Doix							436524	[]	[]
1379		Effiat							436525	[]	[]
1380	1135	Montréal							436526	[]	[]
1381	1128	Bavière							436527	[]	[]
1382	1127	Bray							436528	[]	[]
1383	1127	Ferney							436529	[]	[]
1384		Fontarabie							436530	[]	[]
1385	1127	Forges							436531	[]	[]
1386	1128	Francfort							436532	[]	[]
1387	1137	Gênes							436533	[]	[]
1388	1138	Genève							436534	[]	[]
1389	1127	Genevilliers							436535	[]	[]
1390		Gernay							436536	[]	[]
1391		Givet							436537	[]	[]
1392	1127	Béziers							436538	[]	[]
1393	1128	Hanovre							436539	[]	[]
1394	1127	Saint-Jean-de-Luz							436540	[]	[]
1395	1127	Strasbourg							436541	[]	[]
1396	1127	Château-Thierry							436542	[]	[]
1397		Île d’Oléron							436543	[]	[]
1398		Ivry							436544	[]	[]
1399	1127	Draguignan							436545	[]	[]
1400	1127	Narbonne							436546	[]	[]
1401	1127	Valence							436547	[]	[]
1402	1127	Laval							436548	[]	[]
1403	1127	Le Mans							436549	[]	[]
1404	1127	Bayonne							436550	[]	[]
1405	1128	Kehl							436551	[]	[]
1406	1624	Avenay							436552	[]	[]
1407	1127	Rochefort							436553	[]	[]
1408		La Meute							436554	[]	[]
1409	1128	Stuttgart							436555	[]	[]
1410	1127	Porcherons							436556	[]	[]
1411		Le Havre							436557	[]	[]
1412		Louisbourg							436558	[]	[]
1413	1127	Gentilly							436559	[]	[]
1414	1127	Maisons							436560	[]	[]
1415		Marly-la-Ville							436561	[]	[]
1416		Maupertuis							436562	[]	[]
1417		Millemont							436563	[]	[]
1418		Montigny							436564	[]	[]
1419	1127	Mortagne							436565	[]	[]
1420	1128	Munich							436566	[]	[]
1421		Munster							436567	[]	[]
1422	1131	Namur							436568	[]	[]
1423	1127	Nantouillet							436569	[]	[]
1424	1138	Neuchâtel							436570	[]	[]
1425	1137	Venise							436571	[]	[]
1426	1137	Palerme							436572	[]	[]
1427		Petits-Andelys							436573	[]	[]
1428		Picpus							436574	[]	[]
1429	1127	Sélestat							436575	[]	[]
1430	1128	Potsdam							436577	[]	[]
1431		Prague							436578	[]	[]
1432	1128	Presbourg							436579	[]	[]
1433	1623	Beaumont-en-Auge							436580	[]	[]
1434	1135	Québec							436581	[]	[]
1435		Raismes							436582	[]	[]
1436	1127	Rambouillet							436583	[]	[]
1437	1127	Richelieu							436584	[]	[]
1438	1127	Roinville							436585	[]	[]
1439	1137	Rome							436586	[]	[]
1440		Roye							436587	[]	[]
1441		Sablons							436588	[]	[]
1442	1127	Saint-Bonnet							436589	[]	[]
1443	1127	Saint-Cloud							436590	[]	[]
1444	1127	Saint-Cyr							436591	[]	[]
1445		Saint-Malo							436592	[]	[]
1446	1127	Sainte-Assise							436593	[]	[]
1447	1127	Neuilly							436594	[]	[]
1448	1127	Vitré							436595	[]	[]
1449	1127	Palinges							436596	[]	[]
1450	1127	Bonnétable							436597	[]	[]
1451		Sarguemines							436598	[]	[]
1452	1128	Schwetzingen							436599	[]	[]
1453		Senlis							436600	[]	[]
1454		Soleure							436601	[]	[]
1455	1127	Suresnes							436602	[]	[]
1456	1127	Abbeville							436603	[]	[]
1457	1127	Brest							436604	[]	[]
1458	1127	Champrosay							436605	[]	[]
1459	1128	Coblence							436606	[]	[]
1460	1141	Gand							436607	[]	[]
1461	1127	Grillon							436608	[]	[]
1462	1128	Hambourg							436609	[]	[]
1463	1127	Chaillot							436610	[]	[]
1464	1131	Maestricht							436611	[]	[]
1465	1127	Saint-Quentin							436612	[]	[]
1466	1140	Varsovie							436613	[]	[]
1467	1127	Asnières							436614	[]	[]
1468	1127	Nice							436615	[]	[]
1469	1139	Tunbridge Wells							436616	[]	[]
1470	1131	Utrecht							436617	[]	[]
1471	1127	Vanves							436618	[]	[]
1472	1127	Vanvres							436619	[]	[]
1473	1127	Vaudreuil							436620	[]	[]
1474		Vaux							436621	[]	[]
1475		Villeneuve							436622	[]	[]
1476	1128	Wurtemberg							436623	[]	[]
1477	1128	Zweibrucken							436624	[]	[]
1478	1136	New York							436625	[]	[]
1479		Roanne							436627	[]	[]
1480	1135	Toronto							436628	[]	[]
1481		Dublin							436629	[]	[]
1482	1128	Wolfenbüttel							436630	[]	[]
1483	1128	Halle							436631	[]	[]
1484	1128	Donaueschingen							436632	[]	[]
1485	1128	Gotha							436633	[]	[]
1486	1136	Washington							436634	[]	[]
1487	1137	Bologne							436635	[]	[]
1488		Roma							436636	[]	[]
1489		Cologne							436637	[]	[]
1490		Épernay							436638	[]	[]
1491		Oxford							436639	[]	[]
1492		Leyde							436640	[]	[]
1493		Anspac							436641	[]	[]
1494	1167	Auch							436642	[]	[]
1495		Cracovie							436643	[]	[]
1496		Constantinople							436644	[]	[]
1497		Normandie							436645	[]	[]
1498		Augsburg							436646	[]	[]
1499		Tunis [Grenoble]							436647	[]	[]
1500	1138	Lausanne							436648	[]	[]
1501		Aux Champs							436649	[]	[]
1502		Mayence							436650	[]	[]
1503		Pise							436651	[]	[]
1504		Limoges							436653	[]	[]
1505		Sur le Parnasse							436654	[]	[]
1506		Mahon							436655	[]	[]
1507		Chio							436656	[]	[]
1508		Boulogne							436657	[]	[]
1509		Yverdun							436658	[]	[]
1510		Montreuil							436659	[]	[]
1511		Monomotapa							436660	[]	[]
1512		Hollande							436661	[]	[]
1513		Rotterdam							436662	[]	[]
1514		Au goût de siècle							436663	[]	[]
1515		Bouillon							436664	[]	[]
1516		Villefranche							436665	[]	[]
1517		Deux-Ponts							436666	[]	[]
1518		Lacédémonie							436667	[]	[]
1519		Brabant							436668	[]	[]
1520		Harcourt							436669	[]	[]
1521		Horochow							436670	[]	[]
1522		Chantillon							436672	[]	[]
1523		À tous les coins de la rue							436673	[]	[]
1524		Lampedouse							436674	[]	[]
1525		Lunopolis							436675	[]	[]
1526		Constaninople							436676	[]	[]
1527		Leipzig							436677	[]	[]
1528		Nantes?							436678	[]	[]
1529		Pris							436679	[]	[]
1530		Bretagne							436680	[]	[]
1531		Dans le pays de la raison							436681	[]	[]
1532		Londre							436682	[]	[]
1533	1127	Île de France							436683	[]	[]
1534		Cythère							436684	[]	[]
1535		Paris ?							436685	[]	[]
1536		À la Courtille							436686	[]	[]
1537	1138	Berne							436687	[]	[]
1538		Falaise							436688	[]	[]
1539		Athènes							436689	[]	[]
1540		Les Fossés							436690	[]	[]
1541		Épinal							436691	[]	[]
1542		Paris [Dieppe]							436692	[]	[]
1543		Baville							436693	[]	[]
1544		Gnide							436694	[]	[]
1545		Livourne							436695	[]	[]
1546		Sybérie							436696	[]	[]
1547		Tyrnau							436697	[]	[]
1548		Séville							436698	[]	[]
1549		À Anconne							436699	[]	[]
1550	1127	Montmartre							436700	[]	[]
1551		Clignancourt							436701	[]	[]
1552		À Ancone							436702	[]	[]
1553		Fontenay							436703	[]	[]
1554		Nordlingen							436704	[]	[]
1555		Châlons-sur-Saône							436705	[]	[]
1556		Létourmi							436706	[]	[]
1557		Castel							436707	[]	[]
1558		Lisbonne							436708	[]	[]
1559		Stockholm							436709	[]	[]
1560		Pékin							436710	[]	[]
1561		Paris [La Haye]							436711	[]	[]
1562		Spa							436712	[]	[]
1563		Astracan [Paris]							436713	[]	[]
1564		À Bonne-Huille							436714	[]	[]
1565		Arcadie							436715	[]	[]
1566		Surate							436716	[]	[]
1567		Imprimée à la campagne							436717	[]	[]
1568		Véritopolis							436718	[]	[]
1569		Memphis							436719	[]	[]
1570		Aux Champs-Elysées							436720	[]	[]
1571		Philadelphie							436721	[]	[]
1572		Bastia							436722	[]	[]
1573		Londres [Rouen]							436723	[]	[]
1574		Tübingen							436724	[]	[]
1575		Aux Deux-Ponts							436725	[]	[]
1576		Rome [Paris]							436726	[]	[]
1577		Aux vertus							436727	[]	[]
1578		Cour-Neuve							436728	[]	[]
1579		Vérone							436729	[]	[]
1580	1138	Bâle							436730	[]	[]
1581		Gironne							436731	[]	[]
1582		À Bucéphalie							436732	[]	[]
1583		Sybaris							436733	[]	[]
1584		Florence							436734	[]	[]
1585		"Paris (Impimée à Londres, débitée à Berlin et à Paris)"							436735	[]	[]
1586		Calcéopolis							436736	[]	[]
1587		Rouen (et se vend à Paris)							436737	[]	[]
1588		Rouen (et se vend à Paris chez)							436738	[]	[]
1589		Londres (adresse fictive)							436739	[]	[]
1590		Paris [Citadella]							436740	[]	[]
1591		Au Grand Caire							436741	[]	[]
1592		À Ridiculomanie							436742	[]	[]
1593	1622	La Flèche							436743	[]	[]
1594		Rouen (se vend à Paris)							436744	[]	[]
1595		Louvain							436745	[]	[]
1596		Havre							436746	[]	[]
1597		Paris (Imprimé à Rouen et se vend à Paris)							436747	[]	[]
1598		Troys							436748	[]	[]
1599		(Se vend à Paris)							436749	[]	[]
1600		[Paris]							436750	[]	[]
1601		Genève [Berlin]							436751	[]	[]
1602		[Amsterdam]							436752	[]	[]
1603		Londres [Paris]							436753	[]	[]
1604		(Sur l’imprimé à Paris)							436754	[]	[]
1605		Se vend à Paris							436755	[]	[]
1606		[Hollande]							436756	[]	[]
1607		[Paris ?]							436757	[]	[]
1608		(Suivant la copie imprimée à Paris)							436758	[]	[]
1609		[Jouxte la copie imprimée à Paris]							436759	[]	[]
1610		Jouxte la copie imprimée à Paris							436760	[]	[]
1611		Exeter							436761	[]	[]
1612		Orange							436762	[]	[]
1613		Suivant la copie imprimée à Paris							436763	[]	[]
1614		Brighton							436764	[]	[]
1615		Yverdon							436765	[]	[]
1616		La Halle							436766	[]	[]
1617		Nyons							436767	[]	[]
1618		se trouve à Amsterdam							436768	[]	[]
1619		[Bruxelles]							436769	[]	[]
1620	1127	Haute-Marne							436771	[]	[]
1621	1127	Seine-et-Marne							436772	[]	[]
1622	1127	Sarthe							436773	[]	[]
1623	1127	Calvados							436774	[]	[]
1624	1127	Champagne							436775	[]	[]
1625	1127	Amblimont							436776	[]	[]
1626	1132	Barcelone							436777	[]	[]
1627	1127	Doué							436778	[]	[]
1628	1127	Environs de Toulouse							436779	[]	[]
