﻿id	parent_id	name	description	original_id	authorities	sources
1	51	acrobate	sauteur	1	[]	[]
2	51	acteur		2	[]	[]
3	51	dompteur		3	[]	[]
4	19	architecte		4	[]	[]
5	19	auteur		5	[]	[]
6	51	danseur		6	[]	[]
7	51	scénographe		7	[]	[]
8	51	chef de troupe		8	[]	[]
9	51	marionettiste		9	[]	[]
10	51	musicien		10	[]	[]
11	19	peintre		11	[]	[]
12	51	montreur	entrepreneur	12	[]	[]
13	19	graveur		13	[]	[]
14	51	compositeur		14	[]	[]
15	19	traducteur		15	[]	[]
16	51	chorégraphe		16	[]	[]
17	51	opérateur	également utilisé pour un dentiste	17	[]	[]
18	51	chanteur		19	[]	[]
19		métiers en partie étrangers aux arts de la scène		20	[]	[]
20	51	machiniste		21	[]	[]
21	51	caissier		23	[]	[]
22	51	chef d’orchestre		24	[]	[]
23	51	costumier		25	[]	[]
24	51	gagiste		26	[]	[]
25	51	placeur		27	[]	[]
26	51	régisseur		28	[]	[]
27	51	souffleur		29	[]	[]
28	19	éditeur		30	[]	[]
29	19	critique		31	[]	[]
30	19	libraire		33	[]	[]
31	19	imprimeur		34	[]	[]
32	19	artisan		36	[]	[]
33	19	corps enseignant		38	[]	[]
34	19	diplomate		39	[]	[]
35	19	ecclésiastique		40	[]	[]
36	35	membre du clergé	prêtre catholique	41	[]	[]
37	35	pasteur	"protestant ; lié à un endroit"	42	[]	[]
38	35	prédicateur	"itinérant ; utilisé pour les prédicateurs protestant"	43	[]	[]
39	35	prélat	hautes fonctions ecclésiastiques dans la hiérarchie catholique	44	[]	[]
40	19	étudiant	"étudiant, élève"	45	[]	[]
41	19	homme politique	par exemple : syndic de la ville	46	[]	[]
42	19	souverain	"personne qui a hérité d'une autorité sur un territoire ; chef héréditaire d'un état ; tête couronnée ; souverain"	47	[]	[]
43	19	magistrat		50	[]	[]
44	19	métiers de la banque		51	[]	[]
45	19	métiers du commerce		52	[]	[]
46	19	métiers du droit		54	[]	[]
47	46	notaire		55	[]	[]
48	19	métiers de la médecine		56	[]	[]
49	19	soldat		57	[]	[]
50	19	homme d'état	"""ceux qui dirigent l'État et détiennent le pouvoir exécutif"""	58	[]	[]
51		métiers des arts de la scène		59	[]	[]
