﻿id	parent_id	name	description	original_id	authorities	sources
1	26	plein air	"en extérieur, rattaché ou non à un bâtiment ; si le terme est utilisé en complément d'un autre qui désigne un bâtiment, il signifie ""à l'extérieur de ce bâtiment"""	30	[]	[]
2	26	lieu de culte		26	[]	[]
3	26	halles		25	[]	[]
4	26	faubourg		24	[]	[]
5	26	couvent		20	[]	[]
6	26	établissement scolaire		21	[]	[]
7	26	auberge		15	[]	[]
8	26	bâtiment public	"par opposition à résidence particulière ; ce n'est pas un lieu d'habitat ; lieu qui possède une fonction représentative d'une collectivité"	10	[]	[]
9	26	théâtre des boulevards		9	[]	[]
10	26	théâtre de la foire		8	[]	[]
11	26	théâtre		7	[]	[]
12	26	résidence particulière		6	[]	[]
13	26	loge		5	[]	[]
14	26	jeu de paume		4	[]	[]
15	26	amphithéâtre		1	[]	[]
16	1	jardin		36	[]	[]
17	1	rue		34	[]	[]
18	1	pont		31	[]	[]
19	1	cimetière		19	[]	[]
20	1	place publique		29	[]	[]
21	1	carrefour		18	[]	[]
22	6	collège		2	[]	[]
23	12	hôtel particulier		33	[]	[]
24	12	château	"y compris château du roi, de l'évêque (même si ces possèdent aussi une fonction institutionnel) ; c'est un lieu d'habitat ; parfois appelé ""à la cour"" ; comprend aussi le parvis et les jardins (combiné, dans ce cas, avec le terme ""plein air"" ou l'un de ses enfants)"	3	[]	[]
25	26	taverne		35	[]	[]
26		lieu de représentation		14	[]	[]
27		lieu géographique		38	[]	[]
28	27	localité	"lieu-dit, village, ville"	11	[]	[]
29	27	pays		13	[]	[]
30	27	région		12	[]	[]
