﻿id	person_id	publisher_id	activity_id	start_min	start_max	end_min	end_max	authorities	sources
1	7125	455	28					[]	[]
2	7126	412	28					[]	[]
3	7127	520	28					[]	[]
4	7128	1202	28					[]	[]
5	7129	468	28					[]	[]
6	7130	1096	28					[]	[]
7	7131	462	28					[]	[]
8	7132	576	28					[]	[]
9	7133	411	28					[]	[]
10	7134	394	28					[]	[]
11	7135	173	28					[]	[]
12	7136	1397	28					[]	[]
13	7137	265	28					[]	[]
14	7138	688	28					[]	[]
15	7139	228	28					[]	[]
16	7140	172	28					[]	[]
17	7141	1313	28					[]	[]
18	7142	1115	28					[]	[]
19	7143	205	28					[]	[]
20	7144	335	28					[]	[]
21	7145	726	28					[]	[]
22	7146	742	28					[]	[]
23	7147	526	28					[]	[]
24	7148	738	28					[]	[]
25	7149	584	28					[]	[]
26	7150	1310	28					[]	[]
27	7151	904	28					[]	[]
28	7152	967	28					[]	[]
29	7153	799	28					[]	[]
30	7154	1471	28					[]	[]
31	7155	1416	28					[]	[]
32	7156	1097	28					[]	[]
33	7157	784	28					[]	[]
34	7158	1457	28					[]	[]
35	7159	1205	28					[]	[]
36	7160	521	28					[]	[]
37	7161	1075	28					[]	[]
38	7162	551	28					[]	[]
39	7163	496	28					[]	[]
40	7164	209	28					[]	[]
41	7165	1128	28					[]	[]
42	7166	1000	28					[]	[]
43	7167	781	28					[]	[]
44	7168	528	28					[]	[]
45	7169	1394	28					[]	[]
46	7170	1127	28					[]	[]
47	7171	589	28					[]	[]
48	7172	1085	28					[]	[]
49	7173	914	28					[]	[]
50	7174	165	28					[]	[]
51	7175	45	28					[]	[]
52	7176	1294	28					[]	[]
53	7177	1118	28					[]	[]
54	7178	270	28					[]	[]
55	7179	371	28					[]	[]
56	7180	716	28					[]	[]
57	7181	766	28					[]	[]
58	7182	273	28					[]	[]
59	7183	1048	28					[]	[]
60	7184	657	28					[]	[]
61	7185	1076	28					[]	[]
62	7186	1103	28					[]	[]
63	7187	893	28					[]	[]
64	7188	1431	28					[]	[]
65	7189	753	28					[]	[]
66	7190	1344	28					[]	[]
67	7191	1309	28					[]	[]
68	7192	329	28					[]	[]
69	7193	1066	28					[]	[]
70	7194	215	28					[]	[]
71	7195	970	28					[]	[]
72	7196	503	28					[]	[]
73	7197	568	28					[]	[]
74	7198	474	28					[]	[]
75	7199	559	28					[]	[]
76	7200	187	28					[]	[]
77	7201	469	28					[]	[]
78	7202	1299	28					[]	[]
79	7203	961	28					[]	[]
80	7204	558	28					[]	[]
81	7205	788	28					[]	[]
82	7206	334	28					[]	[]
83	7207	991	28					[]	[]
84	7208	908	28					[]	[]
85	7209	667	28					[]	[]
86	7210	283	28					[]	[]
87	7211	1149	28					[]	[]
88	7212	155	28					[]	[]
89	7213	710	28					[]	[]
90	7214	327	28					[]	[]
91	7215	1293	28					[]	[]
92	7216	198	28					[]	[]
93	7217	678	28					[]	[]
94	7218	787	28					[]	[]
95	7219	809	28					[]	[]
96	7220	547	28					[]	[]
97	7221	1234	28					[]	[]
98	7222	1064	28					[]	[]
99	7223	1195	28					[]	[]
100	7224	1122	28					[]	[]
101	7225	285	28					[]	[]
102	7226	803	28					[]	[]
103	7227	378	28					[]	[]
104	7228	1	28					[]	[]
105	7229	1031	28					[]	[]
106	7230	1379	28					[]	[]
107	7231	345	28					[]	[]
108	7232	217	28					[]	[]
109	7233	524	28					[]	[]
110	7234	1248	28					[]	[]
111	7235	1233	28					[]	[]
112	7236	203	28					[]	[]
113	7237	1480	28					[]	[]
114	7238	1139	28					[]	[]
115	7239	1342	28					[]	[]
116	7240	1046	28					[]	[]
117	7241	393	28					[]	[]
118	7242	604	28					[]	[]
119	7243	1049	28					[]	[]
120	7244	715	28					[]	[]
121	7245	1235	28					[]	[]
122	7246	931	28					[]	[]
123	7247	1073	28					[]	[]
124	7248	1129	28					[]	[]
125	7249	494	28					[]	[]
126	7250	1078	28					[]	[]
127	7251	1196	28					[]	[]
128	7252	1138	28					[]	[]
129	7253	567	28					[]	[]
130	7254	596	28					[]	[]
131	7255	587	28					[]	[]
132	7256	523	28					[]	[]
133	7257	204	28					[]	[]
134	7258	994	28					[]	[]
135	7259	752	28					[]	[]
136	7260	379	28					[]	[]
137	7261	1022	28					[]	[]
138	7262	1074	28					[]	[]
139	7263	162	28					[]	[]
140	7264	937	28					[]	[]
141	7265	1092	28					[]	[]
142	7266	857	28					[]	[]
143	7267	602	28					[]	[]
144	7268	534	28					[]	[]
145	7269	1051	28					[]	[]
146	7270	1443	28					[]	[]
147	7271	917	28					[]	[]
148	7272	673	28					[]	[]
149	7273	527	28					[]	[]
150	7274	963	28					[]	[]
151	7275	196	28					[]	[]
152	7276	197	28					[]	[]
153	7277	1395	28					[]	[]
154	7278	231	28					[]	[]
155	7279	613	28					[]	[]
156	7280	1447	28					[]	[]
157	7281	1444	28					[]	[]
158	7282	509	28					[]	[]
159	7283	1050	28					[]	[]
160	7284	891	28					[]	[]
161	7285	1393	28					[]	[]
162	7286	1351	28					[]	[]
163	7287	1093	28					[]	[]
164	7288	357	28					[]	[]
165	7289	744	28					[]	[]
166	7290	1254	28					[]	[]
167	7291	1256	28					[]	[]
168	7292	915	28					[]	[]
169	7293	731	28					[]	[]
170	7294	224	28					[]	[]
171	7295	178	28					[]	[]
172	7296	807	28					[]	[]
173	7297	1243	28					[]	[]
174	7298	252	28					[]	[]
175	7299	1226	28					[]	[]
176	7300	1041	28					[]	[]
177	7301	796	28					[]	[]
178	7302	175	28					[]	[]
179	7303	417	28					[]	[]
180	7304	418	28					[]	[]
181	7305	419	28					[]	[]
182	7306	420	28					[]	[]
183	7307	422	28					[]	[]
184	7308	564	28					[]	[]
185	7309	1410	28					[]	[]
186	7310	1487	28					[]	[]
187	7311	852	28					[]	[]
188	7312	853	28					[]	[]
189	7313	854	28					[]	[]
190	7314	544	28					[]	[]
191	7315	365	28					[]	[]
192	7316	1204	28					[]	[]
193	7317	899	28					[]	[]
194	7318	156	28					[]	[]
195	7319	1287	28					[]	[]
196	7320	1025	28					[]	[]
197	7321	1084	28					[]	[]
198	7322	310	28					[]	[]
199	7323	206	28					[]	[]
200	7324	211	28					[]	[]
201	7325	214	28					[]	[]
202	7326	229	28					[]	[]
203	7327	1470	28					[]	[]
204	7328	786	28					[]	[]
205	7329	743	28					[]	[]
206	7330	812	28					[]	[]
207	7331	811	28					[]	[]
208	7332	483	28					[]	[]
209	7333	487	28					[]	[]
210	7334	532	28					[]	[]
211	7335	1317	28					[]	[]
212	7336	557	28					[]	[]
213	7337	951	28					[]	[]
214	7338	275	28					[]	[]
215	7339	274	28					[]	[]
216	7340	1429	28					[]	[]
217	7341	669	28					[]	[]
218	7342	737	28					[]	[]
219	7343	760	28					[]	[]
220	7344	565	28					[]	[]
221	7345	717	28					[]	[]
222	7346	1008	28					[]	[]
223	7347	877	28					[]	[]
224	7348	1247	28					[]	[]
225	7349	636	28					[]	[]
226	7350	1463	28					[]	[]
227	7351	1273	28					[]	[]
228	7352	472	28					[]	[]
229	7353	471	28					[]	[]
230	7354	1180	28					[]	[]
231	7355	1173	28					[]	[]
232	7356	749	28					[]	[]
233	7357	845	28					[]	[]
234	7358	750	28					[]	[]
235	7359	1155	28					[]	[]
236	7360	972	28					[]	[]
237	7361	533	28					[]	[]
238	7362	1286	28					[]	[]
239	7363	402	28					[]	[]
240	7364	1060	28					[]	[]
241	7365	1013	28					[]	[]
242	7366	414	28					[]	[]
243	7367	600	28					[]	[]
244	7368	649	28					[]	[]
245	7369	966	28					[]	[]
246	7370	161	28					[]	[]
247	7371	234	28					[]	[]
248	7372	712	28					[]	[]
249	7373	251	28					[]	[]
250	7374	610	28					[]	[]
251	7375	147	28					[]	[]
252	7376	268	28					[]	[]
253	7377	926	28					[]	[]
254	7378	1047	28					[]	[]
255	7379	611	28					[]	[]
256	7380	15	28					[]	[]
257	7381	815	28					[]	[]
258	7382	289	28					[]	[]
259	7383	690	28					[]	[]
260	7384	719	28					[]	[]
261	7385	755	28					[]	[]
262	7386	432	28					[]	[]
263	7387	350	28					[]	[]
264	7388	456	28					[]	[]
265	7389	299	28					[]	[]
266	7390	1035	28					[]	[]
267	7391	391	28					[]	[]
268	7392	677	28					[]	[]
