﻿id	community_type_id	name	original_id	start_min	start_max	end_min	end_max	authorities	sources
1		Comédie Italienne (ancienne)	167925	1660-01-01	1660-12-31	1697-05-14	1697-05-14	[]	[]
2		Académie royale de musique (Paris)	167958	1669-01-01	1669-12-31			[]	[]
3		Jésuites	167996					[]	[]
4		Alard et Lalauze	168238	1711-01-01	1711-12-31	1711-01-01	1711-12-31	[]	[]
5		Troupe de Belair	168299					[]	[]
6		Alard & Rauly	168304					[]	[]
7		Octave	168306	1712-01-01	1712-12-31	1716-01-01	1716-12-31	[]	[]
8		Bertrand et Dolet	168309					[]	[]
9		Dame Baron	168314	1712-01-01	1712-12-31	1710-01-01	1719-12-31	[]	[]
10		Saint-Edme et Dominique	168321					[]	[]
11		Dame Baron (sous les noms de Baxter et Saurin)	168324	1700-01-01	1799-12-31			[]	[]
12		Palais-Royal	168327					[]	[]
13		Veuve Maurice	168352	1707-01-01	1707-12-31	1709-01-01	1709-12-31	[]	[]
14		Alard	168356	1690-01-01	1699-12-31	1711-01-01	1711-12-31	[]	[]
15		Saint-Edme	168368	1710-01-01	1710-12-31			[]	[]
16		Bertrand et Selles	168381					[]	[]
17		Selles	168434	1701-01-01	1701-12-31	1710-01-01	1719-12-31	[]	[]
18		Alard & veuve Maurice	168935	1700-01-01	1700-12-31	1706-01-01	1706-12-31	[]	[]
19		Le Noir et Montdory	168992					[]	[]
20		Pellegrin (sous le nom de Péclavé)	169956	1711-01-01	1711-12-31	1718-01-01	1718-12-31	[]	[]
21		Troupe de Mademoiselle	169987					[]	[]
22		Troupe de tous les plaisirs	170076					[]	[]
23		Troupe du duc de Lorraine	170097					[]	[]
24		Marionnettes	170193					[]	[]
25		Comediens Italiens Privilégiés de Monseigneur le Maréchal de Villeroy	170400					[]	[]
26		Bienfait I	170467	1717-01-01	1717-12-31			[]	[]
27		Alexandre Bertrand	170580	1690-01-01	1690-12-31	1700-01-01	1799-12-31	[]	[]
28		Comédiens de monseigneur le prince	170670					[]	[]
29		Académiciens des Nouvelles Découvertes de Médecine	170708					[]	[]
30		Bellegarde et Desguerrois	170760	1709-01-01	1709-12-31	1710-01-01	1710-12-31	[]	[]
31		"Bertrand, Dolet et Delaplace"	170763	1707-01-01	1707-12-31	1712-01-01	1712-12-31	[]	[]
32		Comédiens du Roi	170806					[]	[]
33		Montdory	170919					[]	[]
34		Grandes Marionnettes du Dauphin	171158					[]	[]
35		Francisque	171213	1700-01-01	1799-12-31	1723-01-01	1723-12-31	[]	[]
36		Troupe des Marionnettes Italiennes	171810					[]	[]
37		Mme Hippolyte Feuillet-Letellier	172265	1707-01-01	1707-12-31			[]	[]
38		Troupe royale des Pygmées (l’Opéra des Bamboches)	172375	1675-09-07	1675-09-07	1678-01-01	1678-12-31	[]	[]
39		Académie royale de musique de Rouen	172671	1688-01-01	1688-12-31			[]	[]
40		Octave & Dolet	172799					[]	[]
41		Pensionnaires de Monsieur le Grand	173822					[]	[]
42		Société d’amis	174120					[]	[]
43		Société des Lazzistes	303058	1731-12-01	1731-12-31	1732-07-01	1732-07-31	[]	[]
44		Société dramatique de l’hôtel Montalembert.	303060	1784-01-01	1784-12-31	1786-01-01	1786-12-31	[]	[]
45		Société de Morville	307694	1727-01-01	1727-12-31	1743-01-01	1743-12-31	[]	[]
46		Cercle de Madame de Montesson	307711	1766-01-01	1766-12-31	1785-01-01	1785-12-31	[]	[]
47		Théâtre du Sieur Lécluze	309033	1778-08-17	1778-08-17	1779-01-03	1779-01-03	[]	[]
48		Théâtre des Grands-Danseurs du Roi	309036	1772-01-01	1772-12-31			[]	[]
49		Les Vrais Fantoccini italiens	309043	1700-01-01	1799-12-31			[]	[]
50		Troupe du nouveau spectacle pantomime	309046	1746-01-01	1746-12-31	1749-01-01	1749-12-31	[]	[]
51		Grande Troupe étrangère (Restier fils & veuve Lavigne)	309048	1740-01-01	1740-12-31	1751-01-01	1751-12-31	[]	[]
52		Troupe de l’Ambigu-Comique	309077	1769-07-01	1769-07-31			[]	[]
53		Théâtre des Associés	309079	1774-01-01	1774-12-31			[]	[]
54		Dolet & Delaplace	309091	1707-01-01	1707-12-31	1707-01-01	1707-12-31	[]	[]
55		Troupe de sauteurs et grands danseurs de corde de Restier fils	309104	1751-01-01	1751-12-31	1762-01-01	1762-12-31	[]	[]
56		Troupe des Variétés-Amusantes	309116	1779-01-01	1779-12-31			[]	[]
57		Troupe des Élèves de l’Opéra	309139	1779-01-07	1779-01-07	1780-09-01	1780-09-30	[]	[]
58		Troupe de Lajoute	309167	1716-01-01	1716-12-31	1700-01-01	1799-12-31	[]	[]
59		Selles et Lajoute	309171	1708-01-01	1708-12-31			[]	[]
60		Troupe de Christophe	309183	1720-01-01	1720-12-31			[]	[]
61		Comédie Italienne (nouvelle)	309192	1716-05-18	1716-05-18	1762-01-01	1762-12-31	[]	[]
62		Troupe des sieurs Colin et Restier fils	309220	1745-01-01	1745-12-31	1746-01-01	1746-12-31	[]	[]
63		Troupe des Sauteurs et Voltigeurs hollandais	309290	1760-01-01	1769-12-31			[]	[]
64		Troupe des Petits-Comédiens de S.A. S. le comte de Beaujolais	309294	1784-01-01	1784-12-31	1790-01-01	1790-12-31	[]	[]
65		Opéra Comique de Ponteau & la troupe anglaise de Delamain	309330	1739-01-01	1739-12-31	1740-01-01	1749-12-31	[]	[]
66		Troupe des Sauteurs & Danseurs Anglais de Delamain	309332	1738-01-01	1738-12-31	1739-01-01	1739-12-31	[]	[]
67		Opéra Comique de Ponteau	309350	1728-01-01	1728-12-31	1742-01-01	1742-12-31	[]	[]
68		Troupe des Délassements comiques	309415	1785-01-01	1785-12-31			[]	[]
69		Nivelon	309458	1707-01-01	1707-12-31	1711-01-01	1711-12-31	[]	[]
70		Troupe des Enfants hollandais	309463	1746-01-01	1746-12-31			[]	[]
71		Troupe des Enfants anglais et italiens	309464					[]	[]
72		"Troupe des Petits Enfants danseurs, sauteurs et voltigeurs de corde"	309465					[]	[]
73		Troupe des Enfants espagnols	309466	1781-01-01	1781-12-31			[]	[]
74		Troupe des sauteurs et cabrioleurs	309467	1760-01-01	1769-12-31			[]	[]
75		Troupe de l’Artificier hollandais	309545	1757-01-01	1757-12-31			[]	[]
76		"Grande troupe allemande, anglaise et écossaise"	309667	1719-01-01	1719-12-31			[]	[]
77		Opéra-Comique d’Honoré	309673	1724-01-01	1724-12-31	1727-01-01	1727-12-31	[]	[]
78		Grande troupe de sauteurs et de danseurs de corde (Dubroc & Teste)	309838	1729-01-01	1729-12-31			[]	[]
79		"Restier le père, Dolet et Delaplace"	309878	1723-01-01	1723-12-31	1724-01-01	1724-12-31	[]	[]
80		Troupe pantomime de Mme Sandham	309909	1746-01-01	1746-12-31			[]	[]
81		Troupe de Ferrère	310019			1770-01-01	1779-12-31	[]	[]
82		Troupe du spectacle mécanique d’Antoine Fouré	310036	1759-01-01	1759-12-31			[]	[]
83		Troupe de Neufmaison	310060	1769-01-01	1769-12-31			[]	[]
84		Troupe de Jean-Baptiste Nicolet	310062	1750-01-01	1759-12-31	1772-01-01	1772-12-31	[]	[]
85		Troupe des Variétés du Palais-Royal	310098	1785-01-01	1785-01-01	1791-01-01	1791-12-31	[]	[]
86		Marionnettes étrangères	310108	1722-01-01	1722-12-31	1722-01-01	1722-12-31	[]	[]
87		Troupe de Gaudon	310140	1760-01-01	1769-12-31			[]	[]
88		Les Pygmées français	310146	1785-01-01	1785-12-31			[]	[]
89		Dutac et Révelin	310180					[]	[]
90		Hamoche et Devienne	310307	1732-07-01	1732-07-31	1734-01-01	1734-12-31	[]	[]
91		Lalauze & Restier le père	310512	1720-01-01	1720-12-31			[]	[]
92		"Opera Comique de Lalauze en société avec Maillard, Mlle Maillard, Baxter, Saurin, Pierre Alard, Mlle d’Aigremont"	310514	1721-07-01	1721-07-31	1721-09-01	1721-09-30	[]	[]
93		Troupe de François-Paul Nicolet (dit le jeune)	310530					[]	[]
94		Opéra-Comique de Favart (deuxième)	310559	1758-01-01	1758-12-31	1762-01-01	1762-12-31	[]	[]
95		Opéra-Comique de Monnet (deuxième)	310590	1752-01-01	1752-12-31	1757-01-01	1757-12-31	[]	[]
96		Julien de Lavigne & Restier père	310648	1732-01-01	1732-12-31			[]	[]
97		Troupe de Sylvestre Leblanc	310675	1750-01-01	1759-12-31			[]	[]
98		Pélissier	310813	1600-01-01	1699-12-31	1690-01-01	1699-12-31	[]	[]
99		Veuve Letellier et son fils	310859	1715-01-01	1715-12-31			[]	[]
100		Comédiens praticiens	310868	1740-01-01	1749-12-31			[]	[]
101		Bluettes comiques	310917					[]	[]
102		Théâtre Français Comique et lyrique	310919	1790-01-01	1790-12-31			[]	[]
103		Rendez-vous des Champs-Élysées	310932					[]	[]
104		Troupe de Claude Leclair	310955					[]	[]
105		Troupe du Théâtre des petits comédiens du Marais	311021	1749-01-01	1749-12-31			[]	[]
106		Troupe de Hyam	311030	1770-01-01	1779-12-31			[]	[]
107		Troupe de Matthews	311047					[]	[]
108		Troupe des Forces de l’Amour et de la Magie (Alard & Maurice Vondrebeck)	311065	1678-01-01	1678-12-31			[]	[]
109		Troupe du Théâtre de la Cité	311090	1792-10-20	1792-10-20			[]	[]
110		Charini & Meunier	311134					[]	[]
111		Théâtre français de la rue de Richelieu	311150	1791-04-01	1791-04-30			[]	[]
112		Spectacle militaire	311189	1767-01-01	1767-12-31			[]	[]
113		Troupe de Mlle Montansier	311213					[]	[]
114		Les Sauteurs du Roi	311261	1720-01-01	1720-12-31			[]	[]
115		Opéra-Comique de Monnet (première)	311274	1743-03-28	1743-03-28	1743-01-01	1743-12-31	[]	[]
116		Opéra-Comique de Favart (première)	311308	1740-01-01	1749-12-31	1740-01-01	1749-12-31	[]	[]
117		Théâtre de marionnettes de P. G. Gourliez (dit Lamotte)	311371	1758-01-01	1758-12-31			[]	[]
118		Théâtre Sans Prétention	311480	1790-01-01	1790-12-31			[]	[]
119		Troupe de Marteau	311491	1585-02-25	1585-02-25	1585-02-25	1585-02-25	[]	[]
120		Troupe de Talmy	311492	1588-01-01	1588-12-31	1599-01-01	1599-12-31	[]	[]
121		Troupe de Valleran Le Conte	311493	1592-01-01	1592-12-31	1613-01-01	1613-12-31	[]	[]
122		Troupe de Châteauvieux	311494	1593-02-28	1593-02-28	1593-02-28	1593-02-28	[]	[]
123		Troupe de Courtin et Poteau	311495	1595-01-01	1595-12-31	1595-01-01	1595-12-31	[]	[]
124		Troupe de Benoît Petit	311496	1598-01-01	1598-12-31	1599-01-01	1599-12-31	[]	[]
125		Troupe de Le Febvre (Jean) ?	311497	1599-01-15	1599-01-15	1599-01-15	1599-01-15	[]	[]
126		La troupe du Duc de Lorraine (Charles III)	311498	1600-01-01	1600-12-31	1601-01-01	1601-12-31	[]	[]
127		Troupe de R. Guérin (dit Gros-Guillaume) (deuxième troupe)	311499	1600-10-30	1600-10-30	1600-01-01	1699-12-31	[]	[]
128		Troupe de Channeau	311500	1601-10-13	1601-10-13	1600-01-01	1699-12-31	[]	[]
129		Troupe de Fleury-Jacob	311501	1603-08-19	1603-08-19			[]	[]
130		Troupe de La Vallée	311502	1604-02-01	1604-02-28	1606-01-01	1606-12-31	[]	[]
131		Troupe de Laporte	311503	1608-02-21	1608-02-21	1610-12-30	1610-12-30	[]	[]
132		Troupe des Loyaux Bravelestes	311504	1609-07-01	1609-07-31	1609-07-01	1609-07-31	[]	[]
133		Troupe de R. Guérin (dit Gros-Guillaume) (quatrième troupe)	311505	1612-01-01	1612-12-31	1629-01-01	1629-12-31	[]	[]
134		La troupe du Prince de Condé (Henri II de Bourbon)	311506	1614-01-01	1614-12-31	1643-01-01	1643-12-31	[]	[]
135		La troupe du gouverneur de Poitou	311507	1614-01-01	1614-12-31	1614-01-01	1614-12-31	[]	[]
136		"Longueval (Claude Husson, dit)"	311508	1614-12-01	1614-12-31	1615-01-01	1615-12-31	[]	[]
137		Troupe de d’Alambourg (Dalembourg)	311509	1601-12-01	1601-12-31	1600-01-01	1699-12-31	[]	[]
138		Troupe de Cossart	311510	1615-01-01	1615-12-31	1620-01-01	1620-12-31	[]	[]
139		La troupe du Duc de Guise	311511	1618-01-01	1618-12-31	1618-01-01	1618-12-31	[]	[]
140		La troupe du prince d’Orange (Maurice de Nassau)	311512	1618-01-01	1618-12-31	1631-01-01	1631-12-31	[]	[]
141		Troupe de La Fortune (Jean Gassot)	311513	1618-03-05	1618-03-05			[]	[]
142		Troupe de Bellerose	311514	1620-10-01	1620-10-31	1620-01-01	1629-12-31	[]	[]
143		Troupe de Gasteau	311515	1621-07-01	1621-07-31	1621-07-01	1621-07-31	[]	[]
144		Troupe de Bruscambille	311516	1623-11-01	1623-11-30	1623-01-01	1623-12-31	[]	[]
145		Troupe de Montdory	311517	1624-04-10	1624-04-10	1629-01-01	1629-12-31	[]	[]
146		Troupe de La Fontaine (Etienne Ruffin)	311518	1624-08-03	1624-08-03	1624-10-01	1624-10-31	[]	[]
147		Troupe des Vrais comédiens du Roi	311519	1626-12-01	1626-12-31	1627-01-01	1627-01-31	[]	[]
148		Troupe royale de l’Hôtel de Bourgogne	311520	1629-01-01	1629-12-31	1680-01-01	1680-12-31	[]	[]
149		Troupe de Pierre Daré	311521	1629-01-01	1629-12-31	1629-01-01	1629-12-31	[]	[]
150		Troupe du duc d’Angoulême (Charles de Valois)	311522	1630-01-01	1630-12-31			[]	[]
151		La troupe de Duc de Montmorency (Henri II)	311523	1631-01-01	1631-12-31	1632-01-01	1632-12-31	[]	[]
152		La troupe du Duc d’Epernon (Bernard de Nogaret de La Valette)	311524	1632-01-01	1632-12-31	1650-01-01	1650-12-31	[]	[]
153		Troupe royale du Théâtre du Marais	311525	1629-01-01	1629-12-31	1673-01-01	1673-12-31	[]	[]
154		Troupe de La Source	311526	1634-02-27	1634-02-27			[]	[]
155		Troupe du Roi au faubourg Saint-Germain	311527	1635-01-01	1635-12-31	1635-01-01	1635-12-31	[]	[]
156		"Troupe de Floridor (Josias de Soulas, dit)"	311528	1635-01-01	1635-12-31	1637-01-01	1637-12-31	[]	[]
157		La troupe du prince d’Orange (Frédéric-Henri et Guillaume II de Nassau)	311529	1638-01-01	1638-12-31	1665-01-01	1665-12-31	[]	[]
158		Troupe de La Barre	311530	1638-03-01	1638-03-31			[]	[]
159		L’Illustre Théâtre	311531	1643-01-01	1643-12-31	1645-01-01	1645-12-31	[]	[]
160		La troupe du Duc Gaston d’Orléans	311532	1643-01-01	1643-12-31	1658-01-01	1658-12-31	[]	[]
161		Troupe de Châteauneuf (Charles de)	311533	1644-04-26	1644-04-26			[]	[]
162		Troupe du Théâtre Illustre	311534	1645-10-01	1645-10-31	1645-10-01	1645-10-31	[]	[]
163		Troupe de Lapierre	311535	1645-01-01	1645-12-31	1663-01-01	1663-12-31	[]	[]
164		Troupe de Dupré	311536	1649-01-01	1649-12-31			[]	[]
165		Troupe de Philandre (du prince d’Orange)	311537	1649-01-01	1649-12-31	1659-01-01	1659-12-31	[]	[]
166		Troupe de Desfontaines	311538	1649-01-01	1649-12-31	1651-01-01	1651-12-31	[]	[]
167		"La troupe de la Duchesse de Montpensier (Marie-Anne d’Orléans, la Grande Mademoiselle)"	311539	1651-01-01	1651-12-31	1678-01-01	1678-12-31	[]	[]
168		Troupe de La Couture (première troupe)	311540	1651-03-06	1651-03-06	1657-01-01	1657-12-31	[]	[]
169		Troupe de La Cour	311541	1651-03-27	1651-03-27	1651-01-01	1651-12-31	[]	[]
170		Troupe de Du Clos (Charles Brasseur)	311542	1651-10-24	1651-10-24			[]	[]
171		"Troupe de Rochefort, première troupe"	311543	1652-03-26	1652-03-26	1653-01-01	1653-12-31	[]	[]
172		La troupe du prince de Conti (Armand de Bourbon)	311544	1653-01-01	1653-12-31	1656-01-01	1656-12-31	[]	[]
173		Troupe de Hauteroche	311545	1654-04-01	1654-04-01	1655-01-01	1655-12-31	[]	[]
174		La troupe de la reine de Suede	311546	1655-01-01	1655-12-31	1658-01-01	1658-12-31	[]	[]
175		"Troupe de Rochefort, deuxième troupe"	311547	1656-03-24	1656-03-24			[]	[]
176		Troupe de Villabé (troupe de Gaston d’Orléans)	311548	1656-03-24	1656-03-24	1657-01-01	1657-12-31	[]	[]
177		Troupe de Du Cormier	311549	1656-01-01	1656-12-31	1657-01-01	1657-12-31	[]	[]
178		Troupe de Villenasve	311550	1656-01-01	1656-12-31	1657-01-01	1657-12-31	[]	[]
179		Troupe de Croisac (première troupe)	311551	1657-03-14	1657-03-14	1658-01-01	1658-12-31	[]	[]
180		Troupe de Du Croisy	311552	1653-01-01	1653-12-31	1658-01-01	1658-12-31	[]	[]
181		Troupe du Roi au théâtre du Palais-Royal	311553	1665-01-01	1665-12-31	1673-01-01	1673-12-31	[]	[]
182		La troupe du Duc de Savoie (Charles-Emmanuel III et Victor-Amédée II)	311554	1658-01-01	1658-12-31	1698-01-01	1698-12-31	[]	[]
183		Troupe de La Motte	311555	1658-04-09	1658-04-09	1659-01-01	1659-12-31	[]	[]
184		Troupe de Belleroche (Raymond Poisson)	311556	1659-08-16	1659-08-16			[]	[]
185		Troupe de Philandre	311557	1659-11-17	1659-11-17	1660-01-01	1660-12-31	[]	[]
186		La troupe du Prince de Condé (Louis de Bourbon)	311558	1660-01-01	1660-12-31	1698-01-01	1698-12-31	[]	[]
187		La troupe d’Electeur de Cologne I	311559	1660-01-01	1660-12-31	1661-01-01	1661-12-31	[]	[]
188		"Troupe de Rosidor (Jean Guillemay du Chesnay, dit) (première troupe)"	311560	1660-03-02	1660-03-02	1661-01-01	1661-12-31	[]	[]
189		Troupe de La Plesse (première troupe)	311561	1660-03-10	1660-03-10	1661-01-01	1661-12-31	[]	[]
190		Troupe de Gobert	311562	1660-03-17	1660-03-17			[]	[]
191		Troupe de Richemont (première troupe)	311563	1660-03-01	1660-03-31	1670-01-01	1670-12-31	[]	[]
192		La troupe de la reine Marie-Thérèse	311564	1661-01-01	1661-12-31	1681-01-01	1681-12-31	[]	[]
193		Troupe de La Plesse (deuxième troupe)	311565	1661-03-30	1661-03-30	1662-01-01	1662-12-31	[]	[]
194		Troupe de Du Verger	311566	1661-01-01	1661-12-31			[]	[]
195		La troupe du Dauphin (Louis de Bourbon)	311567	1662-02-17	1662-02-17	1696-03-01	1696-03-31	[]	[]
196		La troupe du Duc Philippe d’Orléans (Monsieur)	311568	1662-01-01	1662-12-31	1682-01-01	1682-12-31	[]	[]
197		La troupe du Roi d’Angleterre (Charles II)	311569	1662-01-01	1662-12-31	1663-01-01	1663-12-31	[]	[]
198		Troupe de La Couture (deuxième troupe)	311570	1662-05-06	1662-05-06	1663-01-01	1663-12-31	[]	[]
199		Troupe de Lavoy	311571	1662-05-01	1662-05-31			[]	[]
200		La troupe du marechal de Villeroy (Nicolas IV de Neufville)	311572	1663-01-01	1663-12-31	1668-01-01	1668-12-31	[]	[]
201		Troupe de Rochefort (troisième troupe)	311573	1663-02-09	1663-02-09	1664-01-01	1664-12-31	[]	[]
202		Troupe de Croisac (deuxième troupe)	311574	1663-03-15	1663-03-15	1665-01-01	1665-12-31	[]	[]
203		Troupe de La Marre (Nicolas Le Roy)	311575	1664-04-05	1664-04-05	1665-01-01	1665-12-31	[]	[]
204		Troupe de Longchamps (Henri) (première troupe)	311576	1664-04-06	1664-04-06	1665-01-01	1665-12-31	[]	[]
205		Troupe de La Plesse (troisième troupe)	311577	1664-04-05	1664-04-05	1665-01-01	1665-12-31	[]	[]
206		Troupe de Boncourt (La Marre ?)	311578	1664-05-15	1664-05-15			[]	[]
207		Troupe de Serdin	311579	1665-03-16	1665-03-16	1667-01-01	1667-12-31	[]	[]
208		Troupe de La Plesse (quatrième troupe)	311580	1665-03-18	1665-03-18	1666-01-01	1666-12-31	[]	[]
209		Troupe de Beauchamps (Nicolas) (première troupe)	311581	1665-03-26	1665-03-26	1666-01-01	1666-12-31	[]	[]
210		Troupe de Jolimont (première troupe)	311582	1666-03-30	1666-03-30	1668-01-01	1668-12-31	[]	[]
211		Troupe de Beauchamps (Nicolas) (deuxième troupe)	311583	1666-04-05	1666-04-05	1667-01-01	1667-12-31	[]	[]
212		La troupe de la Duchesse d’Orléans (Henriette d’Angleterre)	311584	1660-01-01	1669-12-31	1670-01-01	1679-12-31	[]	[]
213		La troupe du Duc de Lorraine (Charles IV)	311585	1666-01-01	1666-12-31	1667-01-01	1667-12-31	[]	[]
214		"Troupe de Guérin, Charles"	311586	1667-04-07	1667-04-07	1667-01-01	1667-12-31	[]	[]
215		Troupe de Hautefeuille	311587	1667-01-01	1667-12-31	1668-01-01	1668-12-31	[]	[]
216		La troupe du Duc de Lunebourg-Celle (Duc de Zell ou Celle) (Georges Guillaume de Brunswick)	311588	1668-01-01	1668-12-31	1699-01-01	1699-12-31	[]	[]
217		"Troupe de Rosidor (Jean Guillemay du Chesnay, dit) (deuxième troupe)"	311589	1668-10-22	1668-10-22			[]	[]
218		Troupe des comédiens de la Marine	311590	1669-01-01	1669-12-31	1678-01-01	1678-12-31	[]	[]
219		"Troupe de Rosidor (Jean Guillemay du Chesnay, dit)"	311591	1669-01-01	1669-12-31	1669-01-01	1669-12-31	[]	[]
220		Troupe de Féraud	311592	1670-01-01	1670-12-31	1670-01-01	1670-12-31	[]	[]
221		Troupe de Fonteneuil	311593	1669-03-31	1669-03-31	1670-01-01	1670-12-31	[]	[]
222		Troupe de La Plesse (cinquième troupe)	311594	1669-04-05	1669-04-05	1670-01-01	1670-12-31	[]	[]
223		Troupe de Philandre (une autre troupe)	311595	1669-01-01	1669-12-31	1670-01-01	1670-12-31	[]	[]
224		Troupe de Des Essarts	311596	1670-04-23	1670-04-23	1671-01-01	1671-12-31	[]	[]
225		Troupe de Desmarets	311597	1670-12-01	1670-12-31			[]	[]
226		La troupe d’Electeur de Bavière (Ferdinand-Marie et Maximilien II)	311598	1671-01-01	1671-12-31	1711-01-01	1711-12-31	[]	[]
227		Troupe de Richemont (deuxième troupe)	311599	1671-03-09	1671-03-09	1672-01-01	1672-12-31	[]	[]
228		Troupe de Romainville	311600	1671-03-15	1671-03-15	1672-01-01	1672-12-31	[]	[]
229		Troupe de La Source	311601	1672-03-21	1672-03-21	1672-03-22	1672-03-22	[]	[]
230		Troupe de Longchamps (Henri) (deuxième troupe)	311602	1672-03-26	1672-03-26	1678-01-01	1678-12-31	[]	[]
231		Troupe d’Alcidor (première troupe)	311603	1672-03-26	1672-03-26	1673-01-01	1673-12-31	[]	[]
232		Troupe d’Antoine Lefebvre (première troupe)	311604	1672-03-28	1672-03-28	1673-01-01	1673-12-31	[]	[]
233		Troupe de Vaultier (Robert)	311605	1672-04-02	1672-04-02			[]	[]
234		Troupe de Richemont (troisième troupe)	311606	1672-03-28	1672-03-28	1673-01-01	1673-12-31	[]	[]
235		La troupe du prince d’Orange (Guillaume III de Nassau)	311607	1673-01-01	1673-12-31	1703-01-01	1703-12-31	[]	[]
236		Troupe du Roi au théâtre de l’Hôtel Guénégaud	311608	1673-05-03	1673-05-03	1680-10-21	1680-10-21	[]	[]
237		"Troupe de Floridor (Charles de Soulas, dit)"	311609	1673-03-23	1673-03-23	1674-01-01	1674-12-31	[]	[]
238		La troupe du Duc d’Enghein (Henri-Jules de Bourbon)	311610	1674-01-01	1674-12-31	1681-01-01	1681-12-31	[]	[]
239		Troupe de Champmeslé (Nicolas)	311611	1674-01-01	1674-12-31	1681-01-01	1681-12-31	[]	[]
240		"Troupe de Longueval (Jean Le Masson, dit)"	311612	1674-01-01	1674-12-31	1674-01-01	1674-12-31	[]	[]
241		Troupe de Le Comte (Jean)	311613	1675-03-26	1675-03-26	1675-01-01	1675-12-31	[]	[]
242		Troupe de Jolimont (deuxième troupe)	311614	1675-03-30	1675-03-30	1676-01-01	1676-12-31	[]	[]
243		Troupe de Dumont (Jacques Primault ?)	311615	1675-01-01	1675-12-31	1676-01-01	1676-12-31	[]	[]
244		"Troupe de Châteauneuf (Augustin-Pierre Patissier, dit)"	311616	1675-03-06	1675-03-06	1676-01-01	1676-12-31	[]	[]
245		La troupe du duc de Hanovre (Jean-Frédéric de Brunswick)	311617	1676-01-01	1676-12-31	1680-01-01	1680-12-31	[]	[]
246		Troupe de Mondorge	311618	1676-03-17	1676-03-17	1677-01-01	1677-12-31	[]	[]
247		Troupe de Beauvais	311619	1676-03-26	1676-03-26	1677-03-01	1677-03-31	[]	[]
248		Troupe de Nevers	311620	1677-03-30	1677-03-30	1678-01-01	1678-12-31	[]	[]
249		Troupe de Belleroche (Ange-François Coirat)	311621	1677-03-30	1677-03-30	1678-01-01	1678-12-31	[]	[]
250		Troupe de Belleroche (Raymond Poisson)	311622	1677-04-02	1677-04-02	1678-01-01	1678-12-31	[]	[]
251		Troupe de Beauchamps (Jean Biet) (première troupe)	311623	1678-03-19	1678-03-19	1679-01-01	1679-12-31	[]	[]
252		Troupe de Montigny	311624	1678-02-21	1678-02-21	1679-01-01	1679-12-31	[]	[]
253		Troupe de Nanteuil (première troupe)	311625	1678-01-01	1678-12-31	1679-01-01	1679-12-31	[]	[]
254		Troupe de Desforges	311626	1679-03-06	1679-03-06	1680-01-01	1680-12-31	[]	[]
255		Troupe de Le Gentilhomme (première troupe)	311627	1679-03-17	1679-03-17	1680-01-01	1680-12-31	[]	[]
256		Troupe de Bellefond	311628	1679-03-23	1679-03-23	1680-01-01	1680-12-31	[]	[]
257		Comédie-Française	311629	1680-01-01	1680-12-31			[]	[]
258		La troupe de la Dauphine (Marie-Anne-Christine de Bavière)	311630	1680-03-26	1680-03-26	1690-02-01	1690-02-28	[]	[]
259		La troupe du prince de Parme	311631	1680-01-01	1680-12-31	1680-01-01	1680-12-31	[]	[]
260		Troupe de Marcelle (Jean de Marcel) et de Manjot	311632	1680-03-26	1680-03-26	1680-01-01	1680-12-31	[]	[]
261		Troupe de Clavel (première troupe)	311633	1680-04-04	1680-04-04	1681-01-01	1681-12-31	[]	[]
262		La troupe du duc de Hanovre (Ernest-Auguste de Brunswick)	311634	1681-01-01	1681-12-31	1696-01-01	1696-12-31	[]	[]
263		La troupe du Roi de Danemark	311635	1682-03-23	1682-03-23	1732-01-01	1732-12-31	[]	[]
264		"Troupe de Nanteuil (deuxième troupe, 1682)"	311636	1682-03-02	1682-03-02	1682-01-01	1682-12-31	[]	[]
265		Troupe de Le Gentilhomme (deuxième troupe)	311637	1682-03-16	1682-03-16	1683-01-01	1683-12-31	[]	[]
266		Troupe de Longchamps (Dominique) (première troupe)	311638	1682-03-22	1682-03-22	1693-01-01	1693-12-31	[]	[]
267		Troupe de Nanteuil (troisième troupe)	311639	1682-03-24	1682-03-24	1680-01-01	1689-12-31	[]	[]
268		Troupe de Jacques Valliot I	311640	1682-01-01	1682-12-31	1689-01-01	1689-12-31	[]	[]
269		Troupe de Chaumont	311641	1683-04-02	1683-04-02			[]	[]
270		Troupe d’Antoine Le Febvre (Lefebvre) (deuxième troupe)	311642	1683-04-24	1683-04-24	1684-01-01	1684-12-31	[]	[]
271		La troupe du Duc de Bourgogne (Louis de Bourbon)	311643	1685-09-01	1685-09-30	1690-01-01	1690-12-31	[]	[]
272		Troupe de Bruneval	311644	1685-03-01	1685-03-31			[]	[]
273		Troupe de Rosélis	311645	1685-04-06	1685-04-06	1600-01-01	1699-12-31	[]	[]
274		"Troupe de Du Boccage (Jean Chantrelle, dit) (première troupe)"	311646	1685-04-12	1685-04-12	1688-01-01	1688-12-31	[]	[]
275		La troupe du Duc de Vendôme (Louis Joseph de Bourbon)	311647	1686-01-01	1686-12-31	1699-01-01	1699-12-31	[]	[]
276		Troupe d’Alcidor (deuxième troupe)	311648	1686-03-26	1686-03-26	1687-01-01	1687-12-31	[]	[]
277		Troupe de Beauchamp (Charles Biet)	311649	1686-04-01	1686-04-30	1690-01-01	1690-12-31	[]	[]
278		"Troupe de Longueval (Jean Le Masson, dit)"	311650	1686-04-05	1686-04-05	1687-01-01	1687-12-31	[]	[]
279		Troupe de Rocantyn (Rocantyer ?)	311651	1687-01-01	1687-12-31	1688-01-01	1688-12-31	[]	[]
280		Troupe de Villabel	311652	1687-01-01	1687-12-31			[]	[]
281		Troupe de Villiers	311653	1687-03-01	1687-03-31	1687-12-01	1687-12-31	[]	[]
282		Troupe de Valloix (ou Valois)	311654	1688-06-01	1688-06-30			[]	[]
283		La troupe du Duc de Lorraine (Léopold)	311655	1688-03-01	1688-03-31	1720-01-01	1720-12-31	[]	[]
284		"Troupe de Du Boccage (Jean Chantrelle, dit) (deuxième troupe)"	311656	1689-02-01	1689-02-28	1689-01-01	1689-12-31	[]	[]
285		Troupe de Beauchamps (Jean Biet) (deuxième troupe)	311657	1690-01-01	1690-12-31	1698-01-01	1698-12-31	[]	[]
286		Troupe de Beauchamps (Henri Biet)	311658	1690-02-26	1690-02-26			[]	[]
287		Troupe de Clavel (deuxième troupe)	311659	1690-03-06	1690-03-06	1691-01-01	1691-12-31	[]	[]
288		Troupe de Valois	311660	1691-03-22	1691-03-22	1692-01-01	1692-12-31	[]	[]
289		La troupe du marechal de Villeroy (François de Neufville)	311661	1692-01-01	1692-12-31	1697-01-01	1697-12-31	[]	[]
290		Troupe de Clavel (troisième troupe)	311662	1692-02-18	1692-02-18	1705-01-01	1705-12-31	[]	[]
291		Troupe de Deschamps (Bernard Vautier)	311663	1692-03-13	1692-03-13			[]	[]
292		Troupe de Bonoeil (Nicolas)	311664	1693-01-01	1693-12-31	1716-01-01	1716-12-31	[]	[]
293		Troupe de Rochemore	311665	1694-12-13	1694-12-13	1696-01-01	1696-12-31	[]	[]
294		La troupe du prince de Liège (Joseph-Clément de Bavière)	311666	1696-01-01	1696-12-31	1697-01-01	1697-12-31	[]	[]
295		Troupe de Nanteuil IV	311667	1696-03-24	1696-03-24	1697-01-01	1697-12-31	[]	[]
296		Troupe de Valliot (deuxième troupe)	311668	1696-04-04	1696-04-04	1698-04-01	1698-04-30	[]	[]
297		La troupe du Roi d’Angleterre (Guillaume III d’Orange)	311669	1697-01-01	1697-12-31	1701-01-01	1701-12-31	[]	[]
298		Troupe des Comédiens de Perpignan	311670	1697-03-15	1697-03-15	1697-01-01	1697-12-31	[]	[]
299		La troupe d’Electeur de Cologne II	311671	1698-03-01	1698-03-31	1698-01-01	1698-12-31	[]	[]
300		Troupe de Longchamps (Dominique) (deuxième troupe)	311672	1698-03-05	1698-03-05	1699-01-01	1699-12-31	[]	[]
301		Troupe de Nanteuil (cinquième troupe)	311673	1698-01-01	1698-12-31	1700-01-01	1709-12-31	[]	[]
302		Troupe de Vilaire	311674	1698-12-01	1698-12-31	1699-01-01	1699-12-31	[]	[]
303		"Troupe de Rosidor (Claude-Ferdinand Guillemay du Chesnay, dit)"	311675	1698-01-01	1698-12-31	1718-01-01	1718-12-31	[]	[]
304		La troupe du Roi de Suede (Charles XII)	311676	1699-08-04	1699-08-04	1701-01-01	1701-12-31	[]	[]
305		Troupe de Valliot (troisième troupe)	311677	1699-04-04	1699-04-04			[]	[]
306		Troupe de Longchamps (Dominique) (troisième troupe)	311678	1699-03-28	1699-03-28			[]	[]
307		Troupe de Fonpré	311679	1699-01-01	1699-12-31	1699-01-01	1699-12-31	[]	[]
308		La troupe d’Electeur de Saxe et Roi de Pologne (Frédéric-Auguste)	311680	1699-01-01	1699-12-31	1699-01-01	1699-12-31	[]	[]
309		Troupe de Le Guay (Leguay)	311681	1700-01-17	1700-01-17			[]	[]
310		Troupe de Lesage	311682	1700-01-01	1700-12-31			[]	[]
311		Troupe de Cadet de Cassan	311683					[]	[]
312		"Troupe de Dumont (Jacques Primault, dit)"	311684	1704-03-01	1704-03-31	1704-01-01	1704-12-31	[]	[]
313		Troupe de Duteillay	311685	1704-03-15	1704-03-15	1705-04-13	1705-04-13	[]	[]
314		Troupe de Touteville	311686	1706-03-21	1706-03-21			[]	[]
315		La troupe du Roi de Prusse (Frédéric I)	311687	1706-01-01	1706-12-31	1711-01-01	1711-12-31	[]	[]
316		La troupe du comte de Toulouse (Louis-Alexandre)	311688	1707-01-01	1707-12-31	1707-01-01	1707-12-31	[]	[]
317		Troupe de Biet (Henri)	311689	1707-01-28	1707-01-28	1709-03-01	1709-03-31	[]	[]
318		Troupe de Villedieu	311690	1707-02-07	1707-02-07	1708-01-01	1708-12-31	[]	[]
319		Troupe de Châteauvert	311691	1713-01-01	1713-12-31	1718-01-01	1718-12-31	[]	[]
320		Opéra des Bamboches	315817					[]	[]
321		Mlle Gasserent	315881	1767-01-01	1767-12-31			[]	[]
322		Paghetti et Hamoche	315891	1714-01-01	1714-12-31			[]	[]
323		Rauly (et Dame Baron ?)	316034	1710-01-01	1710-12-31			[]	[]
324		Maurice Vondrebeck	316086			1699-01-01	1699-12-31	[]	[]
325		Danseurs de corde de Restier le père	316104	1726-01-01	1726-12-31			[]	[]
326		Théâtre des Grands Danseurs (Gaité)	316146					[]	[]
327		Les sauteurs de Richer	316163	1760-01-01	1769-12-31			[]	[]
328		John Riner	316168					[]	[]
329		Delahogue	316174	1772-01-01	1772-12-31			[]	[]
330		Rochefort et Tiquet	316204	1705-07-01	1705-07-31	1708-08-01	1708-08-31	[]	[]
331		Cadet père	316206					[]	[]
332		Jean-Baptiste Morel	316285	1770-01-01	1779-12-31			[]	[]
333		Spectacle à machines de Servandoni	316295					[]	[]
334		Pierre Routier	316299					[]	[]
335		Frères Ruggieri	316302	1765-01-01	1765-12-31			[]	[]
336		Dame Baron & Saint-Edme	316413	1700-01-01	1799-12-31	1718-01-01	1718-12-31	[]	[]
337		Académie Royale de Lyon	316425	1687-01-01	1687-12-31			[]	[]
338		Théâtre Patriotique	316447	1790-01-01	1790-12-31			[]	[]
339		Troupe de Saury	316485	1778-01-01	1778-12-31			[]	[]
340		Porenquins français (Fantoccini français)	316502	1777-01-01	1777-12-31			[]	[]
341		Restier père	316520	1700-01-01	1709-12-31			[]	[]
342		Ombres chinoises de Séraphin (Spectacle des Enfants de France)	316525	1772-01-01	1772-12-31			[]	[]
343		Tiquet	316729	1708-01-01	1708-12-31	1711-01-01	1711-12-31	[]	[]
344		Francassani et Belloni	316787	1707-01-01	1707-12-31	1707-01-01	1707-12-31	[]	[]
345		Théâtre de Bordeaux	316800					[]	[]
346		Théâtre Italien (Opéra Comique)	316826	1762-01-01	1762-12-31			[]	[]
347		Théâtre des Jeunes Elèves	316989					[]	[]
348		Théâtre de Nancy	317057	1755-01-01	1755-12-31			[]	[]
349		"Troupe italienne (Giuseppe Bianchi, Tiberio Fiorilli)"	317481	1639-01-01	1639-12-31	1648-01-01	1648-12-31	[]	[]
350		Troupe de Giuseppe Tortoriti (dit Pasquariel)	317579	1697-01-01	1697-12-31			[]	[]
351		Opéra de Marseille (Académie Royale de Musique en Provence)	317720	1685-01-01	1685-12-31			[]	[]
352		"Accesi (Comédiens Italiens du duc de Mantoue, sous la direction de Drusian Martinelli)"	317769	1500-01-01	1599-12-31	1600-01-01	1699-12-31	[]	[]
353		Gelosi (Francesco & Isabella Andreini)	317779					[]	[]
354		"Accesi (Comédiens Italiens du duc de Mantoue, sous la direction de Cecchini dit Fridelin)"	317793					[]	[]
355		Concert spirituel	317886	1725-01-01	1725-12-31	1790-01-01	1790-12-31	[]	[]
356		Concert de la reine	317887					[]	[]
357		Société d’amateurs	318291					[]	[]
358		Théâtre du Marais (nouveau)	318353	1791-08-01	1791-08-31			[]	[]
359		Théâtre de Monsieur (Théâtre Feydeau)	318370	1789-01-26	1789-01-26			[]	[]
360		Petits Comédiens du Palais Royal (Théâtre des enfants du sieur Moreau)	318403	1791-02-28	1791-02-28			[]	[]
361		Théâtre Molière	318422	1791-06-11	1791-06-11			[]	[]
362		Théâtre de la rue de Louvois	318424	1791-08-16	1791-08-16			[]	[]
363		Chapelle royale	318432	1600-01-01	1699-12-31			[]	[]
364		Chambre du Roi	318441					[]	[]
365		Théâtre de Strasbourg	318509					[]	[]
366		Théâtre de Toulouse	318511					[]	[]
367		Troupe du prince de Conti	318939					[]	[]
368		Troupe du duc de Grammont	318941					[]	[]
369		Théâtre de Rouen	319384					[]	[]
370		Théâtre de Nantes	319386					[]	[]
371		Théâtre de Besançon	319543					[]	[]
372		Théâtre du Vaudeville	319546	1792-01-12	1792-01-12			[]	[]
373		Versailles	319718					[]	[]
374		Théâtre de la rue Eau-de-Robec	319791	1775-01-01	1775-12-31	1775-01-01	1775-12-31	[]	[]
375		Société libre de déclamation et des arts	319853	1796-01-01	1796-12-31			[]	[]
376		Ecole dramatique et des arts	319873	1799-11-01	1799-11-30	1800-01-01	1899-12-31	[]	[]
377		Troupe espagnole de Pedro Valdès	320348					[]	[]
378		Biancolelli et Paghetti (Les Italiens de Lyon)	321218	1710-01-01	1710-12-31	1710-01-01	1719-12-31	[]	[]
379		Théâtre de la Nation (Française)	321244					[]	[]
380		Grand Théâtre	321286					[]	[]
381		Troupe de La Noue (théâtre de Rouen)	322159	1730-01-01	1739-12-31			[]	[]
382		Théâtre National de l’Opéra Comique	322369	1793-01-01	1793-12-31			[]	[]
383		Théâtre des Petits Cabinets (Petits-Appartements)	322452	1747-01-01	1747-12-31			[]	[]
384		Théâtre de Bruxelles	324839					[]	[]
385		Théâtre de la rue Popincourt	324841					[]	[]
386		Théâtre de Dijon	325120					[]	[]
387		Théâtre de Lyon	325122					[]	[]
388		Troupe de Mathieu Rubé	325467	1601-04-11	1601-04-11	1601-12-25	1601-12-25	[]	[]
389		Troupe de R. Guérin (dit Gros-Guillaume) (première troupe)	325473	1600-04-07	1600-04-07	1600-07-31	1600-07-31	[]	[]
390		Troupe de R. Guérin (dit Gros-Guillaume) (troisième troupe)	325478	1602-03-18	1602-03-18			[]	[]
391		Antoine Girard & Formicha Provai	325547	1602-04-02	1602-04-02			[]	[]
392		Troupe de Du Mortier	325578	1602-11-27	1602-11-27			[]	[]
393		Troupe italienne de Rize	325629					[]	[]
394		"Troupe franco-italienne de Rize, Donatti et Valleran Le Conte"	325632	1600-02-25	1600-02-25			[]	[]
395		Troupe italienne (Angela Maloni et ses camarades)	325736					[]	[]
396		Troupe italienne d’Alfieri	325765					[]	[]
397		Troupe de La Fortune (Jean Gassot)	325795	1608-01-01	1608-12-31			[]	[]
398		Troupe de Georges Buffequin	325800	1608-01-01	1608-12-31			[]	[]
399		Troupes associées de Jean Gassot et de Georges Buffequin	325813	1608-12-24	1608-12-24			[]	[]
400		"Troupe de Valleran, Léonard d’Alambourg, Claude Husson"	326595	1615-10-22	1615-10-22			[]	[]
401		Fideli	326643					[]	[]
402		Comédiens du Duc de Vendôme (César de Bourbon)	326680					[]	[]
403		Troupe foraine de Biancolelli (Dominique)	327046	1700-01-01	1799-12-31	1717-09-01	1717-09-30	[]	[]
404		Théâtre du Mont-Parnasse	327069	1791-07-10	1791-07-10			[]	[]
405		Théâtre d’Emulation	327070					[]	[]
406		Théâtre des élèves de Thalie	327192	1792-01-22	1792-01-22	1792-03-01	1792-03-31	[]	[]
407		Troupe d’équitation de Franconi	327219					[]	[]
408		Saint-Cyr	327300					[]	[]
409		"Troupe Molé-Dalainville (salle de l’Hôtel de ville, Toulouse)"	327438	1779-01-01	1779-12-31	1790-01-01	1799-12-31	[]	[]
410		"Troupe Prin (salle de l’Hôtel de ville, Toulouse)"	327509	1755-01-01	1755-12-31	1758-01-01	1758-12-31	[]	[]
411		Jassinte (Hyacinthe ou Jacinthe)	329422	1730-04-29	1730-04-29	1731-01-28	1731-01-28	[]	[]
412		Jeunes Messieurs Canadiens	331677	1780-01-01	1780-12-31	1817-01-01	1817-12-31	[]	[]
413		Petits Comédiens du Bois de Boulogne	331730					[]	[]
414		Nouvelle troupe comique du Mont-Parnasse	331735					[]	[]
415		Société de la duchesse du Maine	331748					[]	[]
416		Compagnie anglaise de Samuel Speede (troupe du prince de Galles?)	332994					[]	[]
417		Troupe de Quesnot de la Chenée	333103					[]	[]
418		Troupe de Fosse	333213	1630-01-01	1639-12-31			[]	[]
419		Troupe espagnole de la Reine Marie-Thérèse	333584					[]	[]
420		Troupe de Nanteuil	333705	1697-02-06	1697-02-06	1698-01-01	1698-12-31	[]	[]
421		Troupe de Suzanne Lamy et Marie Des Rosiers	333723	1700-01-01	1799-12-31			[]	[]
422		Troupe de Saint-Farre	333738	1700-01-01	1799-12-31			[]	[]
423		Troupe de Morin et Choudier	333741					[]	[]
424		Troupe de Nanteuil	333764	1685-02-13	1685-02-13	1686-01-01	1686-12-31	[]	[]
425		Troupe de Dumont	333808	1766-01-01	1766-12-31			[]	[]
426		Une troupe à Agen	333863	1773-01-01	1773-12-31			[]	[]
427		"Troupe espagnole (Nancy, 1605)"	333874	1600-01-01	1609-12-31			[]	[]
428		Ecole dramatique française	334368	1783-01-01	1783-12-31			[]	[]
429		Comédie Italienne	335747	1653-08-10	1653-08-10	1659-01-01	1659-12-31	[]	[]
430		Concert des amateurs (Paris)	336163	1769-01-01	1769-12-31	1781-01-01	1781-01-31	[]	[]
431		Théâtre de Marseille	336202					[]	[]
432		La Grande Ecurie	336741					[]	[]
433		Troupe de C. Denis	337032	1715-01-01	1715-12-31	1722-01-01	1722-12-31	[]	[]
434		Comte de Clermont	337168					[]	[]
435		Grande Troupe Turque	337407					[]	[]
436		24 Violons du roi	337442	1600-01-01	1699-12-31	1761-01-01	1761-12-31	[]	[]
437		Les Petits Violons (Violons du Cabinet)	337444	1600-01-01	1699-12-31	1715-01-01	1715-12-31	[]	[]
438		Opéra de Montpellier	337514					[]	[]
439		Opéra de Marianne Dujardin	338501	1718-01-01	1718-12-31			[]	[]
440		"Troupe de François III, duc de Lorraine"	338510					[]	[]
441		Théâtre de La Rochelle	338591	1740-01-01	1749-12-31			[]	[]
442		Troupe de la Dame Nogarède	338595					[]	[]
443		Théâtre de Nîmes	338639					[]	[]
444		Lycée des Arts	338684					[]	[]
445		"Grand-Théâtre de Bordeaux (Théâtre de la République, Théâtre de la Révolution)"	338686	1780-04-07	1780-04-07			[]	[]
446		"Théâtre-Mayeur (Théâtre de la Montagne, Théâtre des Sans-Culottes)"	338691	1793-12-01	1793-12-31			[]	[]
447		Troupe de Marsan	338747					[]	[]
448		Troupe de N.-V. Grenier	338750	1774-01-01	1774-12-31			[]	[]
449		Troupe de Gallier de Saint-Gérand	338753					[]	[]
450		Nicetty	338760					[]	[]
451		Roqueville et Camelly	338769	1778-11-01	1778-11-30			[]	[]
452		René Desplace	338774					[]	[]
453		Valmont	338776					[]	[]
454		Saint-Aubin	338790	1784-01-01	1784-12-31			[]	[]
455		Desroches	338852	1785-01-01	1785-12-31			[]	[]
456		Moyseau	338855	1785-01-01	1785-12-31			[]	[]
457		Mlle de Fontenay la cadette	338859					[]	[]
458		Floricourt et Dufresny	338882					[]	[]
459		"Académie des Beaux Arts, Lyon"	338916	1714-01-01	1714-12-31			[]	[]
460		Concerts des Amateurs (Strasbourg)	338970	1781-01-01	1781-12-31			[]	[]
461		Académie de Concerts (Marseille)	338972	1717-01-01	1717-12-31			[]	[]
462		Opéra de Lille	338994					[]	[]
463		Académie de Musique (Nantes)	338997	1727-01-01	1727-12-31			[]	[]
464		Sieur d’Aumont	338998	1687-01-01	1687-12-31			[]	[]
465		Opéra d’Avignon	339012	1705-01-01	1705-12-31			[]	[]
466		Bultos et Adam	339066					[]	[]
467		Opéra de François Hébrard	339081					[]	[]
468		Padouanello	339084					[]	[]
469		Les frères Borsary	339181					[]	[]
470		Troupe de Le Breton	339188					[]	[]
471		Saint-Léger	339192					[]	[]
472		Troupe du roi de Naples	339197					[]	[]
473		François Maffei	339207	1758-01-01	1758-12-31			[]	[]
474		Hénique et Volange	339211					[]	[]
475		Barbarin	339241			1720-01-01	1720-12-31	[]	[]
476		Barizon	339247			1764-01-01	1764-12-31	[]	[]
477		Barny	339251			1759-01-01	1759-12-31	[]	[]
478		Papavoine	339259	1785-04-04	1785-04-04	1786-10-20	1786-10-20	[]	[]
479		Perrodon	339273	1730-01-01	1739-12-31			[]	[]
480		Raparlier	339290	1771-01-01	1771-12-31	1776-01-01	1776-12-31	[]	[]
481		Denis-Alexis Menier	339321	1788-01-01	1788-12-31			[]	[]
482		Comédiens Français	339333	1772-03-01	1772-03-31			[]	[]
483		Briolé	339417			1699-10-01	1699-10-31	[]	[]
484		Bruyet	339423	1787-01-01	1787-12-31			[]	[]
485		Rosimond et Brisson	339426	1764-01-01	1764-12-31			[]	[]
486		Pierre Bret	339438	1713-01-01	1713-12-31			[]	[]
487		Antoine Barrié dit Fonpré	339473	1720-01-01	1729-12-31	1730-01-01	1739-12-31	[]	[]
488		Théâtre de Metz	339501					[]	[]
489		Troupe de La Bassière	339506	1773-01-01	1773-12-31			[]	[]
490		Rochard	339819	1764-04-01	1764-04-30			[]	[]
491		Jean-Benoît Leclair	340153	1748-01-01	1748-12-31	1759-01-01	1759-12-31	[]	[]
492		Théâtre des Amis de la Patrie	340265					[]	[]
493		Théâtre du Capitole (Toulouse)	340289					[]	[]
494		Comédiens français et italiens	340345	1779-01-01	1779-12-31	1784-01-01	1784-12-31	[]	[]
495		Troupe de Devals	341644					[]	[]
496		Casimir	341717					[]	[]
497		Durancy	341725					[]	[]
498		Chalaize	341778	1766-01-01	1766-12-31	1767-01-01	1767-12-31	[]	[]
499		Chabestan	341781					[]	[]
500		Chevillard	341796	1769-01-01	1769-12-31	1779-01-01	1779-12-31	[]	[]
501		Théâtre de Caen	341808	1760-01-01	1769-12-31			[]	[]
502		Comédiens (Opéra) à la suite de la Cour (Théâtre de Caen)	341925					[]	[]
503		Saint-Pétersbourg	341978					[]	[]
504		Grossart	341981					[]	[]
505		Desroziers	341985					[]	[]
506		Denis Sénepart	341990					[]	[]
507		Dorbigny et Poisson	342008	1770-01-01	1779-12-31	1780-01-01	1789-12-31	[]	[]
508		Troupe de la Marine (Brest)	342023					[]	[]
509		Blainville et Saint-Treuze	342028	1771-05-01	1771-05-31	1773-01-01	1773-12-31	[]	[]
510		Bernardy	342076					[]	[]
511		"Berger de l’Ile, Bovier et Féronet"	342114	1731-01-01	1731-12-31			[]	[]
512		Laguillotière	342117					[]	[]
513		Joubert	342147	1780-01-01	1789-12-31			[]	[]
514		Dame Lacour	342261					[]	[]
515		Crécy	342352					[]	[]
516		Michel Cochois	342381	1714-01-01	1714-12-31			[]	[]
517		Julien Savin	342619					[]	[]
518		Sauvant et Cagne	342631					[]	[]
519		Cassel	342645					[]	[]
520		Surny	342679					[]	[]
521		Lefèvre et Pitrot	342682					[]	[]
522		Emilie et Belmont	342684					[]	[]
523		Tabary et Lebrun	342714					[]	[]
524		Dalainville et Brochard	342716					[]	[]
525		Mlle de Clèves (Mme de Clève)	342731					[]	[]
526		Société française dramatique et lyrique	342904	1794-12-17	1794-12-17			[]	[]
527		Lages	343124					[]	[]
528		Oberni	343129					[]	[]
529		Galler	343135	1796-01-01	1796-12-31			[]	[]
530		Beck	343165					[]	[]
531		Dechaumont et Rochefort	343397	1774-01-01	1774-12-31			[]	[]
532		Degage	343414					[]	[]
533		Hébert de Bruneval (Comédie française et italienne)	343419					[]	[]
534		Louis Millerand	343479			1787-01-01	1787-12-31	[]	[]
535		Fresquet de Monglat	343482			1722-01-01	1722-12-31	[]	[]
536		Renaud et Monmercy	343485					[]	[]
537		Rocqueville et Montral	343785	1765-01-01	1765-12-31			[]	[]
538		Sérancour et Drouet	343831					[]	[]
539		Laval et Simianne	343836					[]	[]
540		Courcelles et Sens	343849					[]	[]
541		Sebastiani	343866					[]	[]
542		Sénepart et Desmarets	343873	1773-01-01	1773-12-31			[]	[]
543		"Derozet, Roqueville, Blache et Séguin"	343877	1769-01-01	1769-12-31			[]	[]
544		Fierville	343884					[]	[]
545		Blanchard et Legros	343889	1789-01-01	1789-12-31			[]	[]
546		Blin	343895	1698-01-01	1698-12-31	1699-01-01	1699-12-31	[]	[]
547		Hamon	343934	1768-01-01	1768-12-31	1770-01-01	1779-12-31	[]	[]
548		Lavoy	343939					[]	[]
549		Desbrieux (dit Clairainval et Bordery)	343942					[]	[]
550		Jean Chavart	343947	1733-01-01	1733-12-31			[]	[]
551		Cherrier	343956	1699-01-01	1699-12-31			[]	[]
552		Clainville	343971	1783-01-01	1783-12-31	1788-01-01	1788-12-31	[]	[]
553		Clairançon et Dupuis	343974	1784-01-01	1784-12-31	1786-01-01	1786-12-31	[]	[]
554		Audinot (Versailles)	344195	1767-01-01	1767-12-31	1768-01-01	1768-12-31	[]	[]
555		Troupe Etrangère des Danseurs de Corde	352123					[]	[]
556		Troupe de Christophe Contugi (dit L’Orviétan)	354631	1600-01-01	1699-12-31	1600-01-01	1699-12-31	[]	[]
557		Blaches	392544	1700-01-01	1799-12-31	1700-01-01	1799-12-31	[]	[]
558		Creci	392546	1700-01-01	1799-12-31	1700-01-01	1799-12-31	[]	[]
559		Comédiens-Sociétaires de l’Odéon	414155					[]	[]
560		Massey	438066					[]	[]
