﻿id	name	original_id	authorities	sources
1	M.	1	[]	[]
2	Mlle	2	[]	[]
3	signore	3	[]	[]
4	Mme	4	[]	[]
5	baron	5	[]	[]
6	sieur	6	[]	[]
7	marquis	7	[]	[]
8	impératrice	8	[]	[]
9	comte	9	[]	[]
10	chevalier	10	[]	[]
11	princesse	11	[]	[]
12	citoyen	12	[]	[]
13	duc	13	[]	[]
14	comtesse	14	[]	[]
15	prince	15	[]	[]
16	marquise	16	[]	[]
17	abbé	17	[]	[]
18	père	18	[]	[]
19	Lady	19	[]	[]
20	reine	20	[]	[]
21	Mrs	21	[]	[]
22	vicomte	22	[]	[]
23	dame	23	[]	[]
24	Monsieur	24	[]	[]
25	Mr	25	[]	[]
26	capitaine	26	[]	[]
27	citoyenne	27	[]	[]
28	commandant	28	[]	[]
29	dom	29	[]	[]
30	Dr	30	[]	[]
31	duchesse	31	[]	[]
32	frère	32	[]	[]
33	Herr	33	[]	[]
34	maréchal	34	[]	[]
35	Monseigneur	35	[]	[]
36	président	36	[]	[]
37	Revd	37	[]	[]
38	seigneur	38	[]	[]
39	señor	39	[]	[]
