﻿location_id	location_type_id
1	26
2	24
3	26
4	11
5	24
6	24
7	24
8	26
9	26
10	26
11	12
12	26
13	26
14	12
15	22
16	11
17	11
18	11
19	24
20	22
21	11
22	11
23	22
24	12
25	14
26	11
27	26
28	11
29	11
30	12
31	9
31	11
31	15
32	26
33	11
34	12
35	12
36	11
37	24
38	26
39	12
40	11
41	8
42	12
43	12
44	12
45	12
46	12
47	12
48	12
49	12
50	12
51	12
52	26
53	15
54	9
54	13
55	24
56	11
57	13
58	24
59	12
60	9
60	13
61	11
62	12
63	11
63	24
64	11
65	11
66	11
67	11
68	11
69	11
70	11
71	12
72	26
73	11
74	12
75	24
76	24
77	12
78	11
79	12
80	24
81	12
82	12
83	12
84	12
85	12
86	12
87	12
88	12
89	12
90	12
91	12
92	24
93	12
94	12
95	12
96	12
97	12
98	12
99	12
100	12
100	24
101	24
102	12
103	12
104	12
105	12
106	12
107	12
108	12
109	11
110	24
111	12
112	12
113	12
114	12
115	12
116	12
117	12
118	24
119	12
119	24
120	12
121	12
122	12
123	12
124	12
125	12
126	26
127	12
128	24
129	12
130	24
131	12
132	12
133	12
133	24
134	12
135	12
136	12
137	12
138	24
139	12
139	24
140	12
141	26
142	24
143	12
144	12
145	24
146	12
147	12
148	12
149	12
150	12
151	24
152	12
153	24
154	12
155	12
156	12
157	24
158	12
159	12
160	12
161	24
162	26
163	12
164	12
165	12
166	12
167	12
168	12
169	12
170	12
171	12
172	12
173	12
174	12
175	12
176	12
177	12
178	24
179	12
180	24
181	12
182	24
183	12
184	12
185	12
186	12
187	12
188	12
189	12
190	12
191	24
192	12
193	12
194	12
195	12
196	12
197	12
198	12
199	12
200	12
201	12
202	12
203	12
204	12
205	12
206	12
207	12
208	12
209	12
210	12
211	12
212	12
213	12
214	12
215	12
216	12
217	12
218	9
219	12
220	12
221	12
222	12
223	12
224	12
225	12
226	12
227	12
228	12
229	22
230	22
231	12
232	22
233	22
234	12
235	12
236	12
237	12
238	12
239	12
240	12
241	12
242	12
243	12
244	12
245	12
246	12
247	12
248	12
249	12
250	12
251	12
252	12
253	12
254	12
255	12
256	12
257	12
258	12
259	12
260	12
261	12
262	12
263	12
264	12
265	12
266	12
267	12
268	12
269	12
270	12
271	12
272	12
273	12
274	12
275	12
276	12
277	12
278	12
279	24
280	24
281	12
282	11
283	12
284	12
285	12
286	12
287	12
288	12
289	9
289	11
290	12
291	12
292	12
293	12
294	12
295	12
296	11
297	15
298	26
299	11
300	24
301	11
302	12
303	22
304	22
305	22
306	22
307	22
308	22
309	22
310	22
311	22
312	22
313	22
314	22
315	22
316	22
317	22
318	22
319	22
320	22
321	22
322	22
323	22
324	22
325	22
326	22
327	22
328	22
329	22
330	22
331	22
332	22
333	22
334	22
335	22
336	22
337	22
338	22
339	22
340	22
341	22
342	22
343	22
344	22
345	22
346	22
347	22
348	22
349	22
350	22
351	22
352	22
353	22
354	22
355	22
356	22
357	22
358	22
359	22
360	22
361	22
362	22
363	22
364	22
365	22
366	22
367	22
368	22
369	22
370	22
371	22
372	22
373	22
374	22
375	22
376	22
377	22
378	22
379	22
380	22
381	22
382	22
383	22
384	22
385	22
386	22
387	22
388	22
389	22
390	22
391	22
392	22
393	22
394	22
395	22
396	22
397	22
398	22
399	22
400	22
401	22
402	22
403	22
404	22
405	22
406	22
407	22
408	22
409	22
410	22
411	22
412	22
413	22
414	22
415	22
416	22
417	22
418	22
419	22
420	22
421	22
422	22
423	22
424	22
425	22
426	22
427	22
428	22
429	22
430	22
431	22
432	22
433	22
434	22
435	22
436	22
437	22
438	22
439	22
440	22
441	22
442	22
443	22
444	22
445	22
446	22
447	22
448	22
449	22
450	22
451	22
452	11
453	11
454	8
454	11
455	11
456	11
457	11
458	11
459	11
460	11
461	11
462	26
463	26
464	11
465	12
466	12
467	24
468	24
469	24
470	24
471	24
472	12
473	11
474	12
475	10
475	13
476	11
477	11
478	15
479	11
480	26
481	12
482	11
483	26
484	26
485	22
486	26
487	11
488	26
489	12
490	12
491	12
492	12
493	26
494	12
495	26
496	12
497	12
498	13
499	13
500	10
501	10
502	10
502	13
503	12
504	12
505	11
506	11
507	11
508	12
509	12
510	12
511	8
512	10
512	13
513	14
514	14
515	14
516	14
517	11
518	11
519	11
520	11
521	11
522	11
523	11
524	8
525	8
526	11
526	24
527	8
528	11
528	24
529	11
530	12
531	26
532	26
533	12
534	12
535	12
536	12
537	12
538	12
539	26
540	12
541	12
542	12
543	12
544	12
545	12
546	8
546	12
547	12
548	12
549	26
550	12
551	12
552	12
553	12
554	12
555	12
556	12
557	12
558	12
559	12
560	12
561	12
562	12
563	12
564	12
565	12
566	12
567	8
568	8
569	11
570	8
571	8
571	11
572	8
573	8
574	8
575	12
576	11
577	11
578	12
579	11
580	12
581	12
582	12
583	12
584	12
585	12
586	12
587	26
588	12
589	15
590	26
591	10
592	14
593	14
594	14
595	14
596	14
597	14
598	14
599	14
600	14
601	14
602	14
603	14
604	14
605	14
606	14
607	14
608	14
609	14
610	14
611	10
611	14
612	14
613	14
614	10
614	14
615	14
616	14
617	14
618	14
619	14
620	14
621	10
621	14
622	14
623	14
624	14
625	14
626	14
627	14
628	14
629	14
630	14
631	14
632	14
633	14
634	10
634	14
635	14
636	14
637	14
638	14
639	14
640	14
641	14
642	14
643	14
644	14
645	14
646	14
647	14
648	14
649	14
650	14
651	14
652	14
653	14
654	14
655	14
656	14
657	14
658	14
659	14
660	14
661	10
661	14
662	14
663	14
664	14
665	14
666	14
667	14
668	14
669	14
670	10
670	13
671	10
672	13
673	11
674	12
675	12
676	12
677	11
678	11
679	11
680	11
681	12
682	10
682	13
683	12
684	12
685	24
686	12
687	15
688	26
689	11
689	12
690	11
691	11
692	10
692	13
693	10
693	13
694	10
695	10
695	13
696	10
696	13
697	10
697	13
698	10
698	13
699	10
699	13
700	10
700	13
701	10
701	13
702	10
702	13
703	10
703	13
704	10
704	13
705	13
705	14
706	10
706	13
707	10
707	13
708	10
708	13
709	10
709	13
710	10
710	13
711	10
711	13
712	10
712	13
713	10
713	13
714	10
714	13
715	10
716	10
716	13
717	10
717	13
718	10
718	13
719	10
720	12
721	12
722	11
723	11
724	11
725	11
726	8
727	11
728	12
729	22
730	12
731	12
732	12
733	8
734	8
735	8
736	8
737	12
738	12
739	12
740	12
741	12
742	8
743	26
744	26
745	12
746	8
747	12
748	11
749	12
750	12
751	12
752	11
753	12
754	12
755	22
756	12
757	12
758	11
759	12
760	11
761	11
762	11
763	11
764	11
765	12
766	11
767	11
768	11
769	11
770	11
771	11
772	11
773	11
774	11
775	11
776	11
777	11
778	11
779	24
780	12
781	24
782	11
783	12
784	24
785	26
786	24
787	11
788	11
789	26
790	11
790	24
791	12
792	26
793	22
794	14
795	10
795	13
796	11
797	11
798	24
799	24
800	12
801	12
802	12
803	24
804	26
805	8
806	11
807	13
808	26
809	11
810	12
811	13
812	11
813	22
814	22
815	13
816	11
816	12
817	12
818	12
819	15
820	11
821	12
822	11
823	12
824	26
825	12
826	11
827	24
828	22
829	24
830	12
831	12
832	12
833	11
834	8
835	26
836	8
836	11
837	12
838	11
839	11
840	8
841	8
841	11
842	11
843	11
844	11
844	12
845	9
845	11
846	12
847	11
848	26
849	8
850	11
851	26
852	8
852	11
853	24
854	26
855	11
856	11
857	12
858	10
859	9
860	11
861	9
861	13
862	12
863	12
864	11
865	11
866	22
867	22
868	22
869	11
870	12
871	12
872	12
873	12
874	9
874	11
875	11
876	11
877	12
878	11
879	12
880	12
881	11
882	26
883	11
884	11
885	11
886	11
887	11
888	11
889	8
890	9
890	11
891	12
892	11
893	11
894	11
894	12
895	10
895	13
896	10
896	13
897	11
898	12
899	12
900	11
901	11
902	11
903	11
904	11
905	11
906	12
907	11
908	11
909	11
910	11
911	12
912	11
913	11
914	11
915	10
915	13
916	11
917	11
918	11
919	12
920	12
921	11
922	26
923	9
923	11
924	11
925	11
926	26
927	11
928	11
929	11
930	11
931	12
932	11
933	11
934	10
934	13
935	11
936	11
937	12
938	11
939	11
940	11
940	14
941	9
941	11
942	11
943	24
944	26
945	11
946	26
947	11
948	11
949	26
950	12
951	11
952	11
953	11
954	12
954	24
955	11
956	11
957	26
958	11
959	12
960	10
960	13
961	11
962	11
963	12
964	12
965	11
966	26
967	26
968	12
969	11
970	11
971	26
972	11
973	10
973	11
974	11
975	9
975	10
975	11
976	11
977	11
978	26
979	12
980	11
981	12
982	10
982	13
983	12
984	10
984	13
985	11
986	11
987	10
988	11
989	11
990	11
991	11
992	11
993	11
994	9
994	11
995	11
996	10
996	13
997	12
998	11
999	11
1000	11
1001	11
1002	11
1003	11
1004	11
1005	12
1006	11
1007	12
1008	11
1009	11
1010	11
1011	11
1012	24
1013	11
1014	11
1015	11
1016	11
1017	9
1017	11
1018	11
1019	9
1019	11
1020	11
1021	9
1021	11
1022	10
1022	13
1023	9
1023	11
1024	11
1025	26
1026	9
1026	11
1027	11
1028	9
1028	11
1029	26
1030	10
1030	13
1031	11
1032	11
1033	9
1033	11
1034	9
1034	10
1034	11
1035	9
1035	11
1036	26
1037	11
1038	9
1038	11
1039	11
1040	10
1041	26
1042	24
1043	11
1044	9
1044	10
1044	13
1045	11
1046	24
1047	11
1048	11
1049	11
1050	11
1051	11
1052	11
1053	10
1053	13
1054	9
1054	11
1055	26
1056	26
1057	11
1058	12
1059	11
1060	12
1061	11
1062	12
1063	11
1064	10
1064	13
1065	12
1066	26
1067	11
1068	11
1069	11
1070	11
1071	11
1071	12
1072	10
1072	11
1073	10
1073	13
1074	11
1075	11
1076	12
1077	11
1078	11
1079	11
1080	11
1081	11
1082	11
1083	11
1084	11
1085	11
1086	11
1087	11
1088	11
1089	26
1090	11
1091	9
1091	11
1092	8
1093	11
1094	26
1095	9
1095	11
1096	11
1097	26
1098	11
1099	12
1100	26
1101	11
1102	24
1103	11
1104	11
1105	11
1106	11
1107	12
1108	11
1109	12
1110	26
1111	11
1112	24
1113	12
1114	12
1115	9
1115	13
1116	15
1117	15
1118	11
1119	11
1120	26
1121	12
1122	11
1123	12
1124	11
1125	11
1126	12
1127	29
1128	29
1129	29
1130	29
1131	29
1132	29
1133	29
1134	29
1135	29
1136	29
1137	29
1138	29
1139	29
1140	29
1141	29
1142	29
1143	29
1144	29
1145	29
1146	29
1147	29
1148	29
1149	28
1150	28
1151	28
1152	28
1153	28
1154	28
1155	28
1156	28
1157	28
1158	28
1159	28
1160	28
1161	28
1162	28
1163	28
1164	28
1165	28
1166	28
1167	30
1168	28
1169	28
1170	28
1171	28
1172	28
1173	28
1174	28
1175	28
1176	28
1177	28
1178	28
1179	28
1180	28
1181	28
1182	28
1183	28
1184	28
1185	28
1186	28
1187	28
1188	28
1189	28
1190	28
1191	28
1192	28
1193	28
1194	28
1195	28
1196	28
1197	28
1198	28
1199	28
1200	28
1201	28
1202	28
1203	28
1204	28
1205	28
1206	28
1207	28
1208	28
1209	28
1210	28
1211	28
1212	28
1213	28
1214	28
1215	28
1216	28
1217	28
1218	28
1219	28
1220	28
1221	28
1222	28
1223	28
1224	28
1225	28
1226	28
1227	28
1228	28
1229	28
1230	28
1231	28
1232	28
1233	28
1234	28
1235	28
1236	28
1237	28
1238	28
1239	28
1240	28
1241	28
1242	28
1243	28
1244	28
1245	28
1246	28
1247	28
1248	28
1249	28
1250	28
1251	28
1252	28
1253	28
1254	28
1255	28
1256	28
1257	28
1258	28
1259	28
1260	28
1261	28
1262	28
1263	28
1264	28
1265	28
1266	28
1267	28
1268	28
1269	28
1270	28
1271	28
1272	28
1273	28
1274	28
1275	28
1276	28
1277	28
1278	28
1279	28
1280	28
1281	28
1282	28
1283	28
1284	28
1285	28
1286	28
1287	28
1288	28
1289	28
1290	28
1291	28
1292	28
1293	28
1294	28
1295	28
1296	28
1297	28
1298	28
1299	28
1300	28
1301	28
1302	28
1303	28
1304	28
1305	28
1306	28
1307	28
1308	28
1309	28
1310	28
1311	28
1312	28
1313	28
1314	28
1315	28
1316	28
1317	28
1318	28
1319	28
1320	28
1321	28
1322	28
1323	28
1324	28
1325	28
1326	28
1327	28
1328	28
1329	28
1330	28
1331	28
1332	28
1333	28
1334	28
1335	28
1336	28
1337	28
1338	28
1339	28
1340	28
1341	28
1342	28
1343	28
1344	28
1345	28
1346	28
1347	28
1348	28
1349	28
1350	28
1351	28
1352	28
1353	28
1354	28
1355	28
1356	28
1357	28
1358	28
1359	28
1360	28
1361	28
1362	28
1363	28
1364	28
1365	28
1366	28
1367	28
1368	28
1369	28
1370	28
1371	28
1372	28
1373	28
1374	28
1375	28
1376	28
1377	28
1378	28
1379	28
1380	28
1381	30
1382	28
1383	28
1384	28
1385	28
1386	28
1387	28
1388	28
1389	28
1390	28
1391	28
1392	28
1393	28
1394	28
1395	28
1396	28
1397	28
1398	28
1399	28
1400	28
1401	28
1402	28
1403	28
1404	28
1405	28
1406	28
1407	28
1408	28
1409	28
1410	28
1411	28
1412	28
1413	28
1414	28
1415	28
1416	28
1417	28
1418	28
1419	28
1420	28
1421	28
1422	28
1423	28
1424	28
1425	28
1426	28
1427	28
1428	28
1429	28
1430	28
1431	28
1432	28
1433	28
1434	28
1435	28
1436	28
1437	28
1438	28
1439	28
1440	28
1441	28
1442	28
1443	28
1444	28
1445	28
1446	28
1447	28
1448	28
1449	28
1450	28
1451	28
1452	28
1453	28
1454	28
1455	28
1456	28
1457	28
1458	28
1459	28
1460	28
1461	28
1462	28
1463	28
1464	28
1465	28
1466	28
1467	28
1468	28
1469	28
1470	28
1471	28
1472	28
1473	28
1474	28
1475	28
1476	28
1477	28
1478	28
1479	28
1480	28
1481	28
1482	28
1483	28
1484	28
1485	28
1486	28
1487	28
1488	28
1489	28
1490	28
1491	28
1492	28
1493	28
1494	28
1495	28
1496	28
1497	28
1498	28
1499	28
1500	28
1501	28
1502	28
1503	28
1504	28
1505	28
1506	28
1507	28
1508	28
1509	28
1510	28
1511	28
1512	28
1513	28
1514	28
1515	28
1516	28
1517	28
1518	28
1519	28
1520	28
1521	28
1522	28
1523	28
1524	28
1525	28
1526	28
1527	28
1528	28
1529	28
1530	28
1531	28
1532	28
1533	28
1534	28
1535	28
1536	28
1537	28
1538	28
1539	28
1540	28
1541	28
1542	28
1543	28
1544	28
1545	28
1546	28
1547	28
1548	28
1549	28
1550	28
1551	28
1552	28
1553	28
1554	28
1555	28
1556	28
1557	28
1558	28
1559	28
1560	28
1561	28
1562	28
1563	28
1564	28
1565	28
1566	28
1567	28
1568	28
1569	28
1570	28
1571	28
1572	28
1573	28
1574	28
1575	28
1576	28
1577	28
1578	28
1579	28
1580	28
1581	28
1582	28
1583	28
1584	28
1585	28
1586	28
1587	28
1588	28
1589	28
1590	28
1591	28
1592	28
1593	28
1594	28
1595	28
1596	28
1597	28
1598	28
1599	28
1600	28
1601	28
1602	28
1603	28
1604	28
1605	28
1606	28
1607	28
1608	28
1609	28
1610	28
1611	28
1612	28
1613	28
1614	28
1615	28
1616	28
1617	28
1618	28
1619	28
1620	30
1621	30
1622	30
1623	30
1624	30
1625	28
1626	28
1627	28
1628	30
