[gd_scene load_steps=4 format=3 uid="uid://b2wviia7are8y"]

[ext_resource type="Script" path="res://black_hol.gd" id="1_b1idd"]
[ext_resource type="Texture2D" uid="uid://dlcwcymycq1no" path="res://black_hole.png" id="1_bekgn"]

[sub_resource type="CircleShape2D" id="CircleShape2D_cml43"]
radius = 442.408

[node name="BlackHol" type="Node2D"]
script = ExtResource("1_b1idd")

[node name="BlackHole" type="Sprite2D" parent="."]
z_index = -1
position = Vector2(0, 47)
texture = ExtResource("1_bekgn")

[node name="Area2D" type="Area2D" parent="."]

[node name="CollisionShape2D" type="CollisionShape2D" parent="Area2D"]
shape = SubResource("CircleShape2D_cml43")

[connection signal="body_entered" from="Area2D" to="." method="_on_area_2d_body_entered"]
