{
	"title": "Смена землепользователя для внутрихозяйственного карьера",
	"description": "Структура сообщения о смене землепользователя для внутрихозяйственного карьера",
	"type": "object",
	"properties": {
		"messageType": {
			"type": "string",
			"const": "v1/VHChangeUser.json"
		},
		"id": {
			"description": "Идентификатор внутрихозяйственного карьера",
			"type": "integer"
		},
		"user": {
			"description": "Данные по землепользователю",
			"type": "object",
			"properties": {
				"regCode": {
					"description": "Регистрационный код юрлица в ЕГР",
					"type": "integer",
                    "minimum": 100000000,
                    "maximum": 999999999
				}
			},
			"required": [
				"regCode"
			]
		},
		"changeDate": {
			"description": "Дата смены землепользователя",
			"type": "string",
			"format": "date"
		}
	},
	"required": [
		"messageType",
		"id",
		"user",
		"changeDate"
	]
}