{
	"$schema": "https://json-schema.org/draft/2020-12/schema",
	"$id": "https://lit-soft.by/nature/schemas/GOUndoExcludeBranch",
	"title": "Отмена исключения акта, удостоверяющего горный отвод, из государственного реестра горных отводов",
	"description": "Структура сообщения об отмене исключения акта, удостоверяющего горный отвод",
	"type": "object",
	"properties": {
		"messageType": {
			"type": "string",
			"const": "v1/GOUndoExcludeBranch.json"
		},
		"regInfo": {
			"description": "Регистрационные данные акта",
			"type": "object",
			"properties": {
				"regNum": {
					"description": "Регистрационный номер горного отвода в государственном реестре горных отводов",
					"type": "string"
				}
			},
			"required": [
				"regNum"
			]
		}
	},
	"required": [
		"messageType",
		"regInfo"
	]
}