{
    "$schema": "https://json-schema.org/draft/2020-12/schema",
    "$id": "https://lit-soft.by/nature/schemas/error",
    "title": "Ошибка в сообщении",
    "description": "Структура сообщения о возникце ошибке при валидации или обработке сообщения",
    "type": "object",
    "properties":
    {
        "messageId":
        {
            "description": "Идентификатор исходного сообщения = ссылка на сообщение в очереди изменений",
            "type": "integer"
        },
        "report":
        {
            "description": "Текст ошибок (валидации, БД и т.д.)",
            "type": "string"
        }
    },
    "required":
    [
        "messageId",
        "report"
    ]
}