{
	"title": "Рекультивация внутрихозяйственного карьера",
	"description": "Структура сообщения о рекультивации внутрихозяйственного карьера",
	"type": "object",
	"properties": {
		"messageType": {
			"type": "string",
			"const": "v1/VHRecultivate.json"
		},
		"id": {
			"description": "Идентификатор внутрихозяйственного карьера",
			"type": "integer"
		},
		"execComm": {
			"description": "Исполнительный и распорядительный орган, определяется кодом УНП из АПИ ЕГР",
			"type": "integer",
			"minimum": 100000000,
			"maximum": 999999999
		},
		"actDecision": {
			"description": "Информация о решении об утверждении акта приемки-передачи рекультивированных земель",
			"type": "object",
			"properties": {
				"decNumber": {
					"description": "Номер решения",
					"type": "string",
					"minLength": 1
				},
				"decDate": {
					"description": "Дата принятия решения",
					"type": "string",
					"format": "date"
				}
			},
			"required": [
				"decNumber",
				"decDate"
			]
		}
	},
	"required": [
		"messageType",
		"id",
		"execComm",
		"actDecision"
	]
}