{
  "name": "umami",
  "version": "1.38.0",
  "description": "A simple, fast, privacy-focused alternative to Google Analytics.",
  "author": "Mike Cao <mike@mikecao.com>",
  "license": "MIT",
  "homepage": "https://umami.is",
  "repository": {
    "type": "git",
    "url": "https://github.com/umami-software/umami.git"
  },
  "scripts": {
    "dev": "next dev",
    "build": "npm-run-all build-db check-db build-tracker build-geo build-app",
    "start": "next start",
    "build-docker": "npm-run-all build-db build-tracker build-geo build-app",
    "start-docker": "npm-run-all check-db update-tracker start-server",
    "start-env": "node scripts/start-env.js",
    "start-server": "node server.js",
    "build-app": "next build",
    "build-tracker": "rollup -c rollup.tracker.config.js",
    "build-db": "npm-run-all copy-db-files build-db-client",
    "build-lang": "npm-run-all format-lang compile-lang download-country-names download-language-names",
    "build-geo": "node scripts/build-geo.js",
    "build-db-schema": "prisma db pull",
    "build-db-client": "prisma generate",
    "update-tracker": "node scripts/update-tracker.js",
    "update-db": "prisma migrate deploy",
    "check-db": "node scripts/check-db.js",
    "copy-db-files": "node scripts/copy-db-files.js",
    "generate-lang": "npm-run-all extract-lang merge-lang",
    "extract-lang": "formatjs extract \"{pages,components}/**/*.js\" --out-file build/messages.json",
    "merge-lang": "node scripts/merge-lang.js",
    "format-lang": "node scripts/format-lang.js",
    "compile-lang": "formatjs compile-folder --ast build public/intl/messages",
    "check-lang": "node scripts/check-lang.js",
    "download-country-names": "node scripts/download-country-names.js",
    "download-language-names": "node scripts/download-language-names.js",
    "change-password": "node scripts/change-password.js",
    "lint": "next lint --quiet",
    "prepare": "node -e \"if (process.env.NODE_ENV !== 'production'){process.exit(1)} \" || husky install",
    "postbuild": "node scripts/postbuild.js"
  },
  "lint-staged": {
    "**/*.js": [
      "prettier --write",
      "eslint"
    ],
    "**/*.css": [
      "stylelint --fix",
      "prettier --write"
    ],
    "**/*.json": [
      "prettier --write"
    ]
  },
  "dependencies": {
    "@fontsource/inter": "",
    "@prisma/client": "",
    "chalk": "",
    "chart.js": "",
    "classnames": "",
    "clickhouse": "",
    "colord": "",
    "cors": "",
    "cross-spawn": "^",
    "date-fns": "",
    "date-fns-tz": "",
    "dateformat": "",
    "debug": "",
    "del": "",
    "detect-browser": "",
    "dotenv": "",
    "formik": "",
    "fs-extra": "",
    "immer": "",
    "ioredis": "",
    "ipaddr.js": "",
    "is-ci": "",
    "is-docker": "",
    "is-localhost-ip": "",
    "isbot": "",
    "kafkajs": "",
    "maxmind": "",
    "moment-timezone": "",
    "next": "",
    "next-basics": "",
    "node-fetch": "",
    "npm-run-all": "",
    "prop-types": ",
    "react": "",
    "react-beautiful-dnd": ",
    "react-dom": "",
    "react-intl": "",
    "react-simple-maps": "^2.3.0",
    "react-spring": "^9.4.4",
    "react-tooltip": "^4.2.21",
    "react-use-measure": "^2.0.4",
    "react-window": "^1.8.6",
    "request-ip": "^3.3.0",
    "semver": "^7.3.6",
    "thenby": "^1.3.4",
    "timezone-support": "^2.0.2",
    "uuid": "^8.3.2",
    "zustand": "^3.7.2"
  },
  "devDependencies": {
    "@formatjs/cli": "^4.2.29",
    "@rollup/plugin-buble": "^0.21.3",
    "@rollup/plugin-replace": "^4.0.0",
    "@svgr/webpack": "^6.2.1",
    "cross-env": "^7.0.3",
    "eslint": "^7.32.0",
    "eslint-config-next": "^12.2.4",
    "eslint-config-prettier": "^8.5.0",
    "eslint-import-resolver-alias": "^1.1.2",
    "eslint-plugin-import": "^2.26.0",
    "eslint-plugin-prettier": "^4.0.0",
    "extract-react-intl-messages": "^4.1.1",
    "husky": "^7.0.0",
    "lint-staged": "^11.0.0",
    "postcss": "^8.4.12",
    "postcss-flexbugs-fixes": "^5.0.2",
    "postcss-import": "^14.0.2",
    "postcss-preset-env": "7.4.3",
    "postcss-rtlcss": "^3.6.1",
    "prettier": "^2.6.2",
    "prisma": "4.3.1",
    "prompts": "2.4.2",
    "rollup": "^2.70.1",
    "rollup-plugin-terser": "^7.0.2",
    "stylelint": "^14.5.3",
    "stylelint-config-css-modules": "^4.1.0",
    "stylelint-config-prettier": "^9.0.3",
    "stylelint-config-recommended": "^7.0.0",
    "tar": "^6.1.2"
  },
  "cacheDirectories": [
    ".next/cache"
  ]
}
