<svg style="display: none">
    <symbol id="4rome" viewBox="0 0 29.75005 29.74997"><g id="Слой_2" data-name="Слой 2"><g id="Layer_1" data-name="Layer 1"><path class="cls-1" d="M16.81063.12237A14.879,14.879,0,1,0,29.62813,12.943,14.88552,14.88552,0,0,0,16.81063.12237Zm3.9091,23.1545h-2.251V21.649l-3.5283.0107a6.92867,6.92867,0,0,1-6.92289-6.918v-3.4956H6.38284V8.97017H10.29v5.7715a4.63578,4.63578,0,0,0,4.6358,4.6358h5.7939Zm.0439-8.2573h-2.2949v-3.7325h-3.9121V9.01317l6.209.002Z"/></g></g></symbol>
    <symbol id="arrow-bottom" viewBox="0 0 15.71599 8.75748"><g id="Слой_2" data-name="Слой 2"><g id="Layer_1" data-name="Layer 1"><polyline style="fill:none;stroke:#333;stroke-miterlimit:10;" points="15.358 0.349 7.859 8.041 0.358 0.349"/></g></g></symbol>
    <symbol id="arrow-down" viewBox="0 0 23 11" fill="none">
    <path d="M22.3107 0.744186L11.4999 10.2558L0.68911 0.744185" stroke-miterlimit="10" stroke-linecap="round" stroke-linejoin="round"/>
    </symbol>
    <symbol id="arrow-left" viewBox="0 0 13 20" fill="none"><g clip-path="url(#clip0)">
    <path d="M11.8228 19.021L2.06906 10.0699L11.8228 0.979039" stroke="#666666" stroke-miterlimit="10"/></g><defs><clipPath id="clip0"><rect width="12.8571" height="20" fill="white" transform="translate(12.8572 20) rotate(-180)"/></clipPath></defs></symbol>
    <symbol id="arrow-left" viewBox="0 0 8.75754 15.716"><g id="Слой_2" data-name="Слой 2"><g id="Layer_1" data-name="Layer 1"><polyline style="fill:none;stroke-miterlimit:10;" points="0.349 0.358 8.041 7.857 0.349 15.358"/></g></g></symbol>
    <symbol id="arrow-right" viewBox="0 0 8.75754 15.716"><g id="Слой_2" data-name="Слой 2"><g id="Layer_1" data-name="Layer 1"><polyline style="fill:none;stroke-miterlimit:10;" points="0.349 0.358 8.041 7.857 0.349 15.358"/></g></g></symbol>
    <symbol id="arrow-up" viewBox="0 0 15 9" fill="none"><g clip-path="url(#clip0)"><path d="M1.01351 7.95349L7.5 1.04651L13.9865 7.95349" stroke-miterlimit="10" stroke-linecap="round" stroke-linejoin="round"/></g></symbol>
    <symbol id="close" viewBox="0 0 15.70289 15.70289"><g id="Слой_2" data-name="Слой 2"><g id="Layer_1" data-name="Layer 1"><line style="fill:none; stroke-miterlimit:10;" x1="0.43945" y1="0.35145" x2="15.26216" y2="15.35145"/><line style="fill:none; stroke-miterlimit:10;" x1="0.35145" y1="15.26229" x2="15.35145" y2="0.43944"/></g></g></symbol>
    <symbol id="comment" viewBox="0 0 16 14.00758"><g id="Слой_2" data-name="Слой 2"><g id="Layer_1" data-name="Layer 1"><path style="fill:none;stroke-miterlimit:10;" d="M12.66541.5H3.33459A2.84293,2.84293,0,0,0,.5,3.33459V8.16516a2.84294,2.84294,0,0,0,2.83459,2.8346H7.55688l2.926,2.40374c.241.19788.45184.10511.46869-.20623l.1189-2.19751h1.59491A2.84294,2.84294,0,0,0,15.5,8.16516V3.33459A2.84293,2.84293,0,0,0,12.66541.5Z"/></g></g></symbol>
    <symbol id="done" viewBox="0 0 15.70711 10.5051"><g id="Слой_2" data-name="Слой 2"><g id="Layer_1" data-name="Layer 1"><polyline style="fill:none;stroke:#FF4B4B;stroke-miterlimit:10;" points="0.354 4.242 5.909 9.798 15.354 0.354"/></g></g></symbol>
    <symbol id="fb" viewBox="0 0 29.6718 29.6718"><g id="Слой_2" data-name="Слой 2"><g id="Layer_1" data-name="Layer 1"><path class="cls-1" d="M14.8359,0A14.8359,14.8359,0,1,0,29.6718,14.8359,14.83563,14.83563,0,0,0,14.8359,0Zm3.5146,10.2519H16.1201c-.2647,0-.5586.3467-.5586.8106v1.6113h2.789v2.2959h-2.789v6.8945H12.92871V14.9697H10.542V12.6738h2.38671V11.3222A3.31187,3.31187,0,0,1,16.1201,7.8086h2.2304Z"/></g></g></symbol>
    <symbol id="burger" fill="none" viewBox="0 0 18 13"><g><line y1="0.5" x2="18" y2="0.5"/><line y1="6.5" x2="18" y2="6.5"/><line y1="12.5" x2="18" y2="12.5"/></g></symbol>
    <symbol id="rss" viewBox="0 0 29.75 29.75"><g id="Слой_2" data-name="Слой 2"><g id="Layer_1" data-name="Layer 1"><path class="cls-1" d="M14.875,0A14.875,14.875,0,1,0,29.75,14.875,14.87518,14.87518,0,0,0,14.875,0ZM11.0263,21.2198a2.3606,2.3606,0,1,1,2.3614-2.3604A2.35654,2.35654,0,0,1,11.0263,21.2198Zm6.295,0a1.31161,1.31161,0,0,1-1.3106-1.3116A6.033,6.033,0,0,0,9.9775,13.876a1.31125,1.31125,0,0,1,0-2.6225,8.65774,8.65774,0,0,1,8.6563,8.6547A1.3133,1.3133,0,0,1,17.3213,21.2198Zm4.7216,0a1.31245,1.31245,0,0,1-1.3115-1.3116A10.7546,10.7546,0,0,0,9.9775,9.1553a1.3115,1.3115,0,0,1,0-2.623,13.05972,13.05972,0,0,1,9.5947,3.8496,12.905,12.905,0,0,1,3.7823,9.5263A1.31183,1.31183,0,0,1,22.0429,21.2198Z"/></g></g></symbol>
    <symbol id="search" viewBox="0 0 15.85351 15.85284"><g id="Слой_2" data-name="Слой 2"><g id="Layer_1" data-name="Layer 1"><path style="fill:none;stroke-miterlimit:10;" d="M10.46944,2.2103a5.83963,5.83963,0,1,1-8.259,0A5.83979,5.83979,0,0,1,10.46944,2.2103Z"/><line class="cls-1" x1="10.54457" y1="10.54492" x2="15.5" y2="15.49925"/></g></g></symbol>
    <symbol id="share" viewBox="0 0 16 15.21053"><g id="Слой_2" data-name="Слой 2"><g id="Layer_1" data-name="Layer 1"><line style="fill:none;stroke-miterlimit:10;" x1="10.98421" y1="11.35266" x2="5.01579" y2="8.59739"/><line style="fill:none;stroke-miterlimit:10;" x1="10.98421" y1="3.86055" x2="5.01579" y2="6.61582"/><circle style="fill:none;stroke-miterlimit:10;" cx="13.13158" cy="2.86842" r="2.36842"/><circle style="fill:none;stroke-miterlimit:10;" cx="13.13158" cy="12.34211" r="2.36842"/><circle style="fill:none;stroke-miterlimit:10;" cx="2.86842" cy="7.60526" r="2.36842"/></g></g></symbol>
    <symbol id="telegram" viewBox="0 0 29.67189 29.6729"><g id="Слой_2" data-name="Слой 2"><g id="Layer_1" data-name="Layer 1"><path class="cls-1" d="M18.50789,10.7305l-8.4512,5.331,1.4248,4.3653.2812-3.0039,7.2354-6.5293C19.31649,10.6123,18.92969,10.4746,18.50789,10.7305Z"/><path class="cls-1" d="M14.836,0A14.83645,14.83645,0,1,0,29.67189,14.8369,14.83535,14.83535,0,0,0,14.836,0Zm7.18939,9.3389-2.5586,12.0635c-.1796.8574-.6972,1.0625-1.415.666l-3.9004-2.8809c-.915.8897-1.7353,1.6875-1.874,1.8233a.99882.99882,0,0,1-.7803.3906c-.5058,0-.4189-.1914-.5937-.6729l-1.4346-4.3984-3.75-1.1699c-.832-.2549-.8379-.8272.1875-1.2393l15.0332-5.7978C21.625,7.8115,22.28909,8.2881,22.02539,9.3389Z"/></g></g></symbol>
    <symbol id="thumbs-up" viewBox="0 0 29.1968 28.2852"><g id="Слой_2" data-name="Слой 2"><g id="Layer_1" data-name="Layer 1"><path class="cls-1" d="M28.6968,13.9063c0-1.874-1.4634-2.8687-3.5122-2.8687H19.272a18.092,18.092,0,0,0,.644-4.3906C19.916,1.5538,18.5108.5,17.2813.5a3.553,3.553,0,0,0-2.22509.5855.84534.84534,0,0,0-.40921.585l-.8779,4.7421c-.9366,2.5176-3.33689,4.6836-5.2691,6.147V25.0879a5.29558,5.29558,0,0,1,2.2246.7608,6.87375,6.87375,0,0,0,3.0445.9365h8.37111a2.97065,2.97065,0,0,0,3.04439-2.6338,2.17863,2.17863,0,0,0-.0591-.6445,2.60254,2.60254,0,0,0,1.815-2.3999,3.05774,3.05774,0,0,0-.2925-1.3467,2.881,2.881,0,0,0,1.3467-2.166,2.44249,2.44249,0,0,0-.58549-1.4634,2.97894,2.97894,0,0,0,1.28759-2.2246Z"/><rect class="cls-1" x="0.5" y="11.7852" width="8" height="16" rx="1" ry="1"/></g></g></symbol>
    <symbol id="user" viewBox="0 0 15 15"><g id="Слой_2" data-name="Слой 2"><g id="Layer_1" data-name="Layer 1"><circle style="fill:#989898" cx="7.5" cy="7.5" r="7.5"/><path style="fill:#fff" class="cls-2" d="M7.5,9.9475a7.462,7.462,0,0,0-4.99875,1.92013,6.587,6.587,0,0,0,9.9975,0A7.462,7.462,0,0,0,7.5,9.9475Z"/><circle style="fill:#fff" cx="7.5" cy="6.405" r="2.5"/></g></g></symbol>
    <symbol id="vk" viewBox="0 0 29.6718 29.6728"><g id="Слой_2" data-name="Слой 2"><g id="Layer_1" data-name="Layer 1"><path class="cls-1" d="M16.7441,16.0449a3.43409,3.43409,0,0,0-1.67379-.2773H13.3066v3.6347h1.6191a3.34017,3.34017,0,0,0,1.8809-.3193,1.88562,1.88562,0,0,0,.7422-1.543A1.85219,1.85219,0,0,0,16.7441,16.0449Z"/><path class="cls-1" d="M14.8359,0A14.8364,14.8364,0,1,0,29.6718,14.8359,14.83627,14.83627,0,0,0,14.8359,0Zm1.1143,22.1113H9.8886V7.4814h6.6231a3.42958,3.42958,0,0,1,3.6885,3.375,3.1143,3.1143,0,0,1-2.1123,3.1563v.043a3.32881,3.32881,0,0,1,3.0097,3.6171C21.0976,19.8027,19.6484,22.1113,15.9502,22.1113Z"/><path class="cls-1" d="M16.08,12.9404a1.691,1.691,0,0,0,.5977-1.3222,1.53273,1.53273,0,0,0-.7012-1.3223,4.35055,4.35055,0,0,0-1.9013-.2129h-.7686v3.1992h1.0166A2.78668,2.78668,0,0,0,16.08,12.9404Z"/></g></g></symbol>
    <symbol id="down" viewBox="0 0 13 13" fill="none"><path d="M12 6.06L6.5 12M6.5 12L1 6.06M6.5 12L6.5 -2.40413e-07" stroke="white" stroke-miterlimit="10"/></symbol>
    <symbol id="up" viewBox="0 0 13 13" fill="none"><path d="M1 6.94L6.5 0.999999M6.5 0.999999L12 6.94M6.5 0.999999L6.5 13" stroke="white" stroke-miterlimit="10"/></symbol>
    <symbol id="attach" viewBox="0 0 24 25"><path d="M6.40797 24.001C4.76597 24.001 3.12397 23.376 1.87397 22.126C0.662972 20.915 -0.00402832 19.305 -0.00402832 17.592C-0.00402832 15.88 0.662972 14.27 1.87397 13.058L13.051 1.88201C15.552 -0.61799 19.619 -0.61699 22.118 1.88201C24.618 4.38201 24.618 8.45001 22.118 10.95L16.571 16.497C15.778 17.289 14.724 17.726 13.604 17.726C11.291 17.726 9.40997 15.844 9.40997 13.531C9.40997 12.41 9.84597 11.357 10.639 10.565L14.783 6.42201L15.49 7.12901L11.346 11.272C10.742 11.876 10.41 12.678 10.41 13.531C10.41 15.293 11.843 16.726 13.604 16.726C14.458 16.726 15.259 16.394 15.864 15.79L21.411 10.243C23.521 8.13301 23.52 4.70001 21.411 2.58901C19.3 0.47801 15.865 0.48001 13.758 2.58901L2.58197 13.765C1.55997 14.787 0.996972 16.147 0.996972 17.592C0.996972 19.038 1.55997 20.397 2.58197 21.419C4.69197 23.528 8.12497 23.528 10.235 21.419L10.602 21.053L11.309 21.76L10.942 22.126C9.69197 23.376 8.04997 24.001 6.40797 24.001Z" /></symbol>
    <symbol id="back" viewBox="0 0 13 20" fill="none"><g clip-path="url(#clip0)"><path d="M11.8228 19.021L2.06906 10.0699L11.8228 0.979039"  stroke-miterlimit="10"/></g><defs><clipPath id="clip0"><rect width="12.8571" height="20" fill="white" transform="translate(12.8572 20) rotate(-180)"/></clipPath></defs></symbol>
</svg>