{
  "CheckYourJunk": "Didn't receive the email? Check your junk mail or resend email.",
  "ClickPasswordResetLink": "To create your new password, click the link in the email and enter a new one.",
  "EnterNewPassword": "To complete the password reset process, please enter a new password.",
  "ForgottenPassword": "Forgotten password",
  "PasswordLinkSent": "Reset password link sent",
  "PasswordResetFailed": "Your password reset request failed",
  "ResendEmail": "Resend email",
  "ResetYourPassword": "Reset your Password?",
  "SentPasswordReset": "We've sent a reset password email to {email}",
  "PasswordResetEmailWillBeSent": "A password reset email will be sent to you if you have an account."
}
