{
  "Jan": "January",
  "Feb": "February",
  "Mar": "March",
  "Apr": "April",
  "May": "May",
  "Jun": "June",
  "Jul": "July",
  "Aug": "August",
  "Sep": "September",
  "Oct": "October",
  "Nov": "November",
  "Dec": "December",
  "Subscribe": "Subscribe",
  "StayConnected": "Stay Connected",
  "StayConnectedStrap": "Get behind the scenes access to campaigns, collaborations, new products and sales.",
  "AccountLogin": "Account Login",
  "OrderSummary": "Order Summary"
}
