{
  "ThemeNewsletterThanks": "Thank you for subscribing.",
  "ThemeNewsletterSorry": "Sorry you couldn't be subscribed at this time, please try again later.",
  "ThemeNewsletterConsent": "By signing up you are agreeing to receive marketing communications from us. For more information please see our <a href=\"/privacy-policy\" target=\"_blank\">Privacy Policy</a>.",
  "ShowingOf": "Showing {{x}} of {{y}} products",
  "RecaptchaClosedMessage": "Recaptcha closed",
  "SuccessTitle": "Success",
  "FailedTitle": "Failed",
  "FallbackErrorPageTitle": "OOPS!",
  "StoreLocator": "Store Locator",
  "HelpCentre": "Help Centre",
  "HelpCentrePath": "/help-centre",
  "Or": "OR",
  "EditDetails": "Edit Details",
  "PageNotFound": "OOPS! Sorry, we couldn't find what you were looking for ...",
  "SelectYourCountry": "Select Your Country",
  "PopularSearches": "Popular Searches",
  "MetaDataFallback": {
    "Title": "Superdry - Jackets, T Shirts, Hoodies, Shorts, Mens & Womens Clothing",
    "Description": "Official Superdry Shop - Free Delivery | Jackets T Shirts Hoodies Shorts Jeans, Mens & Womens Designer Clothing, Dresses, Jeans, Polo Shirts, Joggers, Osaka, Jewellery &amp; Accessories"
  }
}