Division,WeightClassKg,Place,Name,Team,BodyweightKg,Best3SquatKg,Best3BenchKg,Best3DeadliftKg,TotalKg,Equipment,Event,Sex
Boys,51.71,1,Echo Jones,Strawn,51.26,172.37,77.11,217.72,467.2,Single-ply,SBD,M
Boys,51.71,2,Jason Nguyen,Oakridge School,50.53,161.03,83.91,170.1,415.04,Single-ply,SBD,M
Boys,51.71,3,Austin Mullinex,Sadler S & S Cons,51.07,145.15,72.57,142.88,360.61,Single-ply,SBD,M
Boys,51.71,4,Dax Irvin,Pottsboro,51.57,142.88,74.84,136.08,353.8,Single-ply,SBD,M
Boys,51.71,5,Daniel Rivera,Ponder,50.89,142.88,61.23,142.88,347,Single-ply,SBD,M
Boys,51.71,6,Kyle Reed,Wichita Falls City View,51.53,136.08,56.7,131.54,324.32,Single-ply,SBD,M
Boys,51.71,7,Carlos Villanueva,Strawn,51.21,124.74,61.23,122.47,308.44,Single-ply,SBD,M
Boys,51.71,8,Finlee Rudicile,Farmersville,50.67,102.06,77.11,122.47,301.64,Single-ply,SBD,M
Boys,51.71,9,Jake Morris,Bowie,51.71,104.33,61.23,136.08,301.64,Single-ply,SBD,M
Boys,51.71,10,Adam Mendoza,Pilot Point,51.39,102.06,61.23,124.74,288.03,Single-ply,SBD,M
Boys,51.71,11,Hunter Cathey,Pottsboro,51.07,111.13,70.31,104.33,285.76,Single-ply,SBD,M
Boys,51.71,12,Lance Jones,Van Alstyne,50.71,92.99,52.16,120.2,265.35,Single-ply,SBD,M
Boys,55.79,1,Mario Giron,Pilot Point,55.16,170.1,97.52,165.56,433.18,Single-ply,SBD,M
Boys,55.79,2,Luis Gonzalez,Wichita Falls City View,55.57,158.76,83.91,170.1,412.77,Single-ply,SBD,M
Boys,55.79,3,Alex Rushing,Whitewright,54.66,145.15,92.99,145.15,383.29,Single-ply,SBD,M
Boys,55.79,4,Juan Mares,Bowie,55.75,151.95,88.45,140.61,381.02,Single-ply,SBD,M
Boys,55.79,5,Nathan Mock,Perrin-Whitt,55.29,131.54,79.38,156.49,367.41,Single-ply,SBD,M
Boys,55.79,6,Franklin Lopez,Millsap,54.7,136.08,63.5,145.15,344.73,Single-ply,SBD,M
Boys,55.79,7,Justin Wilson #3,Wichita Falls City View,54.66,113.4,68.04,136.08,317.51,Single-ply,SBD,M
Boys,55.79,8,Rylee Miller,Paradise,54.84,127.01,63.5,122.47,312.98,Single-ply,SBD,M
Boys,55.79,9,Joey Crawford,Bowie,55.02,102.06,56.7,136.08,294.84,Single-ply,SBD,M
Boys,55.79,DQ,Enrique Colmenero,Pilot Point,55.02,117.93,,,,Single-ply,SBD,M
Boys,59.87,1,Cristian Martinez,Bowie,57.97,199.58,111.13,195.04,505.76,Single-ply,SBD,M
Boys,59.87,2,Tuan Hoang,Wichita Falls City View,59.06,174.63,88.45,172.37,435.45,Single-ply,SBD,M
Boys,59.87,3,Jeremiah Devereaux,Pilot Point,59.06,151.95,92.99,181.44,426.38,Single-ply,SBD,M
Boys,59.87,4,Chris Bowling,Blue Ridge,59.74,151.95,106.59,163.29,421.84,Single-ply,SBD,M
Boys,59.87,5,Caleb McWhorter,Wichita Falls City View,59.38,145.15,72.57,172.37,390.09,Single-ply,SBD,M
Boys,59.87,6,Zack Allen #1,Ponder,58.69,149.69,77.11,161.03,387.82,Single-ply,SBD,M
Boys,59.87,7,Josh Gorospe,Sunnyvale,58.29,140.61,65.77,172.37,378.75,Single-ply,SBD,M
Boys,59.87,8,Jonah Maston,Santo,58.29,145.15,77.11,151.95,374.21,Single-ply,SBD,M
Boys,59.87,9,Darius Jones #1,Dallas Life Oak Cliff,58.83,136.08,77.11,154.22,367.41,Single-ply,SBD,M
Boys,59.87,9,Darius Jones #1,Dallas Life Oak Cliff,58.83,136.08,77.11,154.22,367.41,Single-ply,SBD,M
Boys,59.87,10,Jay Rogers,Bowie,59.69,142.88,74.84,147.42,365.14,Single-ply,SBD,M
Boys,59.87,11,Trayce Barber,Boyd,59.65,136.08,90.72,136.08,362.87,Single-ply,SBD,M
Boys,59.87,DQ,Jacob Grubisa,Farmersville,58.92,172.37,,,,Single-ply,SBD,M
Boys,67.13,1,J. Paul Axtell,Olney,66.54,231.33,115.67,206.38,553.38,Single-ply,SBD,M
Boys,67.13,2,Andrew Magedson,Leonard,65.73,199.58,120.2,201.85,521.63,Single-ply,SBD,M
Boys,67.13,3,Wyatt Burrows,Olney,66.36,201.85,95.25,213.19,510.29,Single-ply,SBD,M
Boys,67.13,4,Jayton Trammell,Santo,65.59,199.58,106.59,199.58,505.76,Single-ply,SBD,M
Boys,67.13,5,Jared Holmes #2,Perrin-Whitt,64.95,176.9,99.79,204.12,480.81,Single-ply,SBD,M
Boys,67.13,6,Shaun Hudson,Callisburg,64.91,176.9,102.06,195.04,474,Single-ply,SBD,M
Boys,67.13,7,Frank Williams,Alvord,66.5,188.24,97.52,188.24,474,Single-ply,SBD,M
Boys,67.13,8,Dalton Trouille,Olney,64.77,188.24,106.59,163.29,458.13,Single-ply,SBD,M
Boys,67.13,9,Ryan Slagle,Pottsboro,66.5,181.44,108.86,167.83,458.13,Single-ply,SBD,M
Boys,67.13,10,Braden Gonzales,Alvord,66.63,163.29,106.59,188.24,458.13,Single-ply,SBD,M
Boys,67.13,11,Caleb Rodriguez,Boyd,64.23,181.44,95.25,172.37,449.06,Single-ply,SBD,M
Boys,67.13,12,Jeremiah Brian,Leonard,65.91,181.44,97.52,167.83,446.79,Single-ply,SBD,M
Boys,67.13,DQ,Darian Sotomi,Paradise,65.45,,,,,Single-ply,SBD,M
Boys,74.84,1,Danny Ho,Wichita Falls City View,73.57,235.87,140.61,226.8,603.28,Single-ply,SBD,M
Boys,74.84,2,Cody Coldwell,Sunnyvale,73.94,233.6,129.27,195.04,557.92,Single-ply,SBD,M
Boys,74.84,3,Banahene Glover,Oakridge School,73.94,224.53,142.88,188.24,555.65,Single-ply,SBD,M
Boys,74.84,4,Taylor Barrett,Pilot Point,72.12,208.65,129.27,192.78,530.7,Single-ply,SBD,M
Boys,74.84,5,Spencer Wright,Leonard,74.07,199.58,117.93,188.24,505.76,Single-ply,SBD,M
Boys,74.84,6,Hunter Abston,Olney,74.07,183.7,131.54,188.24,503.49,Single-ply,SBD,M
Boys,74.84,7,Destin Montelongo,Santo,73.84,183.7,115.67,185.97,485.34,Single-ply,SBD,M
Boys,74.84,8,Gavin Clark,Whitewright,72.89,163.29,131.54,188.24,483.08,Single-ply,SBD,M
Boys,74.84,9,Bryan Hernandez,Olney,72.71,190.51,117.93,170.1,478.54,Single-ply,SBD,M
Boys,74.84,10,Noah Maston,Santo,73.89,181.44,106.59,181.44,469.47,Single-ply,SBD,M
Boys,74.84,11,Josh Wells #2,Jacksboro,70.94,165.56,106.59,185.97,458.13,Single-ply,SBD,M
Boys,74.84,DQ,Danny Cumpton,Ponder,73.35,181.44,102.06,,,Single-ply,SBD,M
Boys,82.1,1,Chase Mackey,Gordon,80.78,226.8,136.08,226.8,589.67,Single-ply,SBD,M
Boys,82.1,2,Brandon Murphy,Whitesboro,81.24,233.6,115.67,208.65,557.92,Single-ply,SBD,M
Boys,82.1,3,Andrew Griffin,Howe,80.65,208.65,136.08,204.12,548.85,Single-ply,SBD,M
Boys,82.1,4,Darrion Green,Pilot Point,80.74,183.7,133.81,204.12,521.63,Single-ply,SBD,M
Boys,82.1,5,Ronnie Hart,Leonard,81.1,181.44,122.47,208.65,512.56,Single-ply,SBD,M
Boys,82.1,6,Antonio Puga,Pilot Point,80.42,179.17,117.93,208.65,505.76,Single-ply,SBD,M
Boys,82.1,7,Cole Schkade,Santo,80.29,192.78,106.59,195.04,494.42,Single-ply,SBD,M
Boys,82.1,8,Donny Neal,Chico,80.29,165.56,111.13,195.04,471.74,Single-ply,SBD,M
Boys,82.1,DQ,Bodi Gilbert,Electra,79.92,213.19,154.22,,,Single-ply,SBD,M
Boys,82.1,DQ,Daniel Secrease,Dallas Life Oak Cliff,79.33,,,,,Single-ply,SBD,M
Boys,82.1,DQ,Colt Gallaway,Pilot Point,77.11,172.37,120.2,,,Single-ply,SBD,M
Boys,82.1,DQ,Daniel Secrease,Dallas Life Oak Cliff,79.33,,,,,Single-ply,SBD,M
Boys,82.1,DQ,Tanner Hartsfield,Howe,81.6,206.38,127.01,,,Single-ply,SBD,M
Boys,89.81,1,Austin Bennett,Ponder,84.32,244.94,133.81,231.33,610.08,Single-ply,SBD,M
Boys,89.81,2,Athens Gochis,Pilot Point,88.63,219.99,131.54,240.4,591.94,Single-ply,SBD,M
Boys,89.81,3,Spencer Garcia,Wichita Falls City View,88.45,233.6,122.47,233.6,589.67,Single-ply,SBD,M
Boys,89.81,4,Ben Dankesreiter,Ponder,88.27,235.87,124.74,222.26,582.87,Single-ply,SBD,M
Boys,89.81,5,Diego Puga,Pilot Point,88.45,219.99,133.81,226.8,580.6,Single-ply,SBD,M
Boys,89.81,6,Bret Davis,Bowie,87.63,204.12,145.15,197.31,546.58,Single-ply,SBD,M
Boys,89.81,7,James Baker,Whitesboro,88.41,213.19,131.54,197.31,542.04,Single-ply,SBD,M
Boys,89.81,8,Ezequiel Trejo,Pilot Point,88.68,204.12,111.13,222.26,537.51,Single-ply,SBD,M
Boys,89.81,9,John Cooper,Whitewright,88.86,190.51,108.86,238.14,537.51,Single-ply,SBD,M
Boys,89.81,10,Bridger Skogberg,Paradise,88.04,199.58,122.47,197.31,519.36,Single-ply,SBD,M
Boys,89.81,11,Tristan Barbare,Perrin-Whitt,89.31,204.12,106.59,199.58,510.29,Single-ply,SBD,M
Boys,89.81,12,Emanuel Rodriquez,Gordon,89.63,181.44,111.13,190.51,483.08,Single-ply,SBD,M
Boys,99.79,1,Ramon Guerra,Wichita Falls City View,98.47,254.01,122.47,240.4,616.89,Single-ply,SBD,M
Boys,99.79,2,Triston Matthews,Howe,95.21,247.21,145.15,222.26,614.62,Single-ply,SBD,M
Boys,99.79,3,Rey Lomas,Valley View,98.84,260.82,140.61,213.19,614.62,Single-ply,SBD,M
Boys,99.79,4,Tristan Dennison,Bowie,92.53,242.67,127.01,229.06,598.74,Single-ply,SBD,M
Boys,99.79,5,Noor Wafayee,Oakridge School,98.43,204.12,131.54,244.94,580.6,Single-ply,SBD,M
Boys,99.79,6,Jacob Taylor,Howe,97.16,208.65,131.54,226.8,566.99,Single-ply,SBD,M
Boys,99.79,7,Gavin Rowe,Blue Ridge,95.57,210.92,149.69,197.31,557.92,Single-ply,SBD,M
Boys,99.79,8,Tyler Scott,Pilot Point,99.25,219.99,115.67,204.12,539.77,Single-ply,SBD,M
Boys,99.79,9,Lucas Ramsey,Perrin-Whitt,91.49,226.8,115.67,192.78,535.24,Single-ply,SBD,M
Boys,99.79,10,Keston Wood,Petrolia,98.79,195.04,142.88,195.04,532.97,Single-ply,SBD,M
Boys,99.79,11,Seth Alston,Santo,92.53,226.8,106.59,192.78,526.17,Single-ply,SBD,M
Boys,99.79,DQ,Raymond Carrasco,Olney,96.62,,,,,Single-ply,SBD,M
Boys,109.77,1,Drew McVicker,Olney,105.51,331.12,215.46,242.67,789.25,Single-ply,SBD,M
Boys,109.77,2,Austin Coker,Santo,105.51,278.96,156.49,224.53,659.98,Single-ply,SBD,M
Boys,109.77,3,Cody Holoway,Paradise,107.46,249.48,127.01,240.4,616.89,Single-ply,SBD,M
Boys,109.77,4,Dylan Hudson,Olney,102.15,238.14,149.69,199.58,587.4,Single-ply,SBD,M
Boys,109.77,5,Keenon Ponder,Dallas Life Oak Cliff,108.54,217.72,142.88,226.8,587.4,Single-ply,SBD,M
Boys,109.77,5,Keenon Ponder,Dallas Life Oak Cliff,108.54,217.72,142.88,226.8,587.4,Single-ply,SBD,M
Boys,109.77,6,JP Sales,Sunnyvale,106.32,240.4,111.13,226.8,578.33,Single-ply,SBD,M
Boys,109.77,7,Camden Brown,Leonard,104.46,226.8,129.27,206.38,562.45,Single-ply,SBD,M
Boys,109.77,8,Cody Armstrong,Chico,102.92,217.72,106.59,188.24,512.56,Single-ply,SBD,M
Boys,109.77,9,Anthony Coker,Santo,103.92,206.38,102.06,204.12,512.56,Single-ply,SBD,M
Boys,109.77,10,Toby Patrick,Millsap,102.65,147.42,77.11,165.56,390.09,Single-ply,SBD,M
Boys,109.77,DQ,Alex Silva,Boyd,100.56,204.12,102.06,,,Single-ply,SBD,M
Boys,109.77,DQ,Ashton McDaniel,Pottsboro,107.05,213.19,136.08,,,Single-ply,SBD,M
Boys,124.74,1,Ronnie Killen,Wichita Falls City View,110.81,299.37,145.15,292.57,737.09,Single-ply,SBD,M
Boys,124.74,2,Saul Landaverde,Bowie,123.01,317.51,167.83,249.48,734.82,Single-ply,SBD,M
Boys,124.74,3,Tanner Edwards,Paradise,116.89,285.76,181.44,240.4,707.6,Single-ply,SBD,M
Boys,124.74,4,Carlos Giron,Pilot Point,124.38,267.62,176.9,240.4,684.92,Single-ply,SBD,M
Boys,124.74,5,Deric Conner,Paradise,113.85,260.82,176.9,229.06,666.78,Single-ply,SBD,M
Boys,124.74,6,Blake Martin,Alvord,115.12,283.5,151.95,204.12,639.57,Single-ply,SBD,M
Boys,124.74,7,Trace Boyd,Strawn,115.98,233.6,140.61,238.14,612.35,Single-ply,SBD,M
Boys,124.74,8,Russell Carey,Whitesboro,118.75,260.82,129.27,222.26,612.35,Single-ply,SBD,M
Boys,124.74,9,Justin Wagner,Ponder,117.12,272.16,136.08,192.78,601.01,Single-ply,SBD,M
Boys,124.74,10,John Garcia,Millsap,119.93,242.67,117.93,204.12,564.72,Single-ply,SBD,M
Boys,124.74,11,Levi Henry,Callisburg,113.81,231.33,127.01,195.04,553.38,Single-ply,SBD,M
Boys,124.74,12,JD Brown,Chico,113.99,190.51,124.74,197.31,512.56,Single-ply,SBD,M
Boys,124.74+,1,Wade Cookston,Sunnyvale,137.76,319.78,181.44,278.96,780.18,Single-ply,SBD,M
Boys,124.74+,2,Sheldon Parkman,Gunter,134.04,326.59,176.9,238.14,741.62,Single-ply,SBD,M
Boys,124.74+,3,Jared Roberts,Bowie,145.24,272.16,149.69,226.8,648.64,Single-ply,SBD,M
Boys,124.74+,4,Francisco Estrada,Pilot Point,132.86,244.94,142.88,254.01,641.83,Single-ply,SBD,M
Boys,124.74+,5,Michael Pruiett,Leonard,130.86,249.48,154.22,235.87,639.57,Single-ply,SBD,M
Boys,124.74+,6,Kayl Powers,Collinsville,127.73,226.8,147.42,256.28,630.49,Single-ply,SBD,M
Boys,124.74+,7,Jesse Harris,Gunter,144.65,233.6,163.29,219.99,616.89,Single-ply,SBD,M
Boys,124.74+,8,Jiovanny Rubio,Sunnyvale,137.08,231.33,140.61,231.33,603.28,Single-ply,SBD,M
Boys,124.74+,9,Dominic Little,Whitewright,140.16,272.16,142.88,185.97,601.01,Single-ply,SBD,M
Boys,124.74+,10,Quentin Jones,Wichita Falls City View,152.95,260.82,136.08,195.04,591.94,Single-ply,SBD,M
Boys,124.74+,11,Tyler Yzaguirre,Alvord,129.5,231.33,147.42,192.78,571.53,Single-ply,SBD,M
Boys,124.74+,12,Tyler Wagner,Ponder,131.77,244.94,122.47,195.04,562.45,Single-ply,SBD,M
