Name,Place,Division,Sex,Equipment,State,WeightClassKg,BodyweightKg,Age,Best3SquatKg,Best3BenchKg,Best3DeadliftKg,TotalKg,Event
Cecilia Hall,1,Juniors 20-23,F,Raw,MN,75,73.84,22,112.5,67.5,120,300,SBD
Carolyn McBride,1,Juniors 20-23,F,Raw,MN,82.5,77.20,22,95,40,115,250,SBD
Alyssa Way,1,Juniors 20-23,F,Raw,MN,90,85.32,22,112.5,67.5,132.5,312.5,SBD
Jenn Huerta,1,Open,F,Raw,MN,67.5,63.82,37,92.5,42.5,105,240,SBD
Alyssa Way,1,Open,F,Raw,MN,90,85.32,22,112.5,67.5,132.5,312.5,SBD
Jenn Huerta,1,Submasters 35-39,F,Raw,MN,67.5,63.82,37,92.5,42.5,105,240,SBD
Julie Sprau,DQ,Masters 50-54,F,Raw,MN,60,58.51,52,57.5,-52.5,110,,SBD
Kim Boatman,1,Masters 45-49,F,Raw,MN,82.5,75.52,49,102.5,45,115,262.5,SBD
Jill Meyer,1,Masters 50-54,F,Raw,MN,75,69.81,50,97.5,57.5,105,260,SBD
Garrett Kelm,1,Juniors 18-19,M,Raw,MN,90,86.00,19,210,172.5,257.5,640,SBD
Riley Allen,1,Juniors 13-15,M,Raw,MN,110,108.95,15,145,97.5,185,427.5,SBD
Tristan Anderson,1,Juniors 16-17,M,Raw,MN,125,118.02,17,250,95,210,555,SBD
Hamza Dudgeon,1,Juniors 20-23,M,Raw,MN,125,123.29,22,160,110,190,460,SBD
Shane Cameron,1,Open,M,Raw,MN,67.5,65.73,27,135,120,200,455,SBD
Jerad Parish,1,Open,M,Raw,MN,75,74.93,33,125,120,177.5,422.5,SBD
Daniel Senger,1,Open,M,Raw,MN,90,88.27,21,200,130,227.5,557.5,SBD
Steven Heintz,2,Open,M,Raw,MN,90,85.28,30,200,122.5,212.5,535,SBD
Mike Yui,3,Open,M,Raw,MN,90,85.28,24,152.5,102.5,187.5,442.5,SBD
Paul McKinley,1,Open,M,Raw,MN,100,98.20,21,225,150,247.5,622.5,SBD
Chad Henry,2,Open,M,Raw,MN,100,99.25,34,205,135,240,580,SBD
Auston Miller,3,Open,M,Raw,MN,100,92.94,32,225,102.5,247.5,575,SBD
Tom Chipman,1,Open,M,Raw,MN,110,108.64,43,192.5,165,247.5,605,SBD
Michael Hintz,2,Open,M,Raw,MN,110,108.27,32,150,80,187.5,417.5,SBD
Tom Chipman,1,Masters 40-44,M,Raw,MN,110,108.64,43,192.5,165,247.5,605,SBD
Tom Fahy,1,Masters 45-49,M,Raw,MN,110,108.73,49,227.5,157.5,272.5,657.5,SBD
Troy Anderson,1,Masters 45-49,M,Raw,MN,125,121.93,45,235,140,200,575,SBD
Roberto Galvan,1,Masters 40-44,M,Raw,WI,140+,166.50,42,247.5,182.5,272.5,702.5,SBD
Kathy Johnson,1,Open,F,Wraps,ND,82.5,75.75,24,145,92.5,182.5,420,SBD
Aaron Dwinnell,1,Juniors 20-23,M,Wraps,MN,82.5,81.15,22,157.5,125,242.5,525,SBD
Nate Faust,DQ,Juniors 18-19,M,Wraps,MN,90,88.95,18,187.5,-145,255,,SBD
Adam Ward #1,1,Open,M,Wraps,MN,140+,154.45,25,322.5,195,295,812.5,SBD
Brad Kretsch,1,Masters 55-59,M,Wraps,MN,125,123.79,57,250,125,277.5,652.5,SBD
Eddie Lone Eagle,1,Open,M,Single-ply,MN,82.5,81.24,31,267.5,160,272.5,700,SBD
Andrew Luing,1,Open,M,Single-ply,MN,100,93.76,44,280,172.5,240,692.5,SBD
Mike Musselman,1,Submasters 35-39,M,Single-ply,MN,125,123.83,38,247.5,152.5,187.5,587.5,SBD
Andrew Luing,1,Masters 40-44,M,Single-ply,MN,100,93.76,44,280,172.5,240,692.5,SBD
Jon Fox,1,Masters 50-54,M,Single-ply,MN,100,92.22,51,130,92.5,140,362.5,SBD
Christian Fite #1,1,Open,M,Multi-ply,MN,90,88.13,30,295,160,275,730,SBD
Gloria Derfus,1,Masters 55-59,F,Raw,MN,90+,156.13,58,,67.5,,67.5,B
Kyle Fick,1,Juniors 16-17,M,Raw,MN,67.5,65.50,16,,92.5,,92.5,B
Hunter Fick,1,Juniors 18-19,M,Raw,MN,90,87.91,18,,177.5,,177.5,B
Rene Rodriguez,1,Submasters 35-39,M,Raw,MN,125,124.06,38,,160,,160,B
Fenn Cournoyer,1,Masters 45-49,M,Raw,MN,100,99.52,49,,170,,170,B
Michael Reilly,1,Masters 45-49,M,Raw,MN,110,106.59,48,,195,,195,B
Eric Knudsen,1,Masters 50-54,M,Single-ply,MN,140,127.05,54,,217.5,,217.5,B
Rachel Nutter,1,Open,F,Multi-ply,MN,90+,143.34,43,,192.5,,192.5,B
Rachel Nutter,1,Masters 40-44,F,Multi-ply,MN,90+,143.34,43,,192.5,,192.5,B
Michael Reilly,1,Masters 45-49,M,Multi-ply,MN,110,106.59,48,,237.5,,237.5,B
Shannon Pose,1,Open,F,Raw,MN,56,53.66,29,,,120,120,D
Robert Franzwa,1,Open,M,Raw,MN,82.5,81.33,24,,162.5,227.5,390,BD
Jake Millang,1,Open,M,Raw,MN,90,88.81,27,,157.5,242.5,400,BD
