Name,Sex,WeightClassKg,BodyweightKg,Division,Squat1Kg,Squat2Kg,Squat3Kg,Best3SquatKg,Bench1Kg,Bench2Kg,Bench3Kg,Best3BenchKg,Deadlift1Kg,Deadlift2Kg,Deadlift3Kg,Best3DeadliftKg,TotalKg,Place,Event,Equipment,BirthDate
Thao Pham,F,52,50.5,FR-O,90,97.5,100,100,57.5,60,-62.5,60,107.5,115,120,120,280,1,SBD,Raw,
Emilija Christie,F,52,51.9,FR-O,87.5,95,-100,95,50,55,57.5,57.5,95,105,110,110,262.5,2,SBD,Raw,
Kristen English,F,57,,FR-O,,,,,,,,,,,,,,NS,SBD,Raw,
Jenny Tan,F,57,54.8,FR-O,115,122.5,127.5,127.5,65,70,72.5,72.5,125,132.5,140,140,340,1,SBD,Raw,
Hana Minhaj,F,57,56.1,FR-O,60,65,67.5,67.5,40,-45,45,45,-80,-80,80,80,192.5,3,SBD,Raw,
Roseleen Lenehan,F,57,56.9,FR-O,95,100,102.5,102.5,55,-57.5,-57.5,55,120,-130,-130,120,277.5,2,SBD,Raw,
Annette Taylor,F,63,58.9,FR-M2,92.5,102.5,107.5,107.5,50,55,-57.5,55,120,130,135,135,297.5,1,SBD,Raw,
Karis Brancato,F,63,58.8,FR-O,95,102.5,-107.5,102.5,62.5,67.5,72.5,72.5,92.5,105,-110,105,280,2,SBD,Raw,
Naomi Roberts,F,63,59.5,FR-O,85,95,100,100,47.5,57.5,-60,57.5,110,130,135,135,292.5,1,SBD,Raw,
Siti Ridzuan,F,63,61.8,FR-O,85,92.5,95,95,55,60,62.5,62.5,95,105,110,110,267.5,3,SBD,Raw,
Sharna Sumpton,F,63,62.4,FR-M1,95,105,107.5,107.5,47.5,52.5,55,55,125,135,137.5,137.5,300,1,SBD,Raw,
Tammy Kenny,F,63,61.7,FR-M2,102.5,107.5,110,110,-60,-60,-60,,145,-155,-155,145,,DQ,SBD,Raw,
Melissa Trivic,F,69,67.7,FR-M1,85,95,100,100,37.5,42.5,45,45,127.5,137.5,142.5,142.5,287.5,1,SBD,Raw,
Ina Carrick,F,69,,FR-M1,,,,,,,,,,,,,,NS,SBD,Raw,
Anna Lukas,F,69,64.5,FR-Jr,90,95,100,100,50,52.5,-55,52.5,107.5,112.5,-115,112.5,265,2,SBD,Raw,
Olivia Lannon,F,69,67.7,FR-O,105,112.5,117.5,117.5,60,65,67.5,67.5,140,150,157.5,157.5,342.5,1,SBD,Raw,
Amanda Clark,F,69,68.8,FR-O,110,112.5,120,120,60,65,-67.5,65,130,142.5,150,150,335,3,SBD,Raw,
Jazmin Reid,F,69,68.6,FR-Jr,130,137.5,-142.5,137.5,65,67.5,70,70,140,147.5,152.5,152.5,360,1,SBD,Raw,
Chloe Liebeck,F,69,66.2,FR-O,120,125,-130,125,65,70,-72.5,70,125,135,142.5,142.5,337.5,2,SBD,Raw,
Sheydn Rowe,F,69,,FR-O,,,,,,,,,,,,,,NS,SBD,Raw,
Linda Guthrie,F,69,67.2,FR-O,72.5,77.5,82.5,82.5,47.5,50,-52.5,50,117.5,127.5,-130,127.5,260,5,SBD,Raw,
Jessica Crooks,F,69,66.4,FR-O,100,110,115,115,40,-45,50,50,120,-132.5,132.5,132.5,297.5,4,SBD,Raw,
Casey Molnar,F,76,74.7,FR-O,130,137.5,142.5,142.5,60,65,67.5,67.5,135,145,150,150,360,1,SBD,Raw,
Regen Foot,F,84,78.8,FR-M1,110,-117.5,117.5,117.5,57.5,60,-62.5,60,130,140,145,145,322.5,1,SBD,Raw,
Kathleen Stoikov,F,84,83.5,FR-O,140,147.5,152.5,152.5,60,65,-70,65,155,162.5,170,170,387.5,1,SBD,Raw,
Kathryn Maric,F,84,83,FR-O,120,-125,125,125,-60,70,-72.5,70,120,132.5,140,140,335,2,SBD,Raw,
Vicki Stamoulis,F,84,83,FR-M3,37.5,42.5,52.5,52.5,37.5,42.5,45,45,115,125,135,135,232.5,1,SBD,Raw,
Gabby Newbery,F,84+,93.8,FR-O,90,97.5,105,105,50,55,-57.5,55,115,125,132.5,132.5,292.5,5,SBD,Raw,
Jessica-Rose Quarrell,F,84+,127.4,FR-O,115,125,132.5,132.5,75,80,-82.5,80,145,155,162.5,162.5,375,3,SBD,Raw,
Kylie Elwin,F,84+,97,FR-O,90,95,102.5,102.5,45,55,57.5,57.5,125,135,137.5,137.5,297.5,4,SBD,Raw,
Natalie Laalaai,F,84+,140.1,FR-O,140,160,180,180,70,80,87.5,87.5,-160,170,190,190,457.5,2,SBD,Raw,
Jessie Toms,F,84+,118.6,FR-O,205,215,-220,215,102.5,110,112.5,112.5,170,180,-187.5,180,507.5,1,SBD,Raw,
Franz Gonzalvo,M,66,65,MR-Jr,140,150,160,160,105,110,112.5,112.5,180,190,-195,190,462.5,1,SBD,Raw,
Tharen Kander,M,66,65.5,MR-O,165,175,180,180,112.5,117.5,-120,117.5,220,232.5,-252.5,232.5,530,1,SBD,Raw,
Danny Vuong,M,66,65,MR-O,162.5,175,-180,175,92.5,100,105,105,172.5,182.5,-190,182.5,462.5,2,SBD,Raw,
Dimitri Tsagaris,M,74,73,MR-Jr,130,150,160,160,112.5,117.5,-120,117.5,160,180,200,200,477.5,3,SBD,Raw,
Tsur Tsaban,M,74,73.7,MR-Jr,170,180,-187.5,180,117.5,122.5,-125,122.5,217.5,230,-240,230,532.5,2,SBD,Raw,
Anton Lukas,M,74,73.5,MR-Jr,145,152.5,-157.5,152.5,100,105,-107.5,105,190,202.5,210,210,467.5,4,SBD,Raw,
William Hughes,M,74,73.5,MR-Jr,180,187.5,195,195,125,130,135,135,235,-245,-250,235,565,1,SBD,Raw,
Daniel Rice,M,74,73.7,MR-O,155,165,170,170,105,110,-112.5,110,170,180,185,185,465,1,SBD,Raw,
Joshua Ng,M,74,72.6,MR-O,145,150,162.5,162.5,100,-112.5,-112.5,100,165,175,190,190,452.5,2,SBD,Raw,
Ian Kong,M,83,76.1,MR-O,195,210,220,220,107.5,115,120,120,235,250,265,265,605,1,SBD,Raw,
Joshua Chilia,M,83,80.4,MR-O,-190,190,202.5,202.5,127.5,132.5,-135,132.5,240,252.5,-272.5,252.5,587.5,2,SBD,Raw,
Joshua Canestraro,M,83,82.3,MR-Jr,150,160,170,170,117.5,-125,125,125,185,195,205,205,500,1,SBD,Raw,
Christopher Ball,M,83,81.7,MR-M2,175,185,195,195,87.5,95,-100,95,190,200,205,205,495,1,SBD,Raw,
Nathan Miller #7,M,105,,MR-O,,,,,,,,,,,,,,NS,SBD,Raw,
Maximilian Smith,M,105,98.9,MR-O,195,210,225,225,115,122.5,127.5,127.5,225,250,267.5,267.5,620,2,SBD,Raw,
Danny Do,M,105,102.5,MR-O,220,235,242.5,242.5,150,155,160,160,225,240,-250,240,642.5,1,SBD,Raw,
Steven Christensen,M,105,,MR-O,,,,,,,,,,,,,,NS,SBD,Raw,
Declhan Lee,M,105,,MR-O,,,,,,,,,,,,,,NS,SBD,Raw,
Phillip Russell,M,120,118.8,MR-O,200,210,225,225,122.5,-125,-125,122.5,230,245,252.5,252.5,600,2,SBD,Raw,
Russel Pink,M,120,116,MR-O,200,210,220,220,175,-185,-185,175,220,240,-252.5,240,635,1,SBD,Raw,
Mina Kiddas,M,120,116,MR-O,160,170,-180,170,135,145,150,150,210,230,-240,230,550,3,SBD,Raw,
Callum Parker,M,120+,129.9,MR-O,-225,-235,-235,,-130,140,150,150,240,252.5,260,260,,DQ,SBD,Raw,
Ethan Lim,M,93,85.5,MR-Jr,195,205,-210,205,130,135,140,140,265,275,-285,275,620,1,SBD,Raw,
Christian Menalang,M,93,,MR-O,,,,,,,,,,,,,,NS,SBD,Raw,
Callum Morley,M,93,89.1,MR-O,205,217.5,225,225,115,122.5,-127.5,122.5,245,257.5,262.5,262.5,610,1,SBD,Raw,
Conrad Matthews,M,93,91,MR-O,210,227.5,235,235,120,130,132.5,132.5,220,235,240,240,607.5,2,SBD,Raw,
Louis Dunstan,M,93,,MR-M1,,,,,,,,,,,,,,NS,SBD,Raw,
David Westwater,M,105,99.4,MR-M1,165,-175,180,180,92.5,100,102.5,102.5,195,205,-210,205,487.5,1,SBD,Raw,
Tamaki Rogers-Pokaihau,M,120+,128.3,MR-O,,,,,175,-185,-185,175,,,,,175,1,B,Raw,
