Name,Sex,Team,Equipment,Division,BirthYear,BodyweightKg,WeightClassKg,Bench1Kg,Bench2Kg,Bench3Kg,Best3BenchKg,TotalKg,Place,Event
Susanne Küttler,F,AC Köln,Raw,Masters 1,1966,70.3,72,65,67.5,70,70,70,1,B
Steffen Romahn,M,TAV Germania Düsseldorf,Raw,Masters 1,1965,92.7,93,125,-130,-130,125,125,1,B
Patrick Gudd,M,Body Aktiv Oberhausen,Raw,Masters 1,1971,116,120,180,190,200,200,200,1,B
Klaus Landek,M,VfB Hüls,Raw,Masters 2,1963,65.7,66,120,130,-135,130,130,1,B
Hans-Peter Büngers,M,Body Aktiv Oberhausen,Raw,Masters 2,1956,88.5,93,120,125,-127.5,125,125,1,B
Jörg Pollmann,M,Body Aktiv Oberhausen,Raw,Masters 2,1959,112.6,120,160,,,160,160,1,B
Uwe Dörfert,M,PL Duisburg,Raw,Masters 2,1959,120.4,120+,142.5,150,,150,150,1,B
Paul Pfenninger,M,PL Duisburg,Raw,Masters 3,1954,79.1,83,125,-130,,125,125,1,B
Jürgen Heisterkamp,M,KSV Bochum,Raw,Masters 3,1946,82.4,83,110,115,120,120,120,2,B
Klaus Dieter Disse-Stebner,M,KSV Fitnesskreis,Raw,Masters 3,1953,108.2,120,110,117.5,122.5,122.5,122.5,1,B
Josef Page,M,KSV Bochum,Raw,Masters 4,1940,77.7,83,70,80,85,85,85,1,B
Klaus Skrzypkowiak,M,KSV Bochum,Raw,Masters 4,1944,92.8,93,90,100,-110,100,100,1,B
Joel Janott,M,KSV Lippe B S U,Raw,Youth A,,83.6,93,40,47.5,-52.5,47.5,47.5,1,B
Danny Preiß,M,KSO Silberrücken,Raw,Youth A,1997,95.2,105,95,102.5,-105,102.5,102.5,1,B
Tobias Haas,M,KSV Bochum,Raw,Juniors,1994,59.8,66,105,112.5,-117.5,112.5,112.5,1,B
Lukas Ritzrow,M,KSO Silberrücken,Raw,Juniors,1992,96.6,105,180,-190,-200,180,180,1,B
Marvin Hess,M,Body Aktiv Oberhausen,Raw,Juniors,1992,112,120,142.5,150,155,155,155,1,B
Rene Böhm,M,KSV Bochum,Raw,Open,1987,48.3,59,55,60,62.5,62.5,62.5,1,B
Onur Fakiroglu,M,KSV Lippe B S U,Raw,Open,1989,72.9,74,70,80,92.5,92.5,92.5,1,B
Christian Pfenniger,M,PL Duisburg,Raw,Open,1987,81.4,83,137.5,142.5,-145,142.5,142.5,1,B
Moritz Westermeier,M,SV Westerholt,Raw,Open,1987,92.9,93,120,-130,130,130,130,1,B
Waldemar Rempel,M,KSV Lippe B S U,Raw,Open,1980,96.8,105,140,150,162.5,162.5,162.5,1,B
Heinrich Rempel,M,KSV Lippe B S U,Raw,Open,1981,100.9,105,150,160,-165,160,160,2,B
Alexander Hagel,M,KSV Bochum,Raw,Open,1977,103.8,105,135,145,155,155,155,3,B
Andreas Schlichenmaier,M,AC Siegen,Raw,Open,1985,113.3,120,-130,130,150,150,150,1,B
Christopher Weise,M,KSV Bochum,Raw,Open,1986,131.5,120+,130,140,145,145,145,1,B
Iris Kunkel,F,AC Siegen,Single-ply,Masters 2,1964,67.8,72,117.5,120,-125,120,120,1,B
Rudi Meier,M,PL Duisburg,Single-ply,Masters 3,1949,81,83,-155,155,,155,155,1,B
Norbert Ritzrow,M,KSO Silberrücken,Single-ply,Masters 4,1940,105.4,120,152.5,157.5,-160,157.5,157.5,1,B
Olaf Brandl,M,AC Siegen,Single-ply,Masters 1,1969,93,93,237.5,245,-255,245,245,1,B
Thomas Gorczytza,M,KSO Silberrücken,Single-ply,Masters 1,1966,105.4,120,120,-125,-127.5,120,120,1,B
Jürgen Rekittke,M,PL Duisburg,Single-ply,Masters 1,1969,161.5,120+,260,-262.5,-280,260,260,1,B
Lars Kriedel,M,SV Westerholt,Single-ply,Open,1976,82.2,83,120,-135,-135,120,120,1,B
Igor Kudrjaschow,M,KSV Lippe B S U,Single-ply,Open,1987,87.9,93,220,-230,-230,220,220,1,B
Marc Hoffmann,M,KSV Essen 88,Single-ply,Open,1979,108.9,120,197.5,210,-215,210,210,1,B
Gerit Krüger,M,KSV Essen 88,Single-ply,Open,1985,108.1,120,190,-200,-200,190,190,2,B
Nicolai Nolte,M,KSV Essen 88,Single-ply,Open,1988,105.2,120,-180,-180,,,,DQ,B
Daniel Keil #1,M,KSV Essen 88,Single-ply,Open,1988,142,120+,275,-300,-300,275,275,G,B
