{
    "baseThemeColor": {"r": "255", "g": "255", "b": "255", "a": "1.0"},
    "primaryThemeColor": {"r": "255", "g": "149", "b": "0", "a": "1.0"},
    "secondaryThemeColor": {"r": "119", "g": "119", "b": "119", "a": "1.0"},
    "backgroundThemeColor": {"r": "243", "g": "250", "b": "252", "a": "1.0"},
    
    "isStatusBarStyleDefault": true,
    "navigationBarTitleColor": {"r": "51", "g": "51", "b": "51", "a": "1.0"},
    "menuBarTitleColor": {"r": "119", "g": "119", "b": "119", "a": "1.0"},
    "menuBarSelectedTitleColor": {"r": "51", "g": "51", "b": "51", "a": "1.0"},
    "menuBarSelectedColor": {"r": "137", "g": "203", "b": "223", "a": "1.0"},
    
    "buttonPrimaryTitleColor": {"r": "255", "g": "255", "b": "255", "a": "1.0"},
    "buttonPrimaryBorderColor": {"r": "255", "g": "149", "b": "0", "a": "0.3"},
    "buttonPrimaryBorderTitleColor": {"r": "255", "g": "149", "b": "0", "a": "1.0"},
    "buttonPrimaryBorderlessTitleColor": {"r": "119", "g": "119", "b": "119", "a": "1.0"},
    
    "linkColor": {"r": "130", "g": "42", "b": "132", "a": "1.0"},
    "adsViewColor": {"r": "196", "g": "216", "b": "237", "a": "1.0"},
    
    "cashVoucherColor": {"r": "51", "g": "51", "b": "51", "a": "1.0"},
    "marketingVoucherColor": {"r": "51", "g": "51", "b": "51", "a": "1.0"},
    
    "backButtonImageName": "lp_ic_back",
    "exitButtonImageName": "lp_ic_exit_black",
    
    "keyboardArrowImageName": "lp_ic_kb_arrow_orange",
    
    "touchIdImageName": "lp_ic_touch_id_orange",
    
    "step2ImageName": "lp_ic_steps_2_changi",
    "step3ImageName": "lp_ic_steps_3_changi",
    "stepMobileImageName": "lp_ic_steps_mobile_orange",
    "stepPinImageName": "lp_ic_steps_pin_orange",
    "stepTouchIdImageName": "lp_ic_steps_touch_id_orange",
    "stepValidImageName": "lp_ic_steps_valid_grey",
    
    "addCardShadowImageName": "lp_ic_add_card_orange",
    "addCardImageName": "lp_ic_add_card_orange",
    
    "voucherHistoryImageName": "lp_ic_voucher_history_orange",
    
    "tickImageName": "lp_ic_tick_orange",
    
    "saveVoucherImageName": "lp_ic_save_voucher_orange",
    
    "voucherActiveImageName": "lp_ic_voucher_active_orange",
    
    "contact_email": "enquiry@changiairport.com",
    "terms_of_use": "https://www.changiairport.com/en/shop/pay/terms-and-conditions.html",
    "privacy_policy": "http://www.changiairport.com/en/privacy-policy.html",
    "faq": "https://www.changiairport.com/en/shop/pay/faqs.html",
    "widget_terms_of_use": "https://www.liquidpaygroup.com/changi-pay-terms-and-conditions/",
    "widget_privacy_policy": "https://www.liquidpaygroup.com/changi-pay-privacy-policy/",
     "contact_no_changi": "(65)65956868",
     "widget_acceptance_outlets": "https://www.changiairport.com/en/shop/pay/outlets.html"
}
