{
    "type": "countries",
    "items": [
        {
            "type": "country",
            "code": "SGP",
            "name": "Singapore",
            "dialing_code": "65",
            "currency_code": "SGD",
            "currency_code_numeric": "702",
            "image_url": "https://test.images.liquidpay.com/regcountry/Singapore.png",
            "short_code": "SG"
        },
        {
            "type": "country",
            "code": "THA",
            "name": "Thailand",
            "dialing_code": "66",
            "currency_code": "THB",
            "currency_code_numeric": "764",
            "image_url": "https://test.images.liquidpay.com/regcountry/Thailand.png",
            "short_code": "TH"
        }
    ]
}
