[
    {
        "title": "test",
        "infoText": "one"
    },
    {
        "title": "test",
        "infoText": "two"
    },
    {
        "title": "post",
        "infoText": "posttest"
    },
    {
        "title": "new post",
        "infoText": "new post test data"
    },
    {
        "title": "post",
        "infoText": "next post data"
    },
    {
        "title": "new post",
        "infoText": "just another post"
    },
    {
        "title": "etst 42",
        "infoText": "sadfsadfasdfsadf"
    },
    {
        "title": "next test",
        "infoText": "new 123"
    },
    {
        "title": "test",
        "infoText": "test"
    },
    {
        "title": "data",
        "infoText": "datat test"
    },
    {
        "title": "Damian",
        "infoText": "damina ist da"
    },
    {
        "title": "hello",
        "infoText": "Hello World."
    }
]