M48
;Layer_Color=9474304
;FILE_FORMAT=2:5
INCH,LZ
;TYPE=PLATED
T1F00S00C0.01575
T2F00S00C0.31496
%
T01
X00227Y0011
X00224Y00242
X00197Y00349
X00259Y0044
X00392Y00529
X004Y00709
X00262Y00702
X00627Y00643
X00682Y00637
X00609Y00576
X00652Y00399
X00635Y00035
X00553Y00029
X00742Y00035
X00807Y01245
X00538
X-00052
X00132Y00434
X-00049Y01873
X-00053Y02502
X00546
X00807
Y01873
X00547
X0054186Y03134
X00819Y03138
X-00053Y03134
T02
X0038486Y01055
X0097486
X-0020714
Y01685
Y02314
X0038486
X0097486
Y01685
X0038486
Y02944
X0097486
X-0020714
M30
