G04 Layer_Physical_Order=2*
G04 Layer_Color=16711680*
%FSLAX25Y25*%
%MOIN*%
G70*
G01*
G75*
%ADD10C,0.01000*%
%ADD14C,0.05906*%
%ADD26C,0.03000*%
%ADD27C,0.02500*%
%ADD28C,0.02000*%
%ADD30C,0.03937*%
%ADD31R,0.03937X0.03937*%
%ADD32C,0.05000*%
%ADD33C,0.15748*%
%ADD34O,0.05000X0.15748*%
G04:AMPARAMS|DCode=35|XSize=78.74mil|YSize=157.48mil|CornerRadius=19.69mil|HoleSize=0mil|Usage=FLASHONLY|Rotation=0.000|XOffset=0mil|YOffset=0mil|HoleType=Round|Shape=RoundedRectangle|*
%AMROUNDEDRECTD35*
21,1,0.07874,0.11811,0,0,0.0*
21,1,0.03937,0.15748,0,0,0.0*
1,1,0.03937,0.01969,-0.05906*
1,1,0.03937,-0.01969,-0.05906*
1,1,0.03937,-0.01969,0.05906*
1,1,0.03937,0.01969,0.05906*
%
%ADD35ROUNDEDRECTD35*%
G04:AMPARAMS|DCode=36|XSize=157.48mil|YSize=78.74mil|CornerRadius=19.69mil|HoleSize=0mil|Usage=FLASHONLY|Rotation=0.000|XOffset=0mil|YOffset=0mil|HoleType=Round|Shape=RoundedRectangle|*
%AMROUNDEDRECTD36*
21,1,0.15748,0.03937,0,0,0.0*
21,1,0.11811,0.07874,0,0,0.0*
1,1,0.03937,0.05906,-0.01969*
1,1,0.03937,-0.05906,-0.01969*
1,1,0.03937,-0.05906,0.01969*
1,1,0.03937,0.05906,0.01969*
%
%ADD36ROUNDEDRECTD36*%
%ADD37R,0.05906X0.05906*%
%ADD38C,0.01969*%
%ADD39C,0.03150*%
%ADD40C,0.08661*%
G36*
X14644Y107588D02*
X14766Y107485D01*
X14891Y107395D01*
X15018Y107317D01*
X15148Y107251D01*
X15281Y107196D01*
X15416Y107154D01*
X15554Y107124D01*
X15695Y107106D01*
X15838Y107100D01*
Y106100D01*
X15695Y106094D01*
X15554Y106076D01*
X15416Y106046D01*
X15281Y106004D01*
X15148Y105949D01*
X15018Y105883D01*
X14891Y105805D01*
X14766Y105714D01*
X14644Y105612D01*
X14525Y105498D01*
Y107702D01*
X14644Y107588D01*
D02*
G37*
G36*
X39688Y113356D02*
X39586Y113234D01*
X39495Y113109D01*
X39417Y112982D01*
X39351Y112852D01*
X39296Y112719D01*
X39254Y112584D01*
X39224Y112446D01*
X39206Y112305D01*
X39200Y112162D01*
X38200D01*
X38194Y112305D01*
X38176Y112446D01*
X38146Y112584D01*
X38104Y112719D01*
X38049Y112852D01*
X37983Y112982D01*
X37905Y113109D01*
X37815Y113234D01*
X37712Y113356D01*
X37598Y113475D01*
X39802D01*
X39688Y113356D01*
D02*
G37*
G36*
X71022Y119500D02*
X70978Y119595D01*
X70919Y119680D01*
X70844Y119755D01*
X70754Y119820D01*
X70649Y119875D01*
X70528Y119920D01*
X70391Y119955D01*
X70240Y119980D01*
X70073Y119995D01*
X69890Y120000D01*
Y121000D01*
X70073Y121005D01*
X70240Y121020D01*
X70391Y121045D01*
X70528Y121080D01*
X70649Y121125D01*
X70754Y121180D01*
X70844Y121245D01*
X70919Y121320D01*
X70978Y121405D01*
X71022Y121500D01*
Y119500D01*
D02*
G37*
G36*
X135333Y72322D02*
X135498Y72210D01*
X135685Y72111D01*
X135894Y72026D01*
X136125Y71954D01*
X136377Y71896D01*
X136651Y71852D01*
X136947Y71822D01*
X137603Y71802D01*
X135128Y69327D01*
X135125Y69666D01*
X135078Y70279D01*
X135033Y70553D01*
X134976Y70805D01*
X134904Y71036D01*
X134819Y71245D01*
X134720Y71432D01*
X134608Y71597D01*
X134482Y71741D01*
X135189Y72448D01*
X135333Y72322D01*
D02*
G37*
G36*
X148636Y72844D02*
X148658Y72606D01*
X148696Y72379D01*
X148748Y72162D01*
X148816Y71956D01*
X148898Y71761D01*
X148996Y71576D01*
X149108Y71403D01*
X149236Y71239D01*
X149378Y71087D01*
X145878D01*
X146021Y71239D01*
X146148Y71403D01*
X146261Y71576D01*
X146358Y71761D01*
X146441Y71956D01*
X146508Y72162D01*
X146561Y72379D01*
X146598Y72606D01*
X146621Y72844D01*
X146628Y73093D01*
X148628D01*
X148636Y72844D01*
D02*
G37*
G36*
X12275Y105498D02*
X12156Y105612D01*
X12034Y105714D01*
X11909Y105805D01*
X11782Y105883D01*
X11652Y105949D01*
X11519Y106004D01*
X11384Y106046D01*
X11246Y106076D01*
X11105Y106094D01*
X10962Y106100D01*
Y107100D01*
X11105Y107106D01*
X11246Y107124D01*
X11384Y107154D01*
X11519Y107196D01*
X11652Y107251D01*
X11782Y107317D01*
X11909Y107395D01*
X12034Y107485D01*
X12156Y107588D01*
X12275Y107702D01*
Y105498D01*
D02*
G37*
G36*
X906Y120895D02*
X924Y120754D01*
X954Y120616D01*
X996Y120481D01*
X1051Y120348D01*
X1117Y120218D01*
X1195Y120091D01*
X1285Y119966D01*
X1388Y119844D01*
X1502Y119725D01*
X-702D01*
X-588Y119844D01*
X-485Y119966D01*
X-395Y120091D01*
X-317Y120218D01*
X-251Y120348D01*
X-196Y120481D01*
X-154Y120616D01*
X-124Y120754D01*
X-106Y120895D01*
X-100Y121038D01*
X900D01*
X906Y120895D01*
D02*
G37*
G36*
X70998Y128753D02*
X70991Y128762D01*
X70972Y128770D01*
X70941Y128777D01*
X70898Y128783D01*
X70779Y128792D01*
X70400Y128800D01*
Y129800D01*
X70512Y129800D01*
X70972Y129830D01*
X70991Y129838D01*
X70998Y129847D01*
Y128753D01*
D02*
G37*
G36*
X114882Y128475D02*
X113740Y127233D01*
X113740Y127227D01*
X113779Y127027D01*
X113830Y126840D01*
X113892Y126665D01*
X113967Y126504D01*
X114053Y126356D01*
X114151Y126220D01*
X114261Y126098D01*
X113554Y125391D01*
X113432Y125501D01*
X113296Y125599D01*
X113148Y125685D01*
X112987Y125759D01*
X112812Y125822D01*
X112625Y125873D01*
X112425Y125912D01*
X112211Y125939D01*
X111985Y125954D01*
X111746Y125958D01*
X113270Y127482D01*
X113084Y129351D01*
X113213Y129241D01*
X113344Y129157D01*
X113475Y129099D01*
X113607Y129068D01*
X113739Y129062D01*
X113873Y129082D01*
X114007Y129128D01*
X114143Y129200D01*
X114278Y129298D01*
X114415Y129422D01*
X114882Y128475D01*
D02*
G37*
G36*
X53543Y131811D02*
X53441Y131689D01*
X53350Y131564D01*
X53272Y131437D01*
X53206Y131307D01*
X53152Y131174D01*
X53109Y131039D01*
X53079Y130901D01*
X53061Y130760D01*
X53055Y130617D01*
X52055D01*
X52049Y130760D01*
X52031Y130901D01*
X52001Y131039D01*
X51959Y131174D01*
X51904Y131307D01*
X51838Y131437D01*
X51760Y131564D01*
X51670Y131689D01*
X51567Y131811D01*
X51453Y131930D01*
X53658D01*
X53543Y131811D01*
D02*
G37*
G36*
X64875Y123560D02*
X64894Y123514D01*
X64920Y123464D01*
X64954Y123411D01*
X64994Y123353D01*
X65096Y123226D01*
X65226Y123083D01*
X65302Y123005D01*
X64780Y122113D01*
X64703Y122187D01*
X64557Y122307D01*
X64487Y122353D01*
X64420Y122390D01*
X64356Y122418D01*
X64294Y122438D01*
X64234Y122448D01*
X64177Y122449D01*
X64122Y122441D01*
X64863Y123602D01*
X64875Y123560D01*
D02*
G37*
G36*
X121177Y129137D02*
X121348Y128988D01*
X121518Y128856D01*
X121688Y128742D01*
X121856Y128646D01*
X122023Y128567D01*
X122190Y128505D01*
X122356Y128461D01*
X122521Y128435D01*
X122685Y128426D01*
Y127426D01*
X122521Y127417D01*
X122356Y127391D01*
X122190Y127347D01*
X122023Y127286D01*
X121856Y127207D01*
X121688Y127110D01*
X121518Y126996D01*
X121348Y126864D01*
X121177Y126715D01*
X121006Y126548D01*
Y129304D01*
X121177Y129137D01*
D02*
G37*
G36*
X126681Y127426D02*
X126498Y127419D01*
X126349Y127398D01*
X126235Y127362D01*
X126154Y127313D01*
X126108Y127249D01*
X126096Y127171D01*
X126118Y127079D01*
X126174Y126973D01*
X126264Y126853D01*
X126388Y126719D01*
X124974D01*
X124830Y126853D01*
X124680Y126973D01*
X124523Y127079D01*
X124362Y127171D01*
X124194Y127249D01*
X124020Y127313D01*
X123841Y127362D01*
X123655Y127398D01*
X123464Y127419D01*
X123267Y127426D01*
X124474Y128426D01*
X126681Y127426D01*
D02*
G37*
G36*
X264575Y7798D02*
X264456Y7912D01*
X264334Y8015D01*
X264209Y8105D01*
X264082Y8183D01*
X263952Y8249D01*
X263819Y8304D01*
X263684Y8346D01*
X263546Y8376D01*
X263405Y8394D01*
X263262Y8400D01*
Y9400D01*
X263405Y9406D01*
X263546Y9424D01*
X263684Y9454D01*
X263819Y9496D01*
X263952Y9551D01*
X264082Y9617D01*
X264209Y9695D01*
X264334Y9786D01*
X264456Y9888D01*
X264575Y10002D01*
Y7798D01*
D02*
G37*
G36*
X191033Y16162D02*
X190948Y16131D01*
X190873Y16081D01*
X190808Y16010D01*
X190753Y15919D01*
X190708Y15807D01*
X190673Y15676D01*
X190648Y15524D01*
X190633Y15352D01*
X190628Y15160D01*
X189628D01*
X189623Y15352D01*
X189608Y15524D01*
X189583Y15676D01*
X189548Y15807D01*
X189503Y15919D01*
X189448Y16010D01*
X189383Y16081D01*
X189308Y16131D01*
X189223Y16162D01*
X189128Y16172D01*
X191128D01*
X191033Y16162D01*
D02*
G37*
G36*
X239436Y31821D02*
X239310Y31694D01*
X238834Y31148D01*
X238801Y31094D01*
X238781Y31050D01*
X238775Y31016D01*
X237216Y32575D01*
X237250Y32581D01*
X237294Y32601D01*
X237348Y32634D01*
X237413Y32680D01*
X237575Y32812D01*
X237777Y32997D01*
X238021Y33235D01*
X239436Y31821D01*
D02*
G37*
G36*
X283166Y4161D02*
X283115Y4168D01*
X283035Y4175D01*
X282195Y4197D01*
X281339Y4200D01*
X281062Y5200D01*
X281217Y5206D01*
X281357Y5226D01*
X281482Y5257D01*
X281591Y5302D01*
X281686Y5359D01*
X281765Y5429D01*
X281830Y5512D01*
X281879Y5608D01*
X281912Y5716D01*
X281931Y5837D01*
X283166Y4161D01*
D02*
G37*
G36*
X237675Y7798D02*
X237556Y7912D01*
X237434Y8015D01*
X237309Y8105D01*
X237182Y8183D01*
X237052Y8249D01*
X236919Y8304D01*
X236784Y8346D01*
X236646Y8376D01*
X236505Y8394D01*
X236362Y8400D01*
Y9400D01*
X236505Y9406D01*
X236646Y9424D01*
X236784Y9454D01*
X236919Y9496D01*
X237052Y9551D01*
X237182Y9617D01*
X237309Y9695D01*
X237434Y9786D01*
X237556Y9888D01*
X237675Y10002D01*
Y7798D01*
D02*
G37*
G36*
X240044Y9888D02*
X240166Y9786D01*
X240291Y9695D01*
X240418Y9617D01*
X240548Y9551D01*
X240681Y9496D01*
X240816Y9454D01*
X240954Y9424D01*
X241095Y9406D01*
X241238Y9400D01*
Y8400D01*
X241095Y8394D01*
X240954Y8376D01*
X240816Y8346D01*
X240681Y8304D01*
X240548Y8249D01*
X240418Y8183D01*
X240291Y8105D01*
X240166Y8015D01*
X240044Y7912D01*
X239925Y7798D01*
Y10002D01*
X240044Y9888D01*
D02*
G37*
G36*
X81601Y32583D02*
X81650Y31860D01*
X81665Y31798D01*
X81683Y31753D01*
X81702Y31725D01*
X79498D01*
X79517Y31753D01*
X79535Y31798D01*
X79550Y31860D01*
X79563Y31939D01*
X79584Y32146D01*
X79596Y32420D01*
X79600Y32761D01*
X81600D01*
X81601Y32583D01*
D02*
G37*
G36*
X110843Y57552D02*
X110601Y57789D01*
X110134Y58189D01*
X109908Y58352D01*
X109689Y58489D01*
X109476Y58602D01*
X109268Y58689D01*
X109066Y58752D01*
X108869Y58789D01*
X108679Y58802D01*
Y59802D01*
X108869Y59814D01*
X109066Y59852D01*
X109268Y59914D01*
X109476Y60002D01*
X109689Y60114D01*
X109908Y60252D01*
X110134Y60414D01*
X110364Y60602D01*
X110843Y61052D01*
Y57552D01*
D02*
G37*
G36*
X123141Y63060D02*
X123178Y62864D01*
X123241Y62662D01*
X123328Y62454D01*
X123441Y62241D01*
X123578Y62021D01*
X123741Y61796D01*
X123928Y61566D01*
X124378Y61087D01*
X120878D01*
X121116Y61329D01*
X121516Y61796D01*
X121678Y62021D01*
X121816Y62241D01*
X121928Y62454D01*
X122016Y62662D01*
X122078Y62864D01*
X122116Y63060D01*
X122128Y63251D01*
X123128D01*
X123141Y63060D01*
D02*
G37*
G36*
X115843Y67552D02*
X115601Y67789D01*
X115134Y68189D01*
X114909Y68352D01*
X114689Y68489D01*
X114476Y68602D01*
X114268Y68689D01*
X114066Y68752D01*
X113869Y68789D01*
X113679Y68802D01*
Y69802D01*
X113869Y69814D01*
X114066Y69852D01*
X114268Y69914D01*
X114476Y70002D01*
X114689Y70114D01*
X114909Y70252D01*
X115134Y70414D01*
X115364Y70602D01*
X115843Y71052D01*
Y67552D01*
D02*
G37*
G36*
X182292Y42702D02*
X182305Y42986D01*
X182248Y43241D01*
X182120Y43466D01*
X181921Y43661D01*
X181652Y43825D01*
X181312Y43960D01*
X180902Y44065D01*
X180422Y44140D01*
X179871Y44185D01*
X179249Y44200D01*
X179292Y47200D01*
X179717Y47214D01*
X180136Y47255D01*
X180547Y47324D01*
X180952Y47421D01*
X181349Y47546D01*
X181740Y47698D01*
X182124Y47877D01*
X182502Y48085D01*
X182872Y48320D01*
X183236Y48582D01*
X182292Y42702D01*
D02*
G37*
G36*
X175737Y47879D02*
X176001Y47736D01*
X176296Y47611D01*
X176623Y47502D01*
X176982Y47409D01*
X177371Y47334D01*
X177792Y47275D01*
X178728Y47208D01*
X179243Y47200D01*
Y44200D01*
X178728Y44192D01*
X177792Y44125D01*
X177371Y44066D01*
X176982Y43991D01*
X176623Y43898D01*
X176296Y43789D01*
X176001Y43664D01*
X175737Y43521D01*
X175504Y43362D01*
Y48038D01*
X175737Y47879D01*
D02*
G37*
G36*
X225153Y59583D02*
X225198Y59566D01*
X225260Y59550D01*
X225339Y59537D01*
X225546Y59516D01*
X225820Y59504D01*
X226161Y59500D01*
Y57500D01*
X225982Y57499D01*
X225260Y57450D01*
X225198Y57434D01*
X225153Y57417D01*
X225125Y57398D01*
Y59602D01*
X225153Y59583D01*
D02*
G37*
G36*
X62607Y169000D02*
X62410Y168993D01*
X62219Y168972D01*
X62033Y168936D01*
X61854Y168887D01*
X61680Y168823D01*
X61513Y168745D01*
X61351Y168654D01*
X61195Y168547D01*
X61044Y168427D01*
X60900Y168293D01*
X59486D01*
X59610Y168427D01*
X59700Y168547D01*
X59756Y168654D01*
X59778Y168745D01*
X59766Y168823D01*
X59720Y168887D01*
X59639Y168936D01*
X59525Y168972D01*
X59376Y168993D01*
X59193Y169000D01*
X61400Y170000D01*
X62607Y169000D01*
D02*
G37*
G36*
X70306Y171823D02*
X70325Y171682D01*
X70357Y171545D01*
X70401Y171412D01*
X70457Y171282D01*
X70526Y171157D01*
X70608Y171035D01*
X70702Y170917D01*
X70809Y170803D01*
X70929Y170692D01*
X68775Y170555D01*
Y168398D01*
X68656Y168512D01*
X68534Y168614D01*
X68409Y168705D01*
X68282Y168783D01*
X68152Y168849D01*
X68019Y168904D01*
X67884Y168946D01*
X67746Y168976D01*
X67605Y168994D01*
X67462Y169000D01*
Y170000D01*
X67605Y170006D01*
X67746Y170024D01*
X67884Y170054D01*
X68019Y170096D01*
X68152Y170151D01*
X68282Y170217D01*
X68409Y170295D01*
X68534Y170386D01*
X68656Y170488D01*
X68751Y170579D01*
X68837Y170680D01*
X68934Y170810D01*
X69020Y170941D01*
X69094Y171074D01*
X69157Y171208D01*
X69209Y171343D01*
X69249Y171480D01*
X69277Y171619D01*
X69294Y171759D01*
X69300Y171901D01*
X70300Y171968D01*
X70306Y171823D01*
D02*
G37*
G36*
X80421Y174993D02*
X80550Y174885D01*
X80675Y174795D01*
X80796Y174724D01*
X80914Y174670D01*
X81027Y174635D01*
X81137Y174617D01*
X81243Y174617D01*
X81344Y174635D01*
X81443Y174672D01*
X80028Y173257D01*
X80065Y173355D01*
X80083Y173457D01*
X80083Y173563D01*
X80066Y173673D01*
X80030Y173786D01*
X79976Y173904D01*
X79905Y174025D01*
X79815Y174150D01*
X79707Y174279D01*
X79582Y174411D01*
X80289Y175118D01*
X80421Y174993D01*
D02*
G37*
G36*
X83700Y164740D02*
X83710Y164412D01*
X83739Y164097D01*
X83788Y163798D01*
X83856Y163513D01*
X83943Y163242D01*
X84050Y162985D01*
X84176Y162743D01*
X84322Y162515D01*
X84488Y162302D01*
X84672Y162103D01*
X80675Y162239D01*
X80870Y162423D01*
X81044Y162624D01*
X81198Y162841D01*
X81331Y163074D01*
X81444Y163323D01*
X81536Y163588D01*
X81608Y163870D01*
X81659Y164168D01*
X81690Y164482D01*
X81700Y164812D01*
X83700Y164740D01*
D02*
G37*
G36*
X5488Y164356D02*
X5385Y164234D01*
X5295Y164109D01*
X5217Y163982D01*
X5151Y163852D01*
X5096Y163719D01*
X5054Y163584D01*
X5024Y163446D01*
X5006Y163305D01*
X5000Y163162D01*
X4000D01*
X3994Y163305D01*
X3976Y163446D01*
X3946Y163584D01*
X3904Y163719D01*
X3849Y163852D01*
X3783Y163982D01*
X3705Y164109D01*
X3615Y164234D01*
X3512Y164356D01*
X3398Y164475D01*
X5602D01*
X5488Y164356D01*
D02*
G37*
G36*
X84510Y169636D02*
X84340Y169429D01*
X84190Y169207D01*
X84060Y168969D01*
X83950Y168716D01*
X83860Y168448D01*
X83790Y168164D01*
X83740Y167865D01*
X83710Y167551D01*
X83700Y167222D01*
X81700D01*
X81690Y167551D01*
X81660Y167865D01*
X81610Y168164D01*
X81540Y168448D01*
X81450Y168716D01*
X81340Y168969D01*
X81210Y169207D01*
X81060Y169429D01*
X80890Y169636D01*
X80700Y169828D01*
X84700D01*
X84510Y169636D01*
D02*
G37*
G36*
X70310Y176810D02*
X70340Y176640D01*
X70390Y176490D01*
X70460Y176360D01*
X70550Y176250D01*
X70660Y176160D01*
X70790Y176090D01*
X70940Y176040D01*
X71110Y176010D01*
X71300Y176000D01*
Y175000D01*
X71110Y174990D01*
X70940Y174960D01*
X70790Y174910D01*
X70660Y174840D01*
X70550Y174750D01*
X70460Y174640D01*
X70390Y174510D01*
X70340Y174360D01*
X70310Y174190D01*
X70300Y174000D01*
X69300Y175500D01*
X70300Y177000D01*
X70310Y176810D01*
D02*
G37*
G36*
X27975Y184798D02*
X27856Y184912D01*
X27734Y185014D01*
X27609Y185105D01*
X27482Y185183D01*
X27352Y185249D01*
X27219Y185304D01*
X27084Y185346D01*
X26946Y185376D01*
X26805Y185394D01*
X26662Y185400D01*
Y186400D01*
X26805Y186406D01*
X26946Y186424D01*
X27084Y186454D01*
X27219Y186496D01*
X27352Y186551D01*
X27482Y186617D01*
X27609Y186695D01*
X27734Y186785D01*
X27856Y186888D01*
X27975Y187002D01*
Y184798D01*
D02*
G37*
G36*
X96322Y185800D02*
X96278Y185895D01*
X96219Y185980D01*
X96144Y186055D01*
X96054Y186120D01*
X95949Y186175D01*
X95828Y186220D01*
X95692Y186255D01*
X95540Y186280D01*
X95372Y186295D01*
X95190Y186300D01*
Y187300D01*
X95372Y187305D01*
X95540Y187320D01*
X95692Y187345D01*
X95828Y187380D01*
X95949Y187425D01*
X96054Y187480D01*
X96144Y187545D01*
X96219Y187620D01*
X96278Y187705D01*
X96322Y187800D01*
Y185800D01*
D02*
G37*
G36*
X93144Y187453D02*
X93192Y187421D01*
X93247Y187393D01*
X93309Y187368D01*
X93379Y187347D01*
X93457Y187330D01*
X93541Y187317D01*
X93633Y187308D01*
X93838Y187300D01*
Y186300D01*
X93732Y186298D01*
X93541Y186283D01*
X93457Y186270D01*
X93379Y186253D01*
X93309Y186232D01*
X93247Y186207D01*
X93192Y186179D01*
X93144Y186147D01*
X93103Y186111D01*
Y187489D01*
X93144Y187453D01*
D02*
G37*
G36*
X90735Y180145D02*
X90717Y180043D01*
X90717Y179937D01*
X90734Y179827D01*
X90770Y179714D01*
X90824Y179596D01*
X90895Y179475D01*
X90985Y179350D01*
X91093Y179221D01*
X91218Y179089D01*
X90511Y178382D01*
X90379Y178507D01*
X90250Y178615D01*
X90125Y178705D01*
X90004Y178776D01*
X89886Y178830D01*
X89773Y178866D01*
X89663Y178883D01*
X89557Y178883D01*
X89455Y178865D01*
X89357Y178828D01*
X90772Y180243D01*
X90735Y180145D01*
D02*
G37*
G36*
X85322Y180500D02*
X85278Y180595D01*
X85219Y180680D01*
X85144Y180755D01*
X85054Y180820D01*
X84949Y180875D01*
X84828Y180920D01*
X84692Y180955D01*
X84540Y180980D01*
X84373Y180995D01*
X84190Y181000D01*
Y182000D01*
X84373Y182005D01*
X84540Y182020D01*
X84692Y182045D01*
X84828Y182080D01*
X84949Y182125D01*
X85054Y182180D01*
X85144Y182245D01*
X85219Y182320D01*
X85278Y182405D01*
X85322Y182500D01*
Y180500D01*
D02*
G37*
G36*
X82344Y182153D02*
X82392Y182121D01*
X82447Y182093D01*
X82509Y182068D01*
X82579Y182047D01*
X82657Y182030D01*
X82741Y182017D01*
X82833Y182008D01*
X83038Y182000D01*
Y181000D01*
X82932Y180998D01*
X82741Y180983D01*
X82657Y180970D01*
X82579Y180953D01*
X82509Y180932D01*
X82447Y180907D01*
X82392Y180879D01*
X82344Y180847D01*
X82303Y180811D01*
Y182189D01*
X82344Y182153D01*
D02*
G37*
G36*
X111710Y138776D02*
X111739Y138609D01*
X111788Y138449D01*
X111856Y138296D01*
X111945Y138150D01*
X112052Y138011D01*
X112179Y137878D01*
X112326Y137753D01*
X112492Y137634D01*
X112678Y137523D01*
X110320Y136869D01*
Y134422D01*
X110149Y134589D01*
X109978Y134738D01*
X109808Y134870D01*
X109638Y134984D01*
X109470Y135081D01*
X109303Y135160D01*
X109136Y135221D01*
X108970Y135265D01*
X108805Y135291D01*
X108641Y135300D01*
Y136300D01*
X108805Y136309D01*
X108970Y136335D01*
X109136Y136379D01*
X109303Y136441D01*
X109470Y136520D01*
X109638Y136616D01*
X109808Y136730D01*
X109978Y136862D01*
X110149Y137011D01*
X110149Y137011D01*
X110151Y137016D01*
X110456Y137648D01*
X110531Y137840D01*
X110639Y138196D01*
X110673Y138361D01*
X110693Y138515D01*
X110700Y138661D01*
X111700Y138949D01*
X111710Y138776D01*
D02*
G37*
G36*
X120400Y138780D02*
X120408Y138624D01*
X120431Y138463D01*
X120470Y138297D01*
X120524Y138125D01*
X120594Y137948D01*
X120679Y137765D01*
X120780Y137577D01*
X121029Y137184D01*
X121176Y136979D01*
X118452Y137399D01*
X118632Y137537D01*
X118793Y137679D01*
X118936Y137824D01*
X119059Y137972D01*
X119163Y138124D01*
X119248Y138280D01*
X119315Y138440D01*
X119362Y138603D01*
X119390Y138769D01*
X119400Y138939D01*
X120400Y138780D01*
D02*
G37*
G36*
X74505Y142543D02*
X74520Y142376D01*
X74546Y142225D01*
X74581Y142090D01*
X74626Y141971D01*
X74682Y141867D01*
X74748Y141779D01*
X74823Y141707D01*
X74909Y141651D01*
X75005Y141611D01*
X73006Y141543D01*
X73100Y141590D01*
X73184Y141652D01*
X73258Y141729D01*
X73322Y141821D01*
X73377Y141928D01*
X73421Y142051D01*
X73456Y142188D01*
X73480Y142341D01*
X73495Y142508D01*
X73500Y142691D01*
X74500Y142726D01*
X74505Y142543D01*
D02*
G37*
G36*
X67788Y132836D02*
X67799Y132779D01*
X67818Y132720D01*
X67845Y132659D01*
X67879Y132594D01*
X67922Y132528D01*
X67972Y132459D01*
X68031Y132387D01*
X68171Y132237D01*
X67463Y131529D01*
X67387Y131603D01*
X67241Y131728D01*
X67172Y131778D01*
X67106Y131820D01*
X67041Y131855D01*
X66980Y131882D01*
X66921Y131901D01*
X66864Y131912D01*
X66810Y131916D01*
X67784Y132890D01*
X67788Y132836D01*
D02*
G37*
G36*
X59106Y133895D02*
X59124Y133754D01*
X59154Y133616D01*
X59196Y133481D01*
X59251Y133348D01*
X59317Y133218D01*
X59395Y133091D01*
X59486Y132966D01*
X59588Y132844D01*
X59702Y132725D01*
X57498D01*
X57612Y132844D01*
X57714Y132966D01*
X57805Y133091D01*
X57883Y133218D01*
X57949Y133348D01*
X58004Y133481D01*
X58046Y133616D01*
X58076Y133754D01*
X58094Y133895D01*
X58100Y134038D01*
X59100D01*
X59106Y133895D01*
D02*
G37*
G36*
X118242Y134375D02*
X118113Y134485D01*
X117982Y134569D01*
X117851Y134627D01*
X117719Y134659D01*
X117587Y134664D01*
X117453Y134644D01*
X117319Y134598D01*
X117183Y134526D01*
X117048Y134428D01*
X116911Y134304D01*
X116444Y135251D01*
X117988Y136930D01*
X118242Y134375D01*
D02*
G37*
G36*
X5488Y143556D02*
X5385Y143434D01*
X5295Y143309D01*
X5217Y143182D01*
X5151Y143052D01*
X5096Y142919D01*
X5054Y142784D01*
X5024Y142646D01*
X5006Y142505D01*
X5000Y142362D01*
X4000D01*
X3994Y142505D01*
X3976Y142646D01*
X3946Y142784D01*
X3904Y142919D01*
X3849Y143052D01*
X3783Y143182D01*
X3705Y143309D01*
X3615Y143434D01*
X3512Y143556D01*
X3398Y143675D01*
X5602D01*
X5488Y143556D01*
D02*
G37*
G36*
X120805Y145478D02*
X120720Y145419D01*
X120645Y145344D01*
X120580Y145254D01*
X120525Y145149D01*
X120480Y145028D01*
X120445Y144892D01*
X120420Y144740D01*
X120405Y144572D01*
X120400Y144390D01*
X119400D01*
X119395Y144572D01*
X119380Y144740D01*
X119355Y144892D01*
X119320Y145028D01*
X119275Y145149D01*
X119220Y145254D01*
X119155Y145344D01*
X119080Y145419D01*
X118995Y145478D01*
X118900Y145522D01*
X120900D01*
X120805Y145478D01*
D02*
G37*
G36*
X141605D02*
X141520Y145419D01*
X141445Y145344D01*
X141380Y145254D01*
X141325Y145149D01*
X141280Y145028D01*
X141245Y144892D01*
X141220Y144740D01*
X141205Y144572D01*
X141200Y144390D01*
X140200D01*
X140195Y144572D01*
X140180Y144740D01*
X140155Y144892D01*
X140120Y145028D01*
X140075Y145149D01*
X140020Y145254D01*
X139955Y145344D01*
X139880Y145419D01*
X139795Y145478D01*
X139700Y145522D01*
X141700D01*
X141605Y145478D01*
D02*
G37*
G36*
X5006Y147095D02*
X5024Y146954D01*
X5054Y146816D01*
X5096Y146681D01*
X5151Y146548D01*
X5217Y146418D01*
X5295Y146291D01*
X5385Y146166D01*
X5488Y146044D01*
X5602Y145925D01*
X3398D01*
X3512Y146044D01*
X3615Y146166D01*
X3705Y146291D01*
X3783Y146418D01*
X3849Y146548D01*
X3904Y146681D01*
X3946Y146816D01*
X3976Y146954D01*
X3994Y147095D01*
X4000Y147238D01*
X5000D01*
X5006Y147095D01*
D02*
G37*
G36*
X131405Y145078D02*
X131320Y145019D01*
X131245Y144944D01*
X131180Y144854D01*
X131125Y144749D01*
X131080Y144628D01*
X131045Y144492D01*
X131020Y144340D01*
X131005Y144173D01*
X131000Y143990D01*
X130000D01*
X129995Y144173D01*
X129980Y144340D01*
X129955Y144492D01*
X129920Y144628D01*
X129875Y144749D01*
X129820Y144854D01*
X129755Y144944D01*
X129680Y145019D01*
X129595Y145078D01*
X129500Y145122D01*
X131500D01*
X131405Y145078D01*
D02*
G37*
G36*
X74653Y144956D02*
X74621Y144908D01*
X74593Y144853D01*
X74568Y144790D01*
X74547Y144721D01*
X74530Y144643D01*
X74517Y144559D01*
X74508Y144467D01*
X74500Y144262D01*
X73500D01*
X73498Y144368D01*
X73483Y144559D01*
X73470Y144643D01*
X73453Y144721D01*
X73432Y144790D01*
X73407Y144853D01*
X73379Y144908D01*
X73347Y144956D01*
X73311Y144997D01*
X74689D01*
X74653Y144956D01*
D02*
G37*
G36*
X112105Y145378D02*
X112020Y145319D01*
X111945Y145244D01*
X111880Y145154D01*
X111825Y145049D01*
X111780Y144928D01*
X111745Y144791D01*
X111720Y144640D01*
X111705Y144473D01*
X111700Y144290D01*
X110700D01*
X110695Y144473D01*
X110680Y144640D01*
X110655Y144791D01*
X110620Y144928D01*
X110575Y145049D01*
X110520Y145154D01*
X110455Y145244D01*
X110380Y145319D01*
X110295Y145378D01*
X110200Y145422D01*
X112200D01*
X112105Y145378D01*
D02*
G37*
D10*
X50755Y9145D02*
G03*
X51285Y7870I1800J0D01*
G01*
X55727Y3427D02*
G03*
X57000Y2900I1273J1273D01*
G01*
X55725Y3430D02*
G03*
X57000Y2900I1275J1270D01*
G01*
X50755Y9145D02*
G03*
X51282Y7872I1800J0D01*
G01*
X22361Y51002D02*
G03*
X22361Y51002I-4253J0D01*
G01*
Y61002D02*
G03*
X22361Y61002I-4253J0D01*
G01*
Y71002D02*
G03*
X22361Y71002I-4253J0D01*
G01*
Y81002D02*
G03*
X22361Y81002I-4253J0D01*
G01*
Y91002D02*
G03*
X22361Y91002I-4253J0D01*
G01*
X78974Y37826D02*
G03*
X78300Y36200I1626J-1626D01*
G01*
X78273Y32609D02*
G03*
X83675Y30600I2327J-2009D01*
G01*
X78974Y37826D02*
G03*
X78300Y36200I1626J-1626D01*
G01*
X62826Y39928D02*
G03*
X64102Y39398I1275J1270D01*
G01*
X62829Y39926D02*
G03*
X64102Y39398I1273J1273D01*
G01*
X59800Y43700D02*
G03*
X60327Y42427I1800J0D01*
G01*
X59800Y43700D02*
G03*
X60330Y42425I1800J0D01*
G01*
X75944Y51198D02*
G03*
X75944Y51198I-4253J0D01*
G01*
X107944Y14810D02*
G03*
X107944Y14810I-3800J0D01*
G01*
X99036Y37154D02*
G03*
X116861Y34102I8651J-3053D01*
G01*
X117944Y14810D02*
G03*
X117944Y14810I-3800J0D01*
G01*
X83675Y30600D02*
G03*
X82928Y32609I-3075J0D01*
G01*
X84226Y36574D02*
G03*
X84900Y38200I-1626J1626D01*
G01*
X84226Y36574D02*
G03*
X84900Y38200I-1626J1626D01*
G01*
X95616Y40936D02*
G03*
X99036Y37154I3800J0D01*
G01*
X116861Y34102D02*
G03*
X103216Y42112I-9174J0D01*
G01*
Y51683D02*
G03*
X95616Y51683I-3800J0D01*
G01*
X75944Y61198D02*
G03*
X75944Y61198I-4253J0D01*
G01*
Y71198D02*
G03*
X75944Y71198I-4253J0D01*
G01*
X98600Y62400D02*
G03*
X99130Y61125I1800J0D01*
G01*
X98600Y62400D02*
G03*
X99127Y61127I1800J0D01*
G01*
X75944Y81198D02*
G03*
X75944Y81198I-4253J0D01*
G01*
Y91198D02*
G03*
X75944Y91198I-4253J0D01*
G01*
X85084Y69500D02*
G03*
X80300Y68561I-2484J0D01*
G01*
X84900D02*
G03*
X85084Y69500I-2300J939D01*
G01*
X102223Y58031D02*
G03*
X103498Y57502I1275J1270D01*
G01*
X102226Y58029D02*
G03*
X103498Y57502I1273J1273D01*
G01*
X105326Y68029D02*
G03*
X106598Y67502I1273J1273D01*
G01*
X105323Y68031D02*
G03*
X106598Y67502I1275J1270D01*
G01*
X110026Y56533D02*
G03*
X116428Y59302I2603J2769D01*
G01*
D02*
G03*
X110037Y62081I-3800J0D01*
G01*
X115026Y66533D02*
G03*
X120828Y67252I2603J2769D01*
G01*
X114995Y96430D02*
G03*
X114995Y96430I-3269J0D01*
G01*
X120828Y71351D02*
G03*
X115037Y72081I-3200J-2049D01*
G01*
X122600Y97727D02*
G03*
X122600Y95132I-3000J-1297D01*
G01*
Y89853D02*
G03*
X122600Y87258I-3000J-1297D01*
G01*
X2700Y108800D02*
G03*
X3227Y107527I1800J0D01*
G01*
X2700Y108800D02*
G03*
X3230Y107525I1800J0D01*
G01*
X5425Y105330D02*
G03*
X6700Y104800I1275J1270D01*
G01*
X5427Y105327D02*
G03*
X6700Y104800I1273J1273D01*
G01*
X-1730Y120530D02*
G03*
X2700Y116875I2131J-1930D01*
G01*
X10925Y104775D02*
G03*
X15875Y104775I2475J1825D01*
G01*
X35100Y104800D02*
G03*
X36375Y105330I0J1800D01*
G01*
X35100Y104800D02*
G03*
X36373Y105327I0J1800D01*
G01*
X15875Y108425D02*
G03*
X10925Y108425I-2475J-1825D01*
G01*
X41775Y114600D02*
G03*
X36875Y112125I-3075J0D01*
G01*
X6325Y142325D02*
G03*
X7575Y144800I-1825J2475D01*
G01*
D02*
G03*
X6325Y147275I-3075J0D01*
G01*
X39973Y108927D02*
G03*
X40500Y110200I-1273J1273D01*
G01*
X39970Y108925D02*
G03*
X40500Y110200I-1270J1275D01*
G01*
X40525Y112125D02*
G03*
X41775Y114600I-1825J2475D01*
G01*
X65825Y119230D02*
G03*
X67100Y118700I1275J1270D01*
G01*
X65827Y119227D02*
G03*
X67100Y118700I1273J1273D01*
G01*
X63400Y121171D02*
G03*
X63926Y121116I500J2229D01*
G01*
X66061Y124141D02*
G03*
X63400Y125629I-2161J-741D01*
G01*
X54686Y131125D02*
G03*
X55430Y133055I-2131J1930D01*
G01*
D02*
G03*
X50425Y131125I-2875J0D01*
G01*
X56775Y134075D02*
G03*
X59800Y128769I1825J-2475D01*
G01*
X64400Y155700D02*
G03*
X63127Y155173I0J-1800D01*
G01*
X64400Y155700D02*
G03*
X63125Y155170I0J-1800D01*
G01*
X69061Y133226D02*
G03*
X66475Y130639I-2261J-326D01*
G01*
X69127Y128027D02*
G03*
X70029Y127539I1273J1273D01*
G01*
X69125Y128030D02*
G03*
X70029Y127539I1275J1270D01*
G01*
X6325Y163125D02*
G03*
X7575Y165600I-1825J2475D01*
G01*
D02*
G03*
X2200Y167641I-3075J0D01*
G01*
X36957Y167051D02*
G03*
X37662Y162900I-1857J-2451D01*
G01*
X-870Y177375D02*
G03*
X-1400Y176100I1270J-1275D01*
G01*
X-873Y177373D02*
G03*
X-1400Y176100I1273J-1273D01*
G01*
X10200Y187700D02*
G03*
X8925Y187170I0J-1800D01*
G01*
X10200Y187700D02*
G03*
X8927Y187173I0J-1800D01*
G01*
X27170Y183770D02*
G03*
X31975Y185900I1930J2131D01*
G01*
D02*
G03*
X27170Y188031I-2875J0D01*
G01*
X38700Y162900D02*
G03*
X40500Y164700I0J1800D01*
G01*
X38700Y162900D02*
G03*
X40500Y164700I0J1800D01*
G01*
X37430Y167875D02*
G03*
X36957Y167051I1270J-1275D01*
G01*
X37427Y167873D02*
G03*
X36957Y167051I1273J-1273D01*
G01*
X57103Y167700D02*
G03*
X56800Y166700I1497J-1000D01*
G01*
X57103Y167700D02*
G03*
X56800Y166700I1497J-1000D01*
G01*
X41600Y171300D02*
G03*
X40327Y170773I0J-1800D01*
G01*
X41600Y171300D02*
G03*
X40325Y170770I0J-1800D01*
G01*
X63217Y193969D02*
G03*
X63890Y187864I183J-3069D01*
G01*
X67973Y171896D02*
G03*
X67425Y171325I1927J-2396D01*
G01*
X65200Y195000D02*
G03*
X63574Y194326I0J-2300D01*
G01*
X65200Y195000D02*
G03*
X63574Y194326I0J-2300D01*
G01*
X78053Y120500D02*
G03*
X69960Y122328I-4253J0D01*
G01*
Y118672D02*
G03*
X78053Y120500I3840J1828D01*
G01*
X70029Y127539D02*
G03*
X78153Y129300I3871J1761D01*
G01*
D02*
G03*
X70454Y131792I-4253J0D01*
G01*
X72171Y142590D02*
G03*
X78353Y138800I1929J-3790D01*
G01*
D02*
G03*
X75827Y142686I-4253J0D01*
G01*
X99130Y131775D02*
G03*
X98600Y130500I1270J-1275D01*
G01*
X72016Y146832D02*
G03*
X72171Y144331I1984J-1132D01*
G01*
X71627Y147127D02*
G03*
X72016Y146832I1273J1273D01*
G01*
X71625Y147130D02*
G03*
X72016Y146832I1275J1270D01*
G01*
X75829Y144332D02*
G03*
X76284Y145700I-1829J1369D01*
G01*
D02*
G03*
X76099Y146600I-2284J0D01*
G01*
X73904Y150200D02*
G03*
X71422Y147333I-2204J-600D01*
G01*
X96000Y146600D02*
G03*
X97273Y147127I0J1800D01*
G01*
X96000Y146600D02*
G03*
X97275Y147130I0J1800D01*
G01*
X90200Y152100D02*
G03*
X91473Y152627I0J1800D01*
G01*
X90200Y152100D02*
G03*
X91475Y152630I0J1800D01*
G01*
X93170Y154325D02*
G03*
X93700Y155600I-1270J1275D01*
G01*
X93173Y154327D02*
G03*
X93700Y155600I-1273J1273D01*
G01*
X114995Y112178D02*
G03*
X114995Y112178I-3269J0D01*
G01*
Y104304D02*
G03*
X114995Y104304I-3269J0D01*
G01*
X122600Y105601D02*
G03*
X122600Y103006I-3000J-1297D01*
G01*
X114995Y120052D02*
G03*
X114995Y120052I-3269J0D01*
G01*
X114379Y122727D02*
G03*
X115652Y122200I1273J1273D01*
G01*
X114377Y122730D02*
G03*
X115652Y122200I1275J1270D01*
G01*
X117136D02*
G03*
X122600Y118755I2464J-2148D01*
G01*
Y113475D02*
G03*
X122600Y110881I-3000J-1297D01*
G01*
X99127Y131773D02*
G03*
X98600Y130500I1273J-1273D01*
G01*
X105700Y137600D02*
G03*
X104427Y137073I0J-1800D01*
G01*
X105700Y137600D02*
G03*
X104425Y137070I0J-1800D01*
G01*
X109200Y130000D02*
G03*
X111597Y124660I2526J-2074D01*
G01*
X114995Y135800D02*
G03*
X113454Y138574I-3269J0D01*
G01*
X115453Y148200D02*
G03*
X109372Y144360I-4253J0D01*
G01*
X113028D02*
G03*
X115453Y148200I-1828J3840D01*
G01*
X124153Y148300D02*
G03*
X118072Y144460I-4253J0D01*
G01*
X67425Y167675D02*
G03*
X72975Y169500I2475J1825D01*
G01*
D02*
G03*
X71621Y172048I-3075J0D01*
G01*
X78547Y173607D02*
G03*
X80170Y168336I4153J-1607D01*
G01*
X80175Y163734D02*
G03*
X81444Y155700I2425J-3734D01*
G01*
X83756D02*
G03*
X87053Y160000I-1156J4300D01*
G01*
D02*
G03*
X85234Y163590I-4453J0D01*
G01*
X87153Y172000D02*
G03*
X81093Y176153I-4453J0D01*
G01*
X85230Y168336D02*
G03*
X87153Y172000I-2530J3664D01*
G01*
X71600Y184500D02*
G03*
X71073Y185773I-1800J0D01*
G01*
X80473Y176773D02*
G03*
X79200Y177300I-1273J-1273D01*
G01*
X80475Y176770D02*
G03*
X79200Y177300I-1275J-1270D01*
G01*
X71600Y184500D02*
G03*
X71070Y185775I-1800J0D01*
G01*
X82968Y183329D02*
G03*
X82969Y179671I-1369J-1829D01*
G01*
X84260Y179672D02*
G03*
X89523Y177492I3840J1828D01*
G01*
X92353Y181500D02*
G03*
X84260Y183328I-4253J0D01*
G01*
X105500Y159700D02*
G03*
X104227Y159173I0J-1800D01*
G01*
X105500Y159700D02*
G03*
X104225Y159170I0J-1800D01*
G01*
X92108Y180077D02*
G03*
X92353Y181500I-4008J1423D01*
G01*
X93700Y177700D02*
G03*
X93173Y178973I-1800J0D01*
G01*
X93700Y177700D02*
G03*
X93170Y178975I-1800J0D01*
G01*
X93769Y188629D02*
G03*
X93769Y184971I-1369J-1829D01*
G01*
X96836Y190400D02*
G03*
X95260Y188628I2264J-3600D01*
G01*
Y184972D02*
G03*
X103353Y186800I3840J1828D01*
G01*
D02*
G03*
X101364Y190400I-4253J0D01*
G01*
X149812Y15010D02*
G03*
X149812Y15010I-3800J0D01*
G01*
X159812D02*
G03*
X159812Y15010I-3800J0D01*
G01*
X161643Y34302D02*
G03*
X161184Y37168I-9174J0D01*
G01*
Y37168D02*
G03*
X164428Y40928I-556J3759D01*
G01*
X180754Y18133D02*
G03*
X184223Y14665I3469J0D01*
G01*
Y25539D02*
G03*
X180754Y22070I0J-3469D01*
G01*
X180965Y42672D02*
G03*
X184223Y39668I3258J264D01*
G01*
X194425Y7630D02*
G03*
X195700Y7100I1275J1270D01*
G01*
X194427Y7627D02*
G03*
X195700Y7100I1273J1273D01*
G01*
X188328Y14472D02*
G03*
X188858Y13197I1800J0D01*
G01*
X188328Y14472D02*
G03*
X188856Y13199I1800J0D01*
G01*
X196034Y14665D02*
G03*
X199502Y18133I0J3469D01*
G01*
Y22070D02*
G03*
X196034Y25539I-3469J0D01*
G01*
X210207Y23920D02*
G03*
X213475Y27188I0J3269D01*
G01*
X203001D02*
G03*
X206270Y23920I3269J0D01*
G01*
Y42268D02*
G03*
X203001Y38999I0J-3269D01*
G01*
X213475D02*
G03*
X210207Y42268I-3269J0D01*
G01*
X119859Y61904D02*
G03*
X126428Y59302I2769J-2603D01*
G01*
D02*
G03*
X125408Y61893I-3800J0D01*
G01*
X124428Y67252D02*
G03*
X131428Y69302I3200J2049D01*
G01*
X156828Y42374D02*
G03*
X161643Y34302I-4359J-8072D01*
G01*
X136428Y59302D02*
G03*
X136428Y59302I-3800J0D01*
G01*
X146428D02*
G03*
X146428Y59302I-3800J0D01*
G01*
X133830Y69184D02*
G03*
X141428Y69302I3798J118D01*
G01*
X145224Y72498D02*
G03*
X151628Y69302I2405J-3196D01*
G01*
X131428D02*
G03*
X124428Y71351I-3800J0D01*
G01*
X121355Y79801D02*
G03*
X120828Y78528I1273J-1273D01*
G01*
X121358Y79803D02*
G03*
X120828Y78528I1270J-1275D01*
G01*
X141428Y69302D02*
G03*
X137761Y73099I-3800J0D01*
G01*
X176153Y49174D02*
G03*
X176153Y42226I-2453J-3474D01*
G01*
X196034Y39668D02*
G03*
X199302Y42936I0J3269D01*
G01*
Y46873D02*
G03*
X196034Y50142I-3269J0D01*
G01*
X151628Y69302D02*
G03*
X150033Y72498I-4000J0D01*
G01*
X164428Y51676D02*
G03*
X156828Y51676I-3800J0D01*
G01*
X184223Y50142D02*
G03*
X182719Y49775I0J-3269D01*
G01*
X236325Y7075D02*
G03*
X236878Y6500I2475J1825D01*
G01*
X241275Y10725D02*
G03*
X236325Y10725I-2475J-1825D01*
G01*
X238781Y18341D02*
G03*
X242741Y14381I1519J-2441D01*
G01*
X215250Y25400D02*
G03*
X215810Y23805I2550J0D01*
G01*
X215810Y23805D02*
G03*
X221475Y24500I2789J695D01*
G01*
X215250Y25400D02*
G03*
X215810Y23805I2550J0D01*
G01*
X221475Y24500D02*
G03*
X220350Y26781I-2875J0D01*
G01*
X236731Y33836D02*
G03*
X240032Y30506I470J-2836D01*
G01*
X245280Y16920D02*
G03*
X246100Y18900I-1980J1980D01*
G01*
X245280Y16920D02*
G03*
X246100Y18900I-1980J1980D01*
G01*
X267622Y6500D02*
G03*
X268775Y8900I-1922J2400D01*
G01*
D02*
G03*
X263225Y10725I-3075J0D01*
G01*
X283086Y2855D02*
G03*
X286375Y5700I414J2845D01*
G01*
D02*
G03*
X280739Y6500I-2875J0D01*
G01*
X220675Y48200D02*
G03*
X215250Y46873I-2875J0D01*
G01*
X220350D02*
G03*
X220675Y48200I-2550J1327D01*
G01*
X225674Y60838D02*
G03*
X225653Y56148I-1674J-2338D01*
G01*
X237626Y60126D02*
G03*
X236000Y60800I-1626J-1626D01*
G01*
X237626Y60126D02*
G03*
X236000Y60800I-1626J-1626D01*
G01*
X240241Y78119D02*
G03*
X236281Y74159I-2441J-1519D01*
G01*
X246100Y71100D02*
G03*
X245280Y73080I-2800J0D01*
G01*
X246100Y71100D02*
G03*
X245280Y73080I-2800J0D01*
G01*
X125200Y129900D02*
G03*
X126473Y130427I0J1800D01*
G01*
X125200Y129900D02*
G03*
X126475Y130430I0J1800D01*
G01*
X117562Y138355D02*
G03*
X117070Y137869I2038J-2555D01*
G01*
X121922Y133500D02*
G03*
X122869Y135800I-2322J2300D01*
G01*
D02*
G03*
X122308Y137630I-3269J0D01*
G01*
X129426Y126126D02*
G03*
X130699Y126653I0J1800D01*
G01*
X129426Y126126D02*
G03*
X130701Y126656I0J1800D01*
G01*
X131770Y135725D02*
G03*
X132300Y137000I-1270J1275D01*
G01*
X131773Y135727D02*
G03*
X132300Y137000I-1273J1273D01*
G01*
X145941Y94700D02*
G03*
X145328Y89677I-2041J-2300D01*
G01*
X149928Y92400D02*
G03*
X147628Y94700I-2300J0D01*
G01*
X149928Y92400D02*
G03*
X147628Y94700I-2300J0D01*
G01*
X141973Y137927D02*
G03*
X142500Y139200I-1273J1273D01*
G01*
X141970Y137925D02*
G03*
X142500Y139200I-1270J1275D01*
G01*
X132328Y144060D02*
G03*
X134753Y147900I-1828J3840D01*
G01*
X121728Y144460D02*
G03*
X124153Y148300I-1828J3840D01*
G01*
X142528Y144460D02*
G03*
X144953Y148300I-1828J3840D01*
G01*
X134753Y147900D02*
G03*
X128672Y144060I-4253J0D01*
G01*
X144953Y148300D02*
G03*
X138872Y144460I-4253J0D01*
G01*
X155626Y194326D02*
G03*
X154000Y195000I-1626J-1626D01*
G01*
X155626Y194326D02*
G03*
X154000Y195000I-1626J-1626D01*
G01*
X190927Y145127D02*
G03*
X192200Y144600I1273J1273D01*
G01*
X181973Y159173D02*
G03*
X180700Y159700I-1273J-1273D01*
G01*
X181975Y159170D02*
G03*
X180700Y159700I-1275J-1270D01*
G01*
X190925Y145130D02*
G03*
X192200Y144600I1275J1270D01*
G01*
X161947Y181500D02*
G03*
X164937Y180602I2051J1402D01*
G01*
X200884Y183100D02*
G03*
X197076Y185202I-2484J0D01*
G01*
X198461Y180616D02*
G03*
X200884Y183100I-61J2483D01*
G01*
X271333Y137122D02*
G03*
X275884Y137400I2267J278D01*
G01*
D02*
G03*
X273878Y139667I-2284J0D01*
G01*
X265875Y147670D02*
G03*
X264600Y148200I-1275J-1270D01*
G01*
X265873Y147673D02*
G03*
X264600Y148200I-1273J-1273D01*
G01*
X192200Y146400D02*
X264600D01*
X273600Y137400D01*
X61600Y151100D02*
X64400Y153900D01*
X61600Y43700D02*
Y151100D01*
X61400Y169500D02*
X69900D01*
X41600D02*
X61400D01*
X58600Y131600D02*
Y166700D01*
X61400Y169500D01*
X61600Y43700D02*
X64102Y41198D01*
X64400Y153900D02*
X90200D01*
X91900Y155600D01*
Y177700D01*
X180700Y157900D02*
X192200Y146400D01*
X105500Y157900D02*
X180700D01*
X96000Y148400D02*
X105500Y157900D01*
X72900Y148400D02*
X96000D01*
X71700Y149600D02*
X72900Y148400D01*
X64102Y41198D02*
X71691D01*
X88100Y181500D02*
X91900Y177700D01*
X163998Y182902D02*
X164500Y182400D01*
X92400Y186800D02*
X99100D01*
X64200Y123400D02*
X67100Y120500D01*
X63900Y123400D02*
X64200D01*
X67100Y120500D02*
X73800D01*
X70400Y129300D02*
X73900D01*
X66800Y132900D02*
X70400Y129300D01*
X74000Y138900D02*
X74100Y138800D01*
X74000Y138900D02*
Y145700D01*
X81600Y181500D02*
X88100D01*
X69800Y175500D02*
Y184500D01*
Y169600D02*
Y175500D01*
X79200D02*
X82700Y172000D01*
X69800Y175500D02*
X79200D01*
X124400Y80300D02*
Y122800D01*
X122628Y78528D02*
X124400Y80300D01*
X122628Y59302D02*
Y78528D01*
X123200Y124000D02*
X124400Y122800D01*
X115652Y124000D02*
X123200D01*
X124474Y127926D02*
X126400Y126000D01*
Y80530D02*
Y126000D01*
Y80530D02*
X137628Y69302D01*
X130500Y137000D02*
Y147900D01*
X125200Y131700D02*
X130500Y137000D01*
X117400Y131700D02*
X125200D01*
X140700Y139200D02*
Y148300D01*
X129426Y127926D02*
X140700Y139200D01*
X124474Y127926D02*
X129426D01*
X113626D02*
X117400Y131700D01*
X111726Y127926D02*
X113626D01*
X117700Y135800D02*
X119600D01*
X113700Y131800D02*
X117700Y135800D01*
X106600Y131800D02*
X113700D01*
X119600Y127926D02*
X124474D01*
X119600Y135800D02*
X119900Y136100D01*
Y148300D01*
X111200Y136326D02*
X111726Y135800D01*
X111200Y136326D02*
Y148200D01*
X105700Y135800D02*
X111726D01*
X100400Y130500D02*
X105700Y135800D01*
X100400Y62400D02*
Y130500D01*
Y62400D02*
X103498Y59302D01*
X112628D01*
X111726Y127926D02*
X115652Y124000D01*
X106598Y69302D02*
X117628D01*
X103200Y72700D02*
X106598Y69302D01*
X103200Y72700D02*
Y128400D01*
X106600Y131800D01*
X52555Y9145D02*
Y133055D01*
Y9145D02*
X57000Y4700D01*
X282500D01*
X283500Y5700D01*
X400Y118600D02*
Y176100D01*
X10200Y185900D01*
X29100D01*
X63400Y190900D02*
X69800Y184500D01*
Y169600D02*
X69900Y169500D01*
X38700Y110200D02*
Y114600D01*
X35100Y106600D02*
X38700Y110200D01*
X13400Y106600D02*
X35100D01*
X4500Y108800D02*
Y144800D01*
Y108800D02*
X6700Y106600D01*
X13400D01*
X238800Y8900D02*
X265700D01*
X195700D02*
X238800D01*
X190128Y14472D02*
X195700Y8900D01*
X190128Y14472D02*
Y20102D01*
X4500Y144800D02*
Y165600D01*
X38700Y166600D02*
X41600Y169500D01*
X38700Y164700D02*
Y166600D01*
X-14366Y16958D02*
X-12575Y16722D01*
X-25450Y31414D02*
X-25216Y33196D01*
X-14719Y17052D02*
X-14366Y16958D01*
X-13772Y16105D02*
Y16880D01*
X-10772Y13105D02*
Y16722D01*
X-12575D02*
X-11672D01*
X-10769D01*
X-25450Y34402D02*
X-24892D01*
X-25216Y33196D02*
X-24748Y34940D01*
X-25450Y37402D02*
X-23599D01*
X-25450Y40402D02*
X-21259D01*
X-24748Y34940D02*
X-24057Y36609D01*
X-23154Y38174D01*
X-22054Y39607D01*
X-20777Y40884D01*
X-14719Y17052D02*
X684Y1650D01*
X-11068Y13402D02*
X50755D01*
X-10769Y16722D02*
X-8978Y16958D01*
X-14068Y16402D02*
X50755D01*
X-7772Y10105D02*
Y17281D01*
X-5068Y7402D02*
X51753D01*
X-8978Y16958D02*
X-7233Y17425D01*
X-8068Y10402D02*
X50755D01*
X-7233Y17425D02*
X-5564Y18117D01*
X-4772Y7105D02*
Y18574D01*
X-5564Y18117D02*
X-4000Y19020D01*
X-2567Y20119D01*
X-1290Y21397D01*
X-3502Y19402D02*
X50755D01*
X-2567Y40884D02*
X-1290Y39607D01*
X-2085Y40402D02*
X13656D01*
X-20777Y40884D02*
X-19344Y41984D01*
X-17779Y42887D01*
X-25450Y43402D02*
X-16536D01*
X-17779Y42887D02*
X-16111Y43578D01*
X-14366Y44045D01*
X-12575Y44281D01*
X-11672D02*
X-10769D01*
X-8978Y44045D01*
X-16772Y43304D02*
Y60369D01*
X-13772Y44124D02*
Y59289D01*
X-17066Y60491D02*
X-14882Y59586D01*
X-12598Y58974D01*
X-12575Y44281D02*
X-11672D01*
X-10772D02*
Y58734D01*
X-12598Y58974D02*
X-10254Y58666D01*
X-9072D01*
X-8978Y44045D02*
X-7233Y43578D01*
X-25450Y46402D02*
X50755D01*
X-25450Y52402D02*
X14093D01*
X-25450Y49402D02*
X14168D01*
X-5564Y42887D02*
X-4000Y41984D01*
X-2567Y40884D01*
X-7233Y43578D02*
X-5564Y42887D01*
X-6808Y43402D02*
X13656D01*
X-25450Y58402D02*
X14743D01*
X-25450Y55402D02*
X50755D01*
X-9072Y58666D02*
X-7890D01*
X-5545Y58974D01*
X-7772Y43722D02*
Y58681D01*
X-4772Y42429D02*
Y59181D01*
X-5545Y58974D02*
X-3262Y59586D01*
X-1077Y60491D01*
X-1772Y4105D02*
Y20914D01*
X-1290Y21397D02*
X-190Y22830D01*
X713Y24394D01*
X1405Y26063D01*
X1228Y1650D02*
Y25637D01*
X1405Y26063D02*
X1872Y27808D01*
X2108Y29599D02*
Y30502D01*
X1872Y27808D02*
X2108Y29599D01*
X1872Y33196D02*
X2108Y31405D01*
Y30502D02*
Y31405D01*
X713Y36609D02*
X1405Y34940D01*
X1872Y33196D01*
X19228Y1650D02*
Y36549D01*
X22228Y1650D02*
Y36549D01*
X13656D02*
Y45454D01*
X16228Y1650D02*
Y36549D01*
X52228Y1650D02*
Y6926D01*
X51285Y7870D02*
X55725Y3430D01*
X-2068Y4402D02*
X54753D01*
X55228Y1650D02*
Y3926D01*
X58228Y1650D02*
Y2900D01*
X1131Y25402D02*
X50755D01*
X-518Y22402D02*
X50755D01*
X1549Y34402D02*
X50755D01*
X1950Y28402D02*
X50755D01*
X54355Y9890D02*
X57746Y6500D01*
X13656Y36549D02*
X22561D01*
X2108Y31402D02*
X50755D01*
X-190Y38174D02*
X713Y36609D01*
X256Y37402D02*
X13656D01*
X-1290Y39607D02*
X-190Y38174D01*
X14156Y41002D02*
X18109D01*
Y44954D01*
Y37049D02*
Y41002D01*
X19228Y45454D02*
Y46899D01*
X18109Y41002D02*
X22061D01*
X-1772Y40089D02*
Y60203D01*
X16228Y45454D02*
Y47187D01*
X500Y61402D02*
X13875D01*
X22228Y52057D02*
Y59946D01*
Y45454D02*
Y49946D01*
X16228Y54816D02*
Y57187D01*
X19228Y55104D02*
Y56899D01*
X22561Y40402D02*
X50755D01*
X22561Y37402D02*
X50755D01*
X13656Y45454D02*
X22561D01*
X22049Y49402D02*
X50755D01*
X22561Y36549D02*
Y45454D01*
Y43402D02*
X50755D01*
X54355Y46402D02*
X59800D01*
X54355Y43402D02*
X59825D01*
X22124Y52402D02*
X50755D01*
X54355Y49402D02*
X59800D01*
X22343Y61402D02*
X50755D01*
X21474Y58402D02*
X50755D01*
X54355Y55402D02*
X59800D01*
X54355Y52402D02*
X59800D01*
X54355Y61402D02*
X59800D01*
X54355Y58402D02*
X59800D01*
X-22772Y38671D02*
Y64928D01*
X-25450Y61402D02*
X-18643D01*
X-24100Y66660D02*
X-22661Y64784D01*
X-25450Y64402D02*
X-22279D01*
X-19772Y41655D02*
Y62178D01*
X-19114Y61673D02*
X-17066Y60491D01*
X-22661Y64784D02*
X-20989Y63112D01*
X-19114Y61673D01*
X-25450Y31414D02*
Y69112D01*
Y67402D02*
X-24529D01*
X-25450Y84292D02*
X-25282Y84696D01*
X-25450Y69112D02*
X-25282Y68707D01*
X-25450Y84292D02*
Y157217D01*
X-25282Y68707D02*
X-24100Y66660D01*
X-25450Y85402D02*
X-24875D01*
X-25282Y84696D02*
X-24100Y86743D01*
X-1077Y60491D02*
X970Y61673D01*
X1228Y35366D02*
Y61871D01*
X970Y61673D02*
X2846Y63112D01*
X4518Y64784D01*
X4228Y1650D02*
Y64495D01*
X4135Y64402D02*
X15554D01*
X4518Y64784D02*
X5957Y66660D01*
X6385Y67402D02*
X15845D01*
X5957Y86743D02*
X7139Y84696D01*
X5957Y66660D02*
X7139Y68707D01*
X4518Y88619D02*
X5957Y86743D01*
X6732Y85402D02*
X50755D01*
X7228Y1650D02*
Y68923D01*
X7139Y68707D02*
X8044Y70892D01*
X7228Y84480D02*
Y104800D01*
X7139Y84696D02*
X8044Y82512D01*
X-25450Y88402D02*
X-22828D01*
X-24100Y86743D02*
X-22661Y88619D01*
X-25450Y91402D02*
X-19542D01*
X-25450Y94402D02*
X-12700D01*
X-22661Y88619D02*
X-20989Y90291D01*
X-19114Y91730D01*
X-17066Y92912D01*
X-14882Y93817D01*
X-22772Y88475D02*
Y159895D01*
X-19772Y91225D02*
Y162895D01*
X-16772Y93034D02*
Y165895D01*
X-14882Y93817D02*
X-12598Y94429D01*
X-13772Y94115D02*
Y168895D01*
X-12598Y94429D02*
X-10254Y94738D01*
X-10772Y94670D02*
Y171895D01*
X-10254Y94738D02*
X-9072D01*
X-3262Y93817D02*
X-1077Y92912D01*
X970Y91730D01*
X-5545Y94429D02*
X-3262Y93817D01*
X-5443Y94402D02*
X15554D01*
X2846Y90291D02*
X4518Y88619D01*
X4685Y88402D02*
X14743D01*
X970Y91730D02*
X2846Y90291D01*
X1398Y91402D02*
X13875D01*
X-7772Y94722D02*
Y174895D01*
X-7890Y94738D02*
X-5545Y94429D01*
X-9072Y94738D02*
X-7890D01*
X-25450Y97402D02*
X50755D01*
X1228Y91532D02*
Y115847D01*
X4228Y88908D02*
Y106526D01*
X-4772Y94222D02*
Y177895D01*
X-1772Y93200D02*
Y116716D01*
X7841Y70402D02*
X13898D01*
X8044Y70892D02*
X8656Y73175D01*
X8964Y75520D01*
X16228Y64816D02*
Y67187D01*
X22228Y62058D02*
Y69946D01*
X19228Y65104D02*
Y66899D01*
X10228Y1650D02*
Y104800D01*
X13228Y1650D02*
Y103530D01*
X22228Y72057D02*
Y79946D01*
X25228Y1650D02*
Y104800D01*
X34228Y1650D02*
Y104800D01*
X37228Y1650D02*
Y106183D01*
X28228Y1650D02*
Y104800D01*
X31228Y1650D02*
Y104800D01*
X40228Y1650D02*
Y109249D01*
X20663Y64402D02*
X50755D01*
X22319Y70402D02*
X50755D01*
X20373Y67402D02*
X50755D01*
X54355D02*
X59800D01*
X54355Y64402D02*
X59800D01*
X54355Y73402D02*
X59800D01*
X54355Y70402D02*
X59800D01*
X43228Y1650D02*
Y167700D01*
X46228Y1650D02*
Y167700D01*
X49228Y1650D02*
Y167700D01*
X50755Y9145D02*
Y130461D01*
X55228Y9017D02*
Y131997D01*
X58228Y6500D02*
Y128548D01*
X54355Y9890D02*
Y130461D01*
X59800Y43700D02*
Y128769D01*
X8656Y80228D02*
X8964Y77884D01*
X8686Y73402D02*
X14598D01*
X8073Y82402D02*
X14093D01*
X8765Y79402D02*
X14168D01*
X16228Y74816D02*
Y77187D01*
X19228Y75104D02*
Y76899D01*
X8964Y76702D02*
Y77884D01*
Y75520D02*
Y76702D01*
X8044Y82512D02*
X8656Y80228D01*
X16228Y94816D02*
Y104800D01*
Y84816D02*
Y87187D01*
X19228Y85104D02*
Y86899D01*
X22228Y82057D02*
Y89946D01*
X19228Y95104D02*
Y104800D01*
X22228Y92058D02*
Y104800D01*
X8964Y76402D02*
X50755D01*
X21620Y73402D02*
X50755D01*
X22124Y82402D02*
X50755D01*
X22049Y79402D02*
X50755D01*
X54355D02*
X59800D01*
X54355Y76402D02*
X59800D01*
X54355Y85402D02*
X59800D01*
X54355Y82402D02*
X59800D01*
X21474Y88402D02*
X50755D01*
X20663Y94402D02*
X50755D01*
X22343Y91402D02*
X50755D01*
X54355D02*
X59800D01*
X54355Y88402D02*
X59800D01*
X54355Y97402D02*
X59800D01*
X54355Y94402D02*
X59800D01*
X61228Y1650D02*
Y2900D01*
X64228Y1650D02*
Y2900D01*
X54355Y31402D02*
X77631D01*
X54355Y28402D02*
X78450D01*
X73228Y1650D02*
Y2900D01*
X76228Y1650D02*
Y2900D01*
X67228Y1650D02*
Y2900D01*
X70228Y1650D02*
Y2900D01*
X64228Y6500D02*
Y39398D01*
X67228Y6500D02*
Y39398D01*
X61228Y6500D02*
Y41526D01*
X54355Y34402D02*
X78300D01*
X70228Y6500D02*
Y36946D01*
X73228Y6500D02*
Y36946D01*
X78300Y32897D02*
Y36200D01*
X54355Y10402D02*
X191653D01*
X684Y1650D02*
X285622D01*
X54355Y13402D02*
X100615D01*
X54355Y16402D02*
X100693D01*
X79228Y1650D02*
Y2900D01*
X57000D02*
X281129D01*
X56844Y7402D02*
X194703D01*
X57746Y6500D02*
X236878D01*
X54355Y19402D02*
X180754D01*
X54355Y22402D02*
X180770D01*
X54355Y25402D02*
X104777D01*
X79228Y6500D02*
Y27848D01*
X78025Y30600D02*
X80600D01*
X83175D01*
X54355Y37402D02*
X67439D01*
X54355Y40402D02*
X62353D01*
X60330Y42425D02*
X62826Y39928D01*
X64102Y39398D02*
X67439D01*
Y36946D02*
Y39398D01*
X64847Y42998D02*
X67439D01*
X63400Y44446D02*
X64847Y42998D01*
X63400Y52402D02*
X67612D01*
X64444Y43402D02*
X67439D01*
Y42998D02*
Y45451D01*
X63400Y49402D02*
X67837D01*
X70228Y45451D02*
Y47205D01*
X67439Y36946D02*
X75944D01*
Y37402D02*
X78639D01*
X67439Y45451D02*
X75944D01*
X63400Y46402D02*
X80300D01*
X75944Y36946D02*
Y45451D01*
X78974Y37826D02*
X80300Y39153D01*
X75944Y43402D02*
X80300D01*
X75944Y40402D02*
X80300D01*
X70228Y55192D02*
Y57205D01*
X63400Y55402D02*
X71044D01*
X72339D02*
X80300D01*
X73228Y45451D02*
Y47233D01*
X75546Y49402D02*
X80300D01*
X73228Y55164D02*
Y57233D01*
X75770Y52402D02*
X80300D01*
X88228Y1650D02*
Y2900D01*
X91228Y1650D02*
Y2900D01*
X82228Y1650D02*
Y2900D01*
X85228Y1650D02*
Y2900D01*
X100228Y1650D02*
Y2900D01*
X103228Y1650D02*
Y2900D01*
X94228Y1650D02*
Y2900D01*
X97228Y1650D02*
Y2900D01*
X82228Y6500D02*
Y27992D01*
X97228Y6500D02*
Y37828D01*
X80600Y28025D02*
Y30600D01*
X82750Y28402D02*
X100499D01*
X100228Y6500D02*
Y28761D01*
X103228Y6500D02*
Y11122D01*
Y18498D02*
Y26084D01*
X106228Y6500D02*
Y11633D01*
Y1650D02*
Y2900D01*
X109228Y1650D02*
Y2900D01*
X107673Y13402D02*
X110615D01*
X107595Y16402D02*
X110693D01*
X112228Y1650D02*
Y2900D01*
X115228Y1650D02*
Y2900D01*
X112228Y6500D02*
Y11529D01*
X115228Y6500D02*
Y11168D01*
X109228Y6500D02*
Y25058D01*
X106228Y17988D02*
Y25044D01*
X112228Y18092D02*
Y26130D01*
X115228Y18452D02*
Y28877D01*
X110598Y25402D02*
X150244D01*
X82900Y32893D02*
Y35247D01*
X84226Y36574D01*
X82900Y34402D02*
X98518D01*
X83569Y31402D02*
X98920D01*
X84757Y37402D02*
X98018D01*
X84900Y43402D02*
X95616D01*
X84900Y40402D02*
X95653D01*
X84900Y49402D02*
X95616D01*
X84900Y46402D02*
X95616D01*
Y40936D02*
Y51683D01*
X84900Y52402D02*
X95684D01*
X84900Y55402D02*
X98631D01*
X103216Y42112D02*
Y51683D01*
Y43402D02*
X151306D01*
X103216Y46402D02*
X156828D01*
X116247Y37402D02*
X143835D01*
X114876Y28402D02*
X145444D01*
X114356Y40402D02*
X145617D01*
X103216Y49402D02*
X156828D01*
X103147Y52402D02*
X156898D01*
X103498Y57502D02*
X108508D01*
X100200Y55402D02*
X159882D01*
X112228Y42073D02*
Y55523D01*
X115228Y39326D02*
Y56530D01*
X109228Y43145D02*
Y57208D01*
X109313Y57147D02*
X109705Y56811D01*
X63400Y58402D02*
X68488D01*
X63400Y61402D02*
X67443D01*
X63400Y64402D02*
X68894D01*
X74489D02*
X80300D01*
X74895Y58402D02*
X80300D01*
X70228Y65192D02*
Y67205D01*
X73228Y65164D02*
Y67233D01*
X64228Y43617D02*
Y120826D01*
X67228Y42998D02*
Y118700D01*
X63400Y44446D02*
Y121171D01*
Y67402D02*
X69775D01*
X76228Y6500D02*
Y117009D01*
X79228Y38081D02*
Y146600D01*
X73607Y67402D02*
X80300D01*
X75939Y61402D02*
X80300D01*
X84900Y58402D02*
X101853D01*
X84900Y67402D02*
X98600D01*
X84900Y61402D02*
X98902D01*
X99130Y61125D02*
X102223Y58031D01*
X84900Y64402D02*
X98600D01*
X85228Y6500D02*
Y146600D01*
X88228Y6500D02*
Y146600D01*
X80300Y39153D02*
Y68561D01*
X84900Y38200D02*
Y68561D01*
X91228Y6500D02*
Y146600D01*
X94228Y6500D02*
Y146600D01*
X97228Y54791D02*
Y147084D01*
X98600Y62400D02*
Y130500D01*
X63400Y70402D02*
X67514D01*
X63400Y73402D02*
X68054D01*
X63400Y79402D02*
X67837D01*
X63400Y85402D02*
X71044D01*
X70228Y75192D02*
Y77205D01*
X73228Y75164D02*
Y77233D01*
X63400Y82402D02*
X67612D01*
X63400Y88402D02*
X68488D01*
X63400Y91402D02*
X67443D01*
X63400Y94402D02*
X68894D01*
X70228Y85192D02*
Y87205D01*
X73228Y85164D02*
Y87233D01*
X70228Y95192D02*
Y118192D01*
X73228Y95164D02*
Y116286D01*
X80616Y69500D02*
X82600D01*
X75869Y70402D02*
X80285D01*
X75329Y73402D02*
X98600D01*
X82600Y69500D02*
X84584D01*
X82600D02*
Y71484D01*
X84915Y70402D02*
X98600D01*
X72339Y85402D02*
X98600D01*
X63400Y76402D02*
X98600D01*
X74489Y94402D02*
X98600D01*
X74895Y88402D02*
X98600D01*
X82228Y71956D02*
Y146600D01*
X75546Y79402D02*
X98600D01*
X75939Y91402D02*
X98600D01*
X75770Y82402D02*
X98600D01*
X100228Y55396D02*
Y60026D01*
X102200Y63146D02*
X104244Y61102D01*
X103228Y42119D02*
Y57522D01*
X106228Y43159D02*
Y57502D01*
X104244Y61102D02*
X108508D01*
X109228Y61395D02*
Y67502D01*
X102200Y63146D02*
Y71154D01*
X103228Y62117D02*
Y70126D01*
X102200Y70402D02*
X102953D01*
X102200Y71154D02*
X105323Y68031D01*
X106228Y61102D02*
Y67540D01*
X105000Y73446D02*
X107344Y71102D01*
X103944Y61402D02*
X109237D01*
X109491Y61600D02*
X109935Y62017D01*
X102200Y64402D02*
X120828D01*
X116320Y58402D02*
X118936D01*
X115228Y62073D02*
Y66355D01*
X115795Y61402D02*
X119461D01*
X106598Y67502D02*
X113508D01*
X102200Y67402D02*
X113910D01*
X109228Y71102D02*
Y85087D01*
X107344Y71102D02*
X113508D01*
X112228Y63081D02*
Y67502D01*
Y71102D02*
Y85087D01*
X114313Y67147D02*
X114705Y66811D01*
X105000Y88402D02*
X108257D01*
X105000Y85402D02*
X108257D01*
X105000Y91402D02*
X108257D01*
X108757Y88556D02*
X111726D01*
Y85587D02*
Y88556D01*
X114491Y71600D02*
X114935Y72017D01*
X111726Y88556D02*
Y91524D01*
Y88556D02*
X114694D01*
X105000Y73446D02*
Y127654D01*
X106228Y72217D02*
Y128883D01*
X105000Y97402D02*
X108605D01*
X105000Y94402D02*
X109163D01*
X108257Y85087D02*
Y92024D01*
X109228D02*
Y94322D01*
X112228Y92024D02*
Y93200D01*
X105000Y76402D02*
X120828D01*
X105044Y73402D02*
X120828D01*
X105000Y79402D02*
X121054D01*
X105000Y82402D02*
X122600D01*
X108257Y85087D02*
X115194D01*
Y88402D02*
X116335D01*
X115194Y85402D02*
X118743D01*
X108257Y92024D02*
X115194D01*
Y91402D02*
X117992D01*
X114847Y97402D02*
X116479D01*
X114289Y94402D02*
X117037D01*
X115194Y85087D02*
Y92024D01*
X115228Y72248D02*
Y122251D01*
X-25450Y106402D02*
X4353D01*
X3230Y107525D02*
X5425Y105330D01*
X6700Y104800D02*
X10806D01*
X7446Y108400D02*
X10806D01*
X-25450Y112402D02*
X2700D01*
X-25450Y109402D02*
X2700D01*
X-25450Y115402D02*
X2700D01*
X7228Y108617D02*
Y143382D01*
X6300Y109546D02*
X7446Y108400D01*
X2700Y108800D02*
Y116875D01*
X6300Y109546D02*
Y142206D01*
X-25450Y103402D02*
X50755D01*
X-25450Y100402D02*
X50755D01*
X13400Y104025D02*
Y106600D01*
X15994Y104800D02*
X35100D01*
X15994Y108400D02*
X34354D01*
X6444Y109402D02*
X12133D01*
X6300Y115402D02*
X35732D01*
X6300Y112402D02*
X36550D01*
X13400Y106600D02*
Y109175D01*
X34354Y108400D02*
X36900Y110946D01*
X14667Y109402D02*
X35356D01*
X-25450Y133402D02*
X-1400D01*
X-25450Y130402D02*
X-1400D01*
X-25450Y139402D02*
X-1400D01*
X-25450Y136402D02*
X-1400D01*
X-25450Y118402D02*
X-2468D01*
X-25450Y121402D02*
X-1400D01*
X-25450Y127402D02*
X-1400D01*
X-25450Y124402D02*
X-1400D01*
X-25450Y145402D02*
X-1400D01*
X-25450Y142402D02*
X-1400D01*
X-25450Y154402D02*
X-1400D01*
X-25450Y148402D02*
X-1400D01*
X4500Y144800D02*
X7075D01*
X-25265Y157402D02*
X-1400D01*
X-25450Y151402D02*
X-1400D01*
X6300Y133402D02*
X49701D01*
X6300Y130402D02*
X50755D01*
X6300Y139402D02*
X56800D01*
X6300Y136402D02*
X56800D01*
X6300Y121402D02*
X50755D01*
X6300Y118402D02*
X50755D01*
X6300Y127402D02*
X50755D01*
X6300Y124402D02*
X50755D01*
X6300Y151402D02*
X56800D01*
X6300Y148402D02*
X56800D01*
X6300Y160402D02*
X56800D01*
X6300Y154402D02*
X56800D01*
X6424Y142402D02*
X56800D01*
X6300Y157402D02*
X56800D01*
X7515Y145402D02*
X56800D01*
X36375Y105330D02*
X39970Y108925D01*
X37447Y106402D02*
X50755D01*
X40313Y109402D02*
X50755D01*
X54355Y100402D02*
X59800D01*
X40500Y110200D02*
Y112006D01*
X54355Y109402D02*
X59800D01*
X36900Y110946D02*
Y112006D01*
X36125Y114600D02*
X38700D01*
Y117175D01*
Y114600D02*
X41275D01*
X40850Y112402D02*
X50755D01*
X41668Y115402D02*
X50755D01*
X54355Y112402D02*
X59800D01*
X54355Y106402D02*
X59800D01*
X54355Y103402D02*
X59800D01*
X54355Y118402D02*
X59800D01*
X54355Y115402D02*
X59800D01*
X63400Y118402D02*
X70101D01*
X67100Y118700D02*
X69744D01*
X63961Y121093D02*
X65825Y119230D01*
X54355Y121402D02*
X59800D01*
X66375Y123770D02*
X67846Y122300D01*
X69744D01*
X67228Y122917D02*
Y129926D01*
X70228Y122808D02*
Y127154D01*
X54355Y127402D02*
X59800D01*
X54355Y124402D02*
X59800D01*
X54355Y130402D02*
X55768D01*
X56025Y131600D02*
X58600D01*
Y129025D02*
Y131600D01*
X55409Y133402D02*
X56108D01*
X63400D02*
X64571D01*
X60400Y154402D02*
X62356D01*
X60400Y152446D02*
X63125Y155170D01*
X63400Y125629D02*
Y150354D01*
X64228Y125661D02*
Y151183D01*
X63400Y130402D02*
X66753D01*
X63400Y127402D02*
X70095D01*
X63400Y136402D02*
X70588D01*
X66643Y130511D02*
X69125Y128030D01*
X69197Y133048D02*
X70454Y131792D01*
X63400Y148402D02*
X69755D01*
X63400Y139402D02*
X69890D01*
X63400Y150354D02*
X65146Y152100D01*
X64447Y151402D02*
X70296D01*
X67228Y135144D02*
Y152100D01*
X70228Y132017D02*
Y137041D01*
Y151347D02*
Y152100D01*
Y140559D02*
Y147853D01*
X-19265Y163402D02*
X-1400D01*
X-22265Y160402D02*
X-1400D01*
X-16265Y166402D02*
X-1400D01*
X4500Y165600D02*
Y168175D01*
X6300Y147394D02*
Y163006D01*
X7228Y146218D02*
Y164182D01*
X4500Y165600D02*
X7075D01*
X-1772Y120484D02*
Y180895D01*
X-1400Y121194D02*
Y176100D01*
X-10265Y172402D02*
X-1400D01*
X-13265Y169402D02*
X-1400D01*
X7228Y167018D02*
Y180383D01*
X2200Y167641D02*
Y175354D01*
X4228Y168663D02*
Y177383D01*
X6650Y163402D02*
X32268D01*
X7468Y166402D02*
X32608D01*
X2200Y169402D02*
X38956D01*
X2200Y172402D02*
X68000D01*
X10228Y108400D02*
Y183383D01*
X28228Y108400D02*
Y183160D01*
X32525Y164600D02*
X35100D01*
X13228Y109670D02*
Y184100D01*
X16228Y108400D02*
Y184100D01*
X2200Y175354D02*
X10946Y184100D01*
X-25450Y157217D02*
X13484Y196150D01*
X25228Y108400D02*
Y184100D01*
X31228Y108400D02*
Y183967D01*
X19228Y108400D02*
Y184100D01*
X22228Y108400D02*
Y184100D01*
X-7265Y175402D02*
X-1400D01*
X-4265Y178402D02*
X156D01*
X1228Y179474D02*
Y183895D01*
X-1265Y181402D02*
X3156D01*
X4228Y182474D02*
Y186895D01*
X1735Y184402D02*
X6156D01*
X7228Y185474D02*
Y189895D01*
X-870Y177375D02*
X8925Y187170D01*
X4735Y187402D02*
X9207D01*
X10228Y187700D02*
Y192895D01*
X13228Y187700D02*
Y195895D01*
X16228Y187700D02*
Y196150D01*
X2247Y175402D02*
X68000D01*
X5247Y178402D02*
X68000D01*
X10200Y187700D02*
X26506D01*
X8247Y181402D02*
X68000D01*
X10946Y184100D02*
X26506D01*
X31552Y187402D02*
X64353D01*
X31553Y184402D02*
X67353D01*
X19228Y187700D02*
Y196150D01*
X22228Y187700D02*
Y196150D01*
X7735Y190402D02*
X60366D01*
X10735Y193402D02*
X61612D01*
X25228Y187700D02*
Y196150D01*
X28228Y188639D02*
Y196150D01*
X31228Y187833D02*
Y196150D01*
X34228Y108400D02*
Y161651D01*
X37228Y117300D02*
Y162381D01*
X35100Y162025D02*
Y164600D01*
X37662Y162900D02*
X38700D01*
X40228Y117268D02*
Y163749D01*
X40500Y164700D02*
Y165854D01*
X35100Y164600D02*
Y167175D01*
X34228Y167549D02*
Y196150D01*
X37228Y167636D02*
Y196150D01*
X40500Y165854D02*
X42346Y167700D01*
X40228Y170674D02*
Y196150D01*
X37430Y167875D02*
X40325Y170770D01*
X39947Y163402D02*
X56800D01*
Y134194D02*
Y166700D01*
X41047Y166402D02*
X56800D01*
X60400Y152446D02*
Y165954D01*
X61228Y153274D02*
Y166783D01*
X60400Y165954D02*
X61712Y167266D01*
X70228Y155700D02*
Y166443D01*
X52228Y135911D02*
Y167700D01*
X55228Y134113D02*
Y167700D01*
X42346D02*
X57103D01*
X64228Y155692D02*
Y167700D01*
X67228Y155700D02*
Y167700D01*
X62797D02*
X67306D01*
X69900Y166925D02*
Y169500D01*
X41600Y171300D02*
X61210D01*
X61228Y171305D02*
Y188723D01*
X63400Y188325D02*
Y190900D01*
Y193475D01*
X60825Y190900D02*
X63400D01*
X49228Y171300D02*
Y196150D01*
X52228Y171300D02*
Y196150D01*
X43228Y171300D02*
Y196150D01*
X46228Y171300D02*
Y196150D01*
X55228Y171300D02*
Y196150D01*
X58228Y171300D02*
Y196150D01*
X61228Y193077D02*
Y196150D01*
X63217Y193969D02*
X63574Y194326D01*
X64228Y171300D02*
Y187526D01*
X61507Y171300D02*
X67306D01*
X67228D02*
Y184526D01*
X63890Y187864D02*
X68000Y183754D01*
Y172055D02*
Y175242D01*
X67228Y189617D02*
Y190400D01*
X68000Y175758D02*
Y183754D01*
X63400Y190900D02*
X65975D01*
X64228Y194785D02*
Y196150D01*
X70228Y186617D02*
Y190400D01*
X66446D02*
X71070Y185775D01*
X67228Y195000D02*
Y196150D01*
X70228Y195000D02*
Y196150D01*
X65953Y124402D02*
X72108D01*
X69029Y133402D02*
X72776D01*
X76228Y123991D02*
Y125741D01*
X77499Y118402D02*
X98600D01*
X73228Y124714D02*
Y125101D01*
X63400Y142402D02*
X71838D01*
X72200Y142837D02*
Y144122D01*
X73228Y133499D02*
Y134638D01*
X76228Y132859D02*
Y135118D01*
Y142482D02*
Y145197D01*
X63400Y100402D02*
X98600D01*
X63400Y97402D02*
X98600D01*
X63400Y106402D02*
X98600D01*
X63400Y103402D02*
X98600D01*
X63400Y112402D02*
X98600D01*
X63400Y109402D02*
X98600D01*
X77956Y121402D02*
X98600D01*
X63400Y115402D02*
X98600D01*
X75492Y124402D02*
X98600D01*
X75024Y133402D02*
X100756D01*
X77612Y136402D02*
X103756D01*
X76362Y142402D02*
X109400D01*
X78008Y130402D02*
X98600D01*
X77706Y127402D02*
X98600D01*
X78310Y139402D02*
X109400D01*
X63400Y145402D02*
X71735D01*
X75800Y142876D02*
Y144109D01*
X76228Y146203D02*
Y146600D01*
Y150200D02*
Y152100D01*
X73228Y151298D02*
Y152100D01*
X64400Y155700D02*
X81444D01*
X85228Y150200D02*
Y152100D01*
X88228Y150200D02*
Y152100D01*
X79228Y150200D02*
Y152100D01*
X82228Y150200D02*
Y152100D01*
X73904Y150200D02*
X95254D01*
X76099Y146600D02*
X96000D01*
X65146Y152100D02*
X90200D01*
X73104Y151402D02*
X96456D01*
X76265Y145402D02*
X107998D01*
X98547Y148402D02*
X106952D01*
X91228Y150200D02*
Y152423D01*
X83756Y155700D02*
X89454D01*
X91475Y152630D02*
X93170Y154325D01*
X93243Y154402D02*
X99456D01*
X105000Y103402D02*
X108584D01*
X105000Y106402D02*
X109219D01*
X105000Y112402D02*
X108465D01*
X105000Y109402D02*
X110001D01*
X109228Y98538D02*
Y102196D01*
X112228Y99660D02*
Y101074D01*
X109228Y106412D02*
Y110070D01*
X112228Y107534D02*
Y108948D01*
X105000Y115402D02*
X111187D01*
X105000Y121402D02*
X108749D01*
X105000Y118402D02*
X108905D01*
X109228Y114286D02*
Y117944D01*
X112228Y115408D02*
Y116822D01*
X109228Y122160D02*
Y125818D01*
X112750Y124356D02*
X114377Y122730D01*
X105000Y100402D02*
X122600D01*
X113451Y109402D02*
X117875D01*
X112265Y115402D02*
X119061D01*
X114867Y103402D02*
X116458D01*
X114987Y112402D02*
X116339D01*
X114233Y106402D02*
X117094D01*
X114547Y118402D02*
X116779D01*
X114703Y121402D02*
X116623D01*
X115652Y122200D02*
X117136D01*
X99130Y131775D02*
X104425Y137070D01*
X105000Y127402D02*
X108500D01*
X105000Y127654D02*
X107346Y130000D01*
X109200D01*
X100228Y132874D02*
Y150083D01*
X103228Y135874D02*
Y153083D01*
X101547Y151402D02*
X108401D01*
X105700Y137600D02*
X108478D01*
X106228D02*
Y156083D01*
X109078Y137842D02*
X109239Y138176D01*
X109228Y138153D02*
Y144432D01*
X109400Y138863D02*
Y144144D01*
X112228Y123282D02*
Y124600D01*
X105000Y124402D02*
X112674D01*
X113000Y142402D02*
X118100D01*
X113000Y139402D02*
X118100D01*
X114990Y135636D02*
X115404Y136049D01*
X114939Y136402D02*
X115701D01*
X115468Y136148D02*
X117013Y137827D01*
X113000Y139114D02*
Y144144D01*
X104547Y154402D02*
X181653D01*
X115228Y135874D02*
Y146836D01*
X114402Y145402D02*
X116788D01*
X113999Y151402D02*
X116990D01*
X60400Y160402D02*
X78165D01*
X60400Y157402D02*
X78984D01*
X69900Y169500D02*
X72475D01*
X60400Y163402D02*
X79727D01*
X79228Y162908D02*
Y169212D01*
Y155700D02*
Y157092D01*
X72973Y169402D02*
X79084D01*
X80400Y164964D02*
Y167074D01*
X71600Y172140D02*
Y173700D01*
Y172402D02*
X78265D01*
X71600Y173700D02*
X78454D01*
X73228Y155700D02*
Y173700D01*
X76228Y155700D02*
Y173700D01*
X78647Y160000D02*
X82600D01*
X86553D01*
X85228Y155700D02*
Y156406D01*
X85000Y166402D02*
X90100D01*
X85473Y163402D02*
X90100D01*
X60847Y166402D02*
X80400D01*
X78747Y172000D02*
X82700D01*
X86653D01*
X85000Y164888D02*
Y167074D01*
X85228Y163604D02*
Y168332D01*
X82700Y172000D02*
Y175953D01*
X71600Y177300D02*
Y184500D01*
Y177300D02*
X79200D01*
X71600Y181402D02*
X79318D01*
X80475Y176770D02*
X81093Y176153D01*
X82228Y176428D02*
Y179304D01*
X73228Y177300D02*
Y190400D01*
X76228Y177300D02*
Y190400D01*
X73228Y195000D02*
Y196150D01*
X79228Y177300D02*
Y190400D01*
X82228Y183696D02*
Y190400D01*
X76228Y195000D02*
Y196150D01*
X79228Y195000D02*
Y196150D01*
X71600Y178402D02*
X85187D01*
X83178Y179700D02*
X84044D01*
X71600Y184402D02*
X84991D01*
X85228Y175665D02*
Y178363D01*
X85573Y175402D02*
X90100D01*
X83191Y183300D02*
X84044D01*
X69444Y187402D02*
X90196D01*
X66446Y190400D02*
X96836D01*
X65200Y195000D02*
X154000D01*
X13484Y196150D02*
X271716D01*
X85228Y184637D02*
Y190400D01*
X82228Y195000D02*
Y196150D01*
X85228Y195000D02*
Y196150D01*
X86216Y157402D02*
X90100D01*
X89454Y155700D02*
X90100Y156346D01*
X86316Y169402D02*
X90100D01*
X87035Y160402D02*
X90100D01*
X93700Y157402D02*
X102456D01*
X95254Y150200D02*
X104225Y159170D01*
X88228Y155700D02*
Y177249D01*
X93700Y155600D02*
Y177700D01*
X87135Y172402D02*
X90100D01*
Y156346D02*
Y176954D01*
X94228Y150200D02*
Y185000D01*
X97228Y152174D02*
Y182981D01*
X100228Y155174D02*
Y182700D01*
X103228Y158174D02*
Y185778D01*
X97275Y147130D02*
X106246Y156100D01*
X105500Y159700D02*
X180700D01*
X93700Y163402D02*
X220610D01*
X93700Y160402D02*
X307465D01*
X109228Y151968D02*
Y156100D01*
X115228Y149564D02*
Y156100D01*
X112228Y152327D02*
Y156100D01*
X106246D02*
X179954D01*
X93700Y169402D02*
X217874D01*
X93700Y166402D02*
X218455D01*
X93700Y172402D02*
X218504D01*
X93700Y175402D02*
X220755D01*
X112228Y159700D02*
Y190400D01*
X115228Y159700D02*
Y190400D01*
X106228Y159700D02*
Y190400D01*
X109228Y159700D02*
Y190400D01*
X89695Y177359D02*
X90100Y176954D01*
X91228Y184381D02*
Y184839D01*
X91209Y184402D02*
X95588D01*
X92241Y179905D02*
X93170Y178975D01*
X93978Y185000D02*
X95044D01*
X88228Y185751D02*
Y190400D01*
Y195000D02*
Y196150D01*
X91228Y188761D02*
Y190400D01*
X94228Y188600D02*
Y190400D01*
X93990Y188600D02*
X95044D01*
X91228Y195000D02*
Y196150D01*
X94228Y195000D02*
Y196150D01*
X92352Y181402D02*
X162018D01*
X93558Y178402D02*
X289465D01*
X102612Y184402D02*
X159046D01*
X103228Y187821D02*
Y190400D01*
X103310Y187402D02*
X156046D01*
X97228Y195000D02*
Y196150D01*
X101364Y190400D02*
X153047D01*
X100228Y195000D02*
Y196150D01*
X103228Y195000D02*
Y196150D01*
X112228Y195000D02*
Y196150D01*
X115228Y195000D02*
Y196150D01*
X106228Y195000D02*
Y196150D01*
X109228Y195000D02*
Y196150D01*
X124228Y1650D02*
Y2900D01*
X127228Y1650D02*
Y2900D01*
X118228Y1650D02*
Y2900D01*
X121228Y1650D02*
Y2900D01*
X136228Y1650D02*
Y2900D01*
X139228Y1650D02*
Y2900D01*
X130228Y1650D02*
Y2900D01*
X133228Y1650D02*
Y2900D01*
X142228Y1650D02*
Y2900D01*
X145228Y1650D02*
Y2900D01*
X142228Y6500D02*
Y14665D01*
X145228Y6500D02*
Y11292D01*
X148228Y1650D02*
Y2900D01*
X151228Y1650D02*
Y2900D01*
X148228Y6500D02*
Y11923D01*
X151228Y6500D02*
Y25212D01*
X160228Y1650D02*
Y2900D01*
X163228Y1650D02*
Y2900D01*
X154228Y1650D02*
Y2900D01*
X157228Y1650D02*
Y2900D01*
X178228Y1650D02*
Y2900D01*
X181228Y1650D02*
Y2900D01*
X166228Y1650D02*
Y2900D01*
X169228Y1650D02*
Y2900D01*
X160228Y6500D02*
Y29407D01*
X163228Y6500D02*
Y38156D01*
X154228Y6500D02*
Y11655D01*
X157228Y6500D02*
Y11410D01*
X172228Y1650D02*
Y2900D01*
X175228Y1650D02*
Y2900D01*
Y6500D02*
Y41731D01*
X181228Y6500D02*
Y16383D01*
X117673Y13402D02*
X142570D01*
X117595Y16402D02*
X142476D01*
X148228Y18097D02*
Y26167D01*
X149455Y13402D02*
X152570D01*
X149549Y16402D02*
X152476D01*
X154228Y18365D02*
Y25298D01*
X145228Y18729D02*
Y28669D01*
X157228Y18611D02*
Y26458D01*
X116856Y34402D02*
X143296D01*
X116455Y31402D02*
X143766D01*
X172228Y6500D02*
Y41710D01*
X177273Y42697D02*
X177588Y42758D01*
X159549Y16402D02*
X181217D01*
X159455Y13402D02*
X188681D01*
X154695Y25402D02*
X183257D01*
X159494Y28402D02*
X203001D01*
X180754Y18133D02*
Y22070D01*
X181254Y20102D02*
X190128D01*
X161643Y34402D02*
X203001D01*
X161173Y31402D02*
X203001D01*
X164392Y40402D02*
X182159D01*
X162045Y37402D02*
X203001D01*
X181228Y23820D02*
Y41626D01*
X177588Y42758D02*
X177931Y42806D01*
X184223Y39668D02*
X196034D01*
X190228Y1650D02*
Y2900D01*
X193228Y1650D02*
Y2900D01*
X184228Y1650D02*
Y2900D01*
X187228Y1650D02*
Y2900D01*
X196228Y6500D02*
Y7100D01*
Y1650D02*
Y2900D01*
X184228Y6500D02*
Y14665D01*
X187228Y6500D02*
Y14665D01*
X188858Y13197D02*
X194425Y7630D01*
X190228Y6500D02*
Y11826D01*
X193228Y6500D02*
Y8826D01*
X196228Y10917D02*
Y14670D01*
X192481Y14665D02*
X196446Y10700D01*
X199228Y1650D02*
Y2900D01*
X202228Y1650D02*
Y2900D01*
X199228Y6500D02*
Y7100D01*
X202228Y6500D02*
Y7100D01*
X211228Y1650D02*
Y2900D01*
X214228Y1650D02*
Y2900D01*
X205228Y1650D02*
Y2900D01*
X208228Y1650D02*
Y2900D01*
X205228Y6500D02*
Y7100D01*
X208228Y6500D02*
Y7100D01*
X199228Y10700D02*
Y16782D01*
X205228Y10700D02*
Y24090D01*
X211228Y6500D02*
Y7100D01*
X214228Y6500D02*
Y7100D01*
X208228Y10700D02*
Y23920D01*
X211228Y10700D02*
Y24083D01*
X184223Y14665D02*
X188328D01*
X190128Y20102D02*
Y25039D01*
Y20102D02*
X199002D01*
X193228Y13917D02*
Y14665D01*
X192481D02*
X196034D01*
X199502Y18133D02*
Y22070D01*
X187228Y25539D02*
Y39668D01*
X190228Y25539D02*
Y39668D01*
X184228Y25539D02*
Y39668D01*
X184223Y25539D02*
X196034D01*
X199228Y23421D02*
Y42245D01*
X193228Y25539D02*
Y39668D01*
X196228Y25533D02*
Y39674D01*
X206270Y23920D02*
X210207D01*
X196999Y25402D02*
X203533D01*
X213475Y28402D02*
X215250D01*
X212944Y25402D02*
X215250D01*
X213475Y34402D02*
X215250D01*
X213475Y31402D02*
X215250D01*
X203001Y27188D02*
Y38999D01*
X198097Y40402D02*
X203318D01*
X206270Y42268D02*
X210207D01*
X213475Y27188D02*
Y38999D01*
Y37402D02*
X215250D01*
X213159Y40402D02*
X215250D01*
X121228Y6500D02*
Y55769D01*
X124228Y6500D02*
Y55855D01*
X124927Y62439D02*
X125344Y61995D01*
X126320Y58402D02*
X128936D01*
X130228Y6500D02*
Y56355D01*
X125795Y61402D02*
X129461D01*
X118228Y6500D02*
Y65549D01*
X120138Y62225D02*
X120473Y62617D01*
X120828Y63422D02*
Y67252D01*
X127228Y6500D02*
Y65523D01*
X130228Y62248D02*
Y66530D01*
X124428Y63422D02*
Y67252D01*
X133228Y63054D02*
Y71156D01*
Y6500D02*
Y55549D01*
X136228Y6500D02*
Y58085D01*
X136320Y58402D02*
X138936D01*
X135795Y61402D02*
X139461D01*
X139228Y6500D02*
Y57605D01*
X142228Y15356D02*
Y55523D01*
X145228Y39935D02*
Y56530D01*
X136228Y60518D02*
Y65769D01*
X139228Y60999D02*
Y65855D01*
X145228Y62073D02*
Y66102D01*
X142228Y63081D02*
Y89819D01*
X124428Y71351D02*
Y77783D01*
Y76402D02*
X127983D01*
X124428Y73402D02*
X130983D01*
X131266Y70402D02*
X133708D01*
X133760Y70122D02*
X133800Y69608D01*
X127228Y73080D02*
Y77156D01*
X130228Y72073D02*
Y74156D01*
X118228Y73054D02*
Y85589D01*
X120828Y71351D02*
Y78528D01*
X133228Y76247D02*
Y117801D01*
X125515Y78869D02*
X133442Y70943D01*
X124428Y77783D02*
X125515Y78869D01*
X130228Y79247D02*
Y126315D01*
X130919Y67402D02*
X134337D01*
X140919D02*
X144108D01*
X137035Y73145D02*
X137644Y73126D01*
X144128Y69302D02*
X147628D01*
Y65802D02*
Y69302D01*
X141266Y70402D02*
X143782D01*
X147628Y69302D02*
X151128D01*
X128200Y81275D02*
X135987Y73488D01*
X136112Y73402D02*
X145328D01*
X130074Y79402D02*
X145328D01*
X133074Y76402D02*
X145328D01*
X139228Y72748D02*
Y110436D01*
X145228Y72512D02*
Y89627D01*
X136228Y73323D02*
Y112394D01*
X145328Y73241D02*
Y89677D01*
X153632Y43402D02*
X156828D01*
X164428D02*
X170122D01*
X164428Y46402D02*
X169506D01*
X177931Y48594D02*
X178787Y48533D01*
X178228Y6500D02*
Y42827D01*
X177931Y42806D02*
X178787Y42867D01*
X179242Y42874D01*
X178787Y48533D02*
X179265Y48525D01*
X148228Y42437D02*
Y65347D01*
X156828Y42374D02*
Y51676D01*
X151228Y43391D02*
Y67558D01*
X154228Y43305D02*
Y156100D01*
X166228Y6500D02*
Y156100D01*
X169228Y6500D02*
Y156100D01*
X164428Y40928D02*
Y51676D01*
X180266Y42823D02*
X180635Y42765D01*
X179242Y42874D02*
X179801Y42861D01*
X180266Y42823D01*
X199302Y42936D02*
Y46873D01*
X215250Y25400D02*
Y46873D01*
X199302Y46402D02*
X215250D01*
X199302Y43402D02*
X215250D01*
X202228Y10700D02*
Y144600D01*
X179265Y48525D02*
X179630Y48537D01*
X199228Y47565D02*
Y144600D01*
X205228Y42097D02*
Y144600D01*
X214228Y10700D02*
Y144600D01*
X208228Y42268D02*
Y144600D01*
X211228Y42104D02*
Y144600D01*
X164428Y49402D02*
X171606D01*
X177273Y48703D02*
X177588Y48642D01*
X179630Y48537D02*
X179960Y48570D01*
X180283Y48624D01*
X177588Y48642D02*
X177931Y48594D01*
X180283Y48624D02*
X180599Y48700D01*
X157228Y53373D02*
Y156100D01*
X160228Y55454D02*
Y156100D01*
X149928Y73241D02*
Y92400D01*
X151228Y71045D02*
Y113431D01*
X175228Y49669D02*
Y156100D01*
X178228Y48573D02*
Y156100D01*
X163228Y54447D02*
Y156100D01*
X172228Y49690D02*
Y156100D01*
X180599Y48700D02*
X180911Y48797D01*
X181219Y48917D01*
X181524Y49060D01*
X175794Y49402D02*
X182104D01*
X181524Y49060D02*
X181827Y49226D01*
X182129Y49418D01*
X182460Y49657D01*
X198105Y49402D02*
X215188D01*
X181228Y48921D02*
Y154826D01*
X184228Y50142D02*
Y151826D01*
X184223Y50142D02*
X196034D01*
X193228D02*
Y144600D01*
X196228Y50136D02*
Y144600D01*
X187228Y50142D02*
Y148826D01*
X190228Y50142D02*
Y145826D01*
X217228Y1650D02*
Y2900D01*
X220228Y1650D02*
Y2900D01*
X217228Y6500D02*
Y7100D01*
X223228Y1650D02*
Y2900D01*
X229228Y1650D02*
Y2900D01*
X232228Y1650D02*
Y2900D01*
X223228Y6500D02*
Y7100D01*
X226228Y1650D02*
Y2900D01*
X220228Y6500D02*
Y7100D01*
X226228Y6500D02*
Y7100D01*
X217228Y10700D02*
Y21974D01*
X220228Y10700D02*
Y22131D01*
X229228Y6500D02*
Y7100D01*
X232228Y6500D02*
Y7100D01*
X235228Y10700D02*
Y28908D01*
Y6500D02*
Y7100D01*
Y1650D02*
Y2900D01*
X195700Y7100D02*
X236206D01*
X196446Y10700D02*
X236206D01*
X238228Y1650D02*
Y2900D01*
X241228Y1650D02*
Y2900D01*
X244228Y1650D02*
Y2900D01*
X241394Y10700D02*
X263106D01*
X238228Y11921D02*
Y13907D01*
X193744Y13402D02*
X238878D01*
X238800Y8900D02*
Y11475D01*
X244228Y10700D02*
Y15868D01*
X241228Y10786D02*
Y13179D01*
X241722Y13402D02*
X297374D01*
X199039Y16402D02*
X237469D01*
X199502Y19402D02*
X239842D01*
X199486Y22402D02*
X216635D01*
X220565D02*
X240500D01*
X220350Y31402D02*
X234353D01*
X220350Y28402D02*
X235970D01*
X220350Y40402D02*
X237000D01*
X220350Y34402D02*
X237000D01*
X238228Y17893D02*
Y28315D01*
X220350Y37402D02*
X237000D01*
X240032Y30506D02*
X240281Y30792D01*
X242741Y14381D02*
X245280Y16920D01*
X244761Y16402D02*
X300374D01*
X221330Y25402D02*
X240500D01*
X238781Y18341D02*
X240500Y20060D01*
X246100Y22402D02*
X286675D01*
X246100Y19402D02*
X289659D01*
X240500Y20060D02*
Y31047D01*
X246100Y25402D02*
X285026D01*
X238430Y28402D02*
X240500D01*
X246100D02*
X284206D01*
X246100Y31402D02*
X284049D01*
X246100Y34402D02*
X284608D01*
X246100Y37402D02*
X285901D01*
X246100Y40402D02*
X288241D01*
X253228Y1650D02*
Y2900D01*
X256228Y1650D02*
Y2900D01*
X247228Y1650D02*
Y2900D01*
X250228Y1650D02*
Y2900D01*
X265228Y1650D02*
Y2900D01*
X268228Y1650D02*
Y2900D01*
X259228Y1650D02*
Y2900D01*
X262228Y1650D02*
Y2900D01*
X265700Y8900D02*
Y11475D01*
Y8900D02*
X268275D01*
X274228Y1650D02*
Y2900D01*
X277228Y1650D02*
Y2900D01*
X268228Y6500D02*
Y7150D01*
X271228Y1650D02*
Y2900D01*
X280228Y1650D02*
Y2900D01*
X282175Y2871D02*
X282964Y2851D01*
X267622Y6500D02*
X280739D01*
X281333Y2874D02*
X282175Y2871D01*
X283228Y1650D02*
Y2838D01*
X286228Y2256D02*
Y4794D01*
X286065Y4402D02*
X288374D01*
X285622Y1650D02*
X301079Y17107D01*
X268385Y7402D02*
X281183D01*
X268383Y10402D02*
X294374D01*
X286228Y6606D02*
Y23034D01*
X289228Y5256D02*
Y19732D01*
X285817Y7402D02*
X291374D01*
X292228Y8256D02*
Y17906D01*
X285443Y24394D02*
X286346Y22830D01*
X287446Y21397D01*
X284284Y27808D02*
X284752Y26063D01*
X285443Y24394D01*
X290156Y19020D02*
X291721Y18117D01*
X293390Y17425D01*
X287446Y21397D02*
X288723Y20119D01*
X290156Y19020D01*
X284049Y29599D02*
Y30502D01*
Y29599D02*
X284284Y27808D01*
X284049Y30502D02*
Y31405D01*
X284284Y33196D01*
X284752Y34940D01*
X285443Y36609D01*
X286346Y38174D01*
X287446Y39607D01*
X295228Y11256D02*
Y16946D01*
X295134Y16958D02*
X296925Y16722D01*
X293390Y17425D02*
X295134Y16958D01*
X296925Y16722D02*
X297828D01*
X298228Y14256D02*
Y16722D01*
X297828D02*
X298731D01*
X300522Y16958D01*
X301079Y17107D01*
X309310Y38174D02*
X310213Y36609D01*
X309756Y37402D02*
X311550D01*
X308210Y39607D02*
X309310Y38174D01*
X307415Y40402D02*
X311550D01*
X310905Y34940D02*
X311372Y33196D01*
X311550Y31844D01*
X310213Y36609D02*
X310905Y34940D01*
X311049Y34402D02*
X311550D01*
X220350Y26781D02*
Y46873D01*
X161375Y55402D02*
X235846D01*
X223228Y10700D02*
Y55731D01*
X235228Y33092D02*
Y56019D01*
X225653Y56148D02*
X226031Y56174D01*
X237000Y34091D02*
Y54247D01*
X217228Y51017D02*
Y144600D01*
X220228Y49739D02*
Y84965D01*
X146320Y58402D02*
X221127D01*
X226228Y10700D02*
Y56187D01*
X229228Y10700D02*
Y56200D01*
X232228Y10700D02*
Y56200D01*
X226293D02*
X235047D01*
X220350Y46402D02*
X237000D01*
X220350Y43402D02*
X237000D01*
X164358Y52402D02*
X237000D01*
X220412Y49402D02*
X237000D01*
X246100Y43402D02*
X292964D01*
X246100Y46402D02*
X311550D01*
X246100Y52402D02*
X311550D01*
X246100Y49402D02*
X311550D01*
X235047Y56200D02*
X237000Y54247D01*
X237626Y60126D02*
X240500Y57253D01*
X238228Y59525D02*
Y72212D01*
X239351Y58402D02*
X240500D01*
X246100Y18900D02*
Y71100D01*
Y55402D02*
X311550D01*
X240500Y57253D02*
Y69940D01*
X246100Y58402D02*
X311550D01*
X225858Y60829D02*
X226177Y60825D01*
X151474Y70402D02*
X240039D01*
X149928Y76402D02*
X234932D01*
X149928Y73402D02*
X237039D01*
X235228Y60800D02*
Y75315D01*
X226297Y60800D02*
X236000D01*
X226228Y60815D02*
Y83043D01*
X229228Y60800D02*
Y84033D01*
X223228Y61269D02*
Y83299D01*
X149928Y79402D02*
X237156D01*
X232228Y60800D02*
Y87098D01*
X235228Y77885D02*
Y144600D01*
X238228Y79443D02*
Y144600D01*
X124428Y64402D02*
X240500D01*
X145795Y61402D02*
X240500D01*
X151148Y67402D02*
X240500D01*
X246100Y64402D02*
X282321D01*
X246100Y61402D02*
X285810D01*
X246100Y70402D02*
X278733D01*
X246100Y67402D02*
X280156D01*
X236281Y74159D02*
X240500Y69940D01*
X240241Y78119D02*
X245280Y73080D01*
X241228Y77132D02*
Y144600D01*
X238444Y79402D02*
X277918D01*
X244958Y73402D02*
X277945D01*
X244228Y74132D02*
Y89126D01*
X241958Y76402D02*
X277692D01*
X256228Y10700D02*
Y84422D01*
X280228Y6500D02*
Y67276D01*
X250228Y10700D02*
Y83184D01*
X253228Y10700D02*
Y83159D01*
X283228Y8562D02*
Y63495D01*
X286228Y37969D02*
Y61160D01*
X287446Y39607D02*
X288723Y40884D01*
X289228Y41271D02*
Y59672D01*
X247228Y10700D02*
Y84505D01*
X259228Y10700D02*
Y88507D01*
X262228Y10700D02*
Y144600D01*
X265228Y11938D02*
Y143226D01*
X274228Y6500D02*
Y135204D01*
X277228Y6500D02*
Y190638D01*
X268228Y10650D02*
Y140226D01*
X271228Y6500D02*
Y137226D01*
X288723Y40884D02*
X290156Y41984D01*
X291721Y42887D01*
X293390Y43578D01*
X302267D02*
X303936Y42887D01*
X305500Y41984D02*
X306933Y40884D01*
X308210Y39607D01*
X303936Y42887D02*
X305500Y41984D01*
X302693Y43402D02*
X311550D01*
X292228Y43097D02*
Y58771D01*
X293390Y43578D02*
X295134Y44045D01*
X301228Y43856D02*
Y59303D01*
X300522Y44045D02*
X302267Y43578D01*
X310228Y36573D02*
Y65771D01*
X311550Y31844D02*
Y67834D01*
X304228Y42718D02*
Y60583D01*
X307228Y40589D02*
Y62592D01*
X285686Y61473D02*
X287734Y60291D01*
X289918Y59386D01*
X282139Y64584D02*
X283811Y62912D01*
X285686Y61473D01*
X295228Y44058D02*
Y58466D01*
X294546D02*
X295728D01*
X289918Y59386D02*
X292202Y58774D01*
X294546Y58466D01*
X277692Y75319D02*
Y76502D01*
Y75319D02*
X278001Y72975D01*
X277692Y76502D02*
Y77684D01*
X278001Y80028D01*
X279518Y68507D02*
X280700Y66460D01*
X282139Y64584D01*
X278001Y72975D02*
X278613Y70692D01*
X279518Y68507D01*
X295134Y44045D02*
X296925Y44281D01*
X297828D01*
X295728Y58466D02*
X296910D01*
X299254Y58774D01*
X297828Y44281D02*
X298731D01*
X300522Y44045D01*
X298228Y44281D02*
Y58639D01*
X299254Y58774D02*
X301538Y59386D01*
X303723Y60291D01*
X305770Y61473D01*
X307646Y62912D01*
X305646Y61402D02*
X311550D01*
X307646Y62912D02*
X309318Y64584D01*
X309135Y64402D02*
X311550D01*
X309318Y64584D02*
X310757Y66460D01*
X311550Y67834D01*
X121228Y79660D02*
Y85722D01*
X120457Y85402D02*
X122600D01*
X118228Y91523D02*
Y93463D01*
X121208Y91402D02*
X122600D01*
Y89853D02*
Y95132D01*
X121358Y79803D02*
X122600Y81046D01*
X121228Y91390D02*
Y93596D01*
X122163Y94402D02*
X122600D01*
X118228Y107271D02*
Y109211D01*
Y99397D02*
Y101337D01*
Y115145D02*
Y117085D01*
X120139Y115402D02*
X122600D01*
X121228Y99264D02*
Y101470D01*
X122600Y97727D02*
Y103006D01*
X121228Y115012D02*
Y117218D01*
Y107138D02*
Y109344D01*
X122600Y81046D02*
Y87258D01*
X128200Y85402D02*
X145328D01*
X121325Y109402D02*
X122600D01*
X122107Y106402D02*
X122600D01*
X128200Y88402D02*
X145328D01*
X128200Y82402D02*
X145328D01*
X128200Y91402D02*
X140992D01*
X128200Y94402D02*
X141566D01*
X122600Y105601D02*
Y110881D01*
X128200Y112402D02*
X136220D01*
X122600Y113475D02*
Y118755D01*
X128200Y115402D02*
X134016D01*
X128200Y81275D02*
Y126000D01*
Y118402D02*
X133109D01*
X133026Y119821D02*
Y120826D01*
X133418Y122797D01*
X122848Y129726D02*
X124367D01*
X124664D02*
X128680D01*
X121922Y133500D02*
X124454D01*
X122341Y129900D02*
X125200D01*
X127228Y129726D02*
Y131183D01*
X126447Y130402D02*
X129356D01*
X121700Y142402D02*
X128700D01*
X121700Y139402D02*
X128700D01*
X124454Y133500D02*
X128700Y137746D01*
X121926Y138245D02*
X122128Y137926D01*
X122813Y136402D02*
X127356D01*
X128200Y121402D02*
X133141D01*
X128200Y124402D02*
X134083D01*
X128196Y126126D02*
X129426D01*
X131447Y127402D02*
X136381D01*
X130228Y131274D02*
Y134183D01*
X129447Y133402D02*
X132356D01*
X128680Y129726D02*
X138900Y139946D01*
X130701Y126656D02*
X141970Y137925D01*
X126475Y130430D02*
X131770Y135725D01*
X132198Y136402D02*
X135356D01*
X132300Y139402D02*
X138356D01*
X132300Y142402D02*
X138900D01*
X141325Y92400D02*
X143900D01*
X142228Y94981D02*
Y109619D01*
X142223D02*
X143228D01*
X143900Y92400D02*
Y94975D01*
Y89825D02*
Y92400D01*
X143228Y109619D02*
X144233D01*
X145941Y94700D02*
X147628D01*
X140252Y110011D02*
X142223Y109619D01*
X144233D02*
X146204Y110011D01*
X136725Y111897D02*
X138396Y110780D01*
X140252Y110011D01*
X145228Y95173D02*
Y109817D01*
X148228Y94620D02*
Y110892D01*
X146204Y110011D02*
X148061Y110780D01*
X149732Y111897D01*
X149928Y88402D02*
X217977D01*
X149928Y85402D02*
X219792D01*
X149928Y91402D02*
X217638D01*
Y89998D02*
Y90759D01*
X218518Y87096D02*
X219365Y85829D01*
X220442Y84751D01*
X217638Y89998D02*
X217935Y88503D01*
X218518Y87096D01*
X217638Y91521D02*
X217935Y93016D01*
X148761Y94402D02*
X218509D01*
X217638Y90759D02*
Y91521D01*
X217935Y93016D02*
X218518Y94423D01*
X219365Y95690D01*
X220442Y96767D01*
X133026Y118816D02*
X133418Y116846D01*
X134187Y114989D01*
X133026Y118816D02*
Y119821D01*
X133418Y122797D02*
X134187Y124654D01*
Y114989D02*
X135304Y113318D01*
X136725Y111897D01*
X134187Y124654D02*
X135304Y126325D01*
X136725Y127746D01*
X133228Y121842D02*
Y129183D01*
X136228Y127249D02*
Y132183D01*
X136725Y127746D02*
X138396Y128862D01*
X140252Y129631D01*
X139228Y129207D02*
Y135183D01*
X140252Y129631D02*
X142223Y130023D01*
X142228D02*
Y138249D01*
X149732Y111897D02*
X151153Y113318D01*
X152269Y114989D01*
Y124654D02*
X153038Y122797D01*
X152269Y114989D02*
X153038Y116846D01*
X153430Y118816D02*
Y119821D01*
X153038Y116846D02*
X153430Y118816D01*
X153038Y122797D02*
X153430Y120826D01*
Y119821D02*
Y120826D01*
X143228Y130023D02*
X144233D01*
X146204Y129631D01*
X142223Y130023D02*
X143228D01*
X149732Y127746D02*
X151153Y126325D01*
X152269Y124654D01*
X146204Y129631D02*
X148061Y128862D01*
X149732Y127746D01*
X121700Y138941D02*
Y144244D01*
X127228Y136274D02*
Y145183D01*
X118100Y139172D02*
Y144244D01*
X123012Y145402D02*
X127058D01*
X132300Y137000D02*
Y143844D01*
X133228Y134274D02*
Y144638D01*
X128700Y137746D02*
Y143844D01*
X124152Y148402D02*
X126277D01*
X118228Y152210D02*
Y156100D01*
X122810Y151402D02*
X128087D01*
X124228Y133500D02*
Y156100D01*
X127228Y150617D02*
Y156100D01*
X130228Y152144D02*
Y156100D01*
X133228Y151162D02*
Y156100D01*
X138900Y139946D02*
Y144244D01*
X142500Y139200D02*
Y144244D01*
X134723Y148402D02*
X136449D01*
X133941Y145402D02*
X137588D01*
X143812D02*
X190653D01*
X143610Y151402D02*
X184653D01*
X144951Y148402D02*
X187653D01*
X136228Y137274D02*
Y156100D01*
X132913Y151402D02*
X137790D01*
X148228Y128750D02*
Y156100D01*
X151228Y126212D02*
Y156100D01*
X142228Y152269D02*
Y156100D01*
X145228Y129825D02*
Y156100D01*
X118228Y159700D02*
Y190400D01*
X121228Y152340D02*
Y156100D01*
Y159700D02*
Y190400D01*
X124228Y159700D02*
Y190400D01*
X136228Y159700D02*
Y190400D01*
X139228Y159700D02*
Y190400D01*
X127228Y159700D02*
Y190400D01*
X130228Y159700D02*
Y190400D01*
X124228Y195000D02*
Y196150D01*
X127228Y195000D02*
Y196150D01*
X118228Y195000D02*
Y196150D01*
X121228Y195000D02*
Y196150D01*
X130228Y195000D02*
Y196150D01*
X133228Y159700D02*
Y190400D01*
Y195000D02*
Y196150D01*
X136228Y195000D02*
Y196150D01*
X139228Y152290D02*
Y156100D01*
X142228Y159700D02*
Y190400D01*
X145228Y159700D02*
Y190400D01*
X148228Y159700D02*
Y190400D01*
X151228Y159700D02*
Y190400D01*
X154228Y159700D02*
Y189219D01*
X153047Y190400D02*
X161947Y181500D01*
X155626Y194326D02*
X164655Y185298D01*
X145228Y195000D02*
Y196150D01*
X148228Y195000D02*
Y196150D01*
X139228Y195000D02*
Y196150D01*
X142228Y195000D02*
Y196150D01*
X151228Y195000D02*
Y196150D01*
X154228Y194989D02*
Y196150D01*
X172228Y159700D02*
Y180602D01*
X175228Y159700D02*
Y180602D01*
X163228Y159700D02*
Y180540D01*
X166228Y159700D02*
Y180602D01*
X179954Y156100D02*
X190925Y145130D01*
X169228Y159700D02*
Y180602D01*
X178228Y159700D02*
Y180602D01*
X157228Y159700D02*
Y186219D01*
X160228Y159700D02*
Y183219D01*
X187228Y153917D02*
Y180602D01*
X190228Y150917D02*
Y180602D01*
X181228Y159621D02*
Y180602D01*
X184228Y156917D02*
Y180602D01*
X181975Y159170D02*
X192946Y148200D01*
X196228D02*
Y180602D01*
X218171Y167086D02*
X218754Y165678D01*
X220228Y148200D02*
Y163784D01*
Y96554D02*
Y144600D01*
X218754Y165678D02*
X219601Y164411D01*
X220678Y163334D01*
X202228Y148200D02*
Y196150D01*
X205228Y148200D02*
Y196150D01*
X193228Y148200D02*
Y180602D01*
X199228Y148200D02*
Y180758D01*
X214228Y148200D02*
Y196150D01*
X217228Y148200D02*
Y196150D01*
X208228Y148200D02*
Y196150D01*
X211228Y148200D02*
Y196150D01*
X163228Y186724D02*
Y196150D01*
X157228Y192725D02*
Y196150D01*
X160228Y189725D02*
Y196150D01*
X163998Y182902D02*
Y184886D01*
Y180918D02*
Y182902D01*
X166228Y185202D02*
Y196150D01*
X169228Y185202D02*
Y196150D01*
X178228Y185202D02*
Y196150D01*
X181228Y185202D02*
Y196150D01*
X172228Y185202D02*
Y196150D01*
X175228Y185202D02*
Y196150D01*
X190228Y185202D02*
Y196150D01*
X193228Y185202D02*
Y196150D01*
X184228Y185202D02*
Y196150D01*
X187228Y185202D02*
Y196150D01*
X217874Y169342D02*
Y170104D01*
X218171Y171598D01*
X164937Y180602D02*
X198202D01*
X198400Y183100D02*
X200384D01*
X217874Y168580D02*
Y169342D01*
Y168580D02*
X218171Y167086D01*
Y171598D02*
X218754Y173006D01*
X219601Y174273D01*
X198400Y183100D02*
Y185084D01*
X196228Y185202D02*
Y196150D01*
X164937Y185202D02*
X197076D01*
X220228Y174900D02*
Y196150D01*
X198400Y181116D02*
Y183100D01*
X199228Y185442D02*
Y196150D01*
X223116Y83322D02*
X224611Y83025D01*
X225373D01*
X220442Y84751D02*
X221709Y83905D01*
X223116Y83322D01*
X225373Y83025D02*
X226134D01*
X227629Y83322D01*
X229036Y83905D01*
X230303Y84751D01*
X231381Y85829D01*
X232227Y87096D01*
Y94423D02*
X232810Y93016D01*
X232227Y87096D02*
X232810Y88503D01*
X233107Y90759D02*
Y91521D01*
X232810Y88503D02*
X233107Y89998D01*
X232228Y94420D02*
Y144600D01*
X232810Y93016D02*
X233107Y91521D01*
X230954Y85402D02*
X246209D01*
X149928Y82402D02*
X278650D01*
X244055Y89998D02*
Y90759D01*
X232768Y88402D02*
X244394D01*
X244935Y87096D02*
X245782Y85829D01*
X246859Y84751D01*
X244055Y89998D02*
X244352Y88503D01*
X244935Y87096D01*
X233107Y89998D02*
Y90759D01*
X244055D02*
Y91521D01*
X233107Y91402D02*
X244055D01*
X232236Y94402D02*
X244926D01*
X244228Y92392D02*
Y144600D01*
X244055Y91521D02*
X244352Y93016D01*
X244935Y94423D01*
X245782Y95690D01*
X220442Y96767D02*
X221709Y97614D01*
X229036D02*
X230303Y96767D01*
X128200Y97402D02*
X221391D01*
X221709Y97614D02*
X223116Y98197D01*
X230303Y96767D02*
X231381Y95690D01*
X232227Y94423D01*
X245782Y95690D02*
X246859Y96767D01*
X229354Y97402D02*
X247808D01*
X223228Y98219D02*
Y144600D01*
X223116Y98197D02*
X224611Y98494D01*
X225373D01*
X226134D01*
X227629Y98197D02*
X229036Y97614D01*
X229228Y97486D02*
Y144600D01*
X226228Y98476D02*
Y144600D01*
X226134Y98494D02*
X227629Y98197D01*
X128200Y103402D02*
X311550D01*
X128200Y100402D02*
X311550D01*
X128200Y109402D02*
X311550D01*
X128200Y106402D02*
X311550D01*
X152440Y115402D02*
X311550D01*
X150236Y112402D02*
X311550D01*
X153316Y121402D02*
X311550D01*
X153348Y118402D02*
X311550D01*
X137447Y133402D02*
X311550D01*
X134447Y130402D02*
X311550D01*
X142500Y142402D02*
X266053D01*
X140447Y136402D02*
X271546D01*
X150076Y127402D02*
X311550D01*
X152374Y124402D02*
X311550D01*
X192200Y144600D02*
X263854D01*
X142500Y139402D02*
X269053D01*
X251028Y83025D02*
X251790D01*
X252552D01*
X248126Y83905D02*
X249534Y83322D01*
X251028Y83025D01*
X252552D02*
X254046Y83322D01*
X278001Y80028D02*
X278613Y82312D01*
X254046Y83322D02*
X255454Y83905D01*
X256720Y84751D01*
X246859D02*
X248126Y83905D01*
X256720Y84751D02*
X257798Y85829D01*
X258644Y87096D01*
X259227Y88503D01*
X259525Y89998D02*
Y90759D01*
X259227Y88503D02*
X259525Y89998D01*
X259227Y93016D02*
X259525Y91521D01*
Y90759D02*
Y91521D01*
X278613Y82312D02*
X279518Y84496D01*
X280700Y86543D01*
X257371Y85402D02*
X280040D01*
X259185Y88402D02*
X282125D01*
X309318Y88419D02*
X310757Y86543D01*
X311550Y85170D01*
X280700Y86543D02*
X282139Y88419D01*
X309331Y88402D02*
X311550D01*
X282139Y88419D02*
X283811Y90091D01*
X285686Y91530D01*
X259525Y91402D02*
X285519D01*
X285686Y91530D02*
X287734Y92712D01*
X305770Y91530D02*
X307646Y90091D01*
X309318Y88419D01*
X303723Y92712D02*
X305770Y91530D01*
X305938Y91402D02*
X311550D01*
X246859Y96767D02*
X248126Y97614D01*
X249534Y98197D01*
X251028Y98494D02*
X251790D01*
X254046Y98197D02*
X255454Y97614D01*
X257798Y95690D02*
X258644Y94423D01*
X259227Y93016D01*
X255454Y97614D02*
X256720Y96767D01*
X257798Y95690D01*
X247228Y97014D02*
Y144600D01*
X249534Y98197D02*
X251028Y98494D01*
X250228Y98335D02*
Y144600D01*
X251790Y98494D02*
X252552D01*
X256228Y97096D02*
Y144600D01*
X259228Y93011D02*
Y144600D01*
X253228Y98360D02*
Y144600D01*
X252552Y98494D02*
X254046Y98197D01*
X287734Y92712D02*
X289918Y93617D01*
X292202Y94229D01*
X258653Y94402D02*
X293513D01*
X292202Y94229D02*
X294546Y94538D01*
X299254Y94229D02*
X301538Y93617D01*
X303723Y92712D01*
X294546Y94538D02*
X295728D01*
X297944Y94402D02*
X311550D01*
X255771Y97402D02*
X311550D01*
X271144Y142402D02*
X311550D01*
X295728Y94538D02*
X296910D01*
X299254Y94229D01*
X274701Y139402D02*
X311550D01*
X275655Y136402D02*
X311550D01*
X223228Y148200D02*
Y161956D01*
X223353Y161905D02*
X224847Y161607D01*
X221945Y162488D02*
X223353Y161905D01*
X224847Y161607D02*
X225609D01*
X226228Y148200D02*
Y161607D01*
X229228Y148200D02*
Y162469D01*
X225609Y161607D02*
X226371D01*
X227865Y161905D01*
X220678Y163334D02*
X221945Y162488D01*
X227865Y161905D02*
X229273Y162488D01*
X230539Y163334D01*
X231617Y164411D01*
X232228Y148200D02*
Y165327D01*
X231617Y164411D02*
X232463Y165678D01*
X233046Y167086D01*
X233344Y168580D01*
X189744Y151402D02*
X311550D01*
X192744Y148402D02*
X311550D01*
X183744Y157402D02*
X310465D01*
X186744Y154402D02*
X311550D01*
X246018Y164411D02*
X247095Y163334D01*
X192946Y148200D02*
X264600D01*
X245171Y165678D02*
X246018Y164411D01*
X230607Y163402D02*
X247028D01*
X238228Y148200D02*
Y196150D01*
X241228Y148200D02*
Y196150D01*
X235228Y148200D02*
Y196150D01*
X232763Y166402D02*
X244872D01*
X244228Y148200D02*
Y196150D01*
X244588Y167086D02*
X245171Y165678D01*
X244291Y168580D02*
Y169342D01*
Y168580D02*
X244588Y167086D01*
X219601Y174273D02*
X220678Y175350D01*
X221945Y176197D01*
X223353Y176780D01*
X227865D02*
X229273Y176197D01*
X231617Y174273D02*
X232463Y173006D01*
X233046Y171598D01*
X229273Y176197D02*
X230539Y175350D01*
X231617Y174273D01*
X223228Y176728D02*
Y196150D01*
X223353Y176780D02*
X224847Y177077D01*
X225609D01*
X226371D01*
X229228Y176215D02*
Y196150D01*
X232228Y173358D02*
Y196150D01*
X226228Y177077D02*
Y196150D01*
X226371Y177077D02*
X227865Y176780D01*
X233344Y169342D02*
Y170104D01*
Y169402D02*
X244291D01*
X233046Y171598D02*
X233344Y170104D01*
X232714Y172402D02*
X244921D01*
X233344Y168580D02*
Y169342D01*
X244291D02*
Y170104D01*
X244588Y171598D01*
X245171Y173006D01*
X162551Y187402D02*
X280465D01*
X200213Y181402D02*
X286465D01*
X156551Y193402D02*
X274465D01*
X159551Y190402D02*
X277465D01*
X245171Y173006D02*
X246018Y174273D01*
X247095Y175350D01*
X230462Y175402D02*
X247172D01*
X200516Y184402D02*
X283465D01*
X250228Y148200D02*
Y161813D01*
X251264Y161607D02*
X252026D01*
X252788D01*
X254282Y161905D01*
X263854Y144600D02*
X271333Y137122D01*
X253228Y148200D02*
Y161695D01*
X247228Y148200D02*
Y163245D01*
X256228Y148200D02*
Y162847D01*
X249770Y161905D02*
X251264Y161607D01*
X259228Y148200D02*
Y166518D01*
X268228Y145317D02*
Y196150D01*
X271228Y142317D02*
Y196150D01*
X262228Y148200D02*
Y196150D01*
X265228Y148087D02*
Y196150D01*
X298228Y94364D02*
Y169638D01*
X301228Y93700D02*
Y166638D01*
X265875Y147670D02*
X273878Y139667D01*
X268144Y145402D02*
X311550D01*
X310228Y87232D02*
Y157638D01*
X311550Y85170D02*
Y156316D01*
X304228Y92420D02*
Y163638D01*
X307228Y90411D02*
Y160638D01*
X280228Y85727D02*
Y187638D01*
X283228Y89508D02*
Y184638D01*
X274228Y139596D02*
Y193638D01*
X271716Y196150D02*
X311550Y156316D01*
X286228Y91843D02*
Y181638D01*
X289228Y93331D02*
Y178638D01*
X292228Y94232D02*
Y175638D01*
X295228Y94538D02*
Y172638D01*
X247095Y163334D02*
X248362Y162488D01*
X249770Y161905D01*
X247095Y175350D02*
X248362Y176197D01*
X249770Y176780D01*
X254282Y161905D02*
X255690Y162488D01*
X256957Y163334D01*
X254282Y176780D02*
X255690Y176197D01*
X256957Y175350D01*
X247228Y175439D02*
Y196150D01*
X249770Y176780D02*
X251264Y177077D01*
X250228Y176871D02*
Y196150D01*
X251264Y177077D02*
X252026D01*
X252788D02*
X254282Y176780D01*
X256228Y175837D02*
Y196150D01*
X252026Y177077D02*
X252788D01*
X253228Y176989D02*
Y196150D01*
X256957Y163334D02*
X258034Y164411D01*
X257024Y163402D02*
X304465D01*
X258034Y164411D02*
X258881Y165678D01*
X259464Y167086D01*
X259761Y168580D01*
X259180Y166402D02*
X301465D01*
X259761Y168580D02*
Y169342D01*
Y169402D02*
X298465D01*
X258034Y174273D02*
X258881Y173006D01*
X259464Y171598D01*
X256957Y175350D02*
X258034Y174273D01*
X256880Y175402D02*
X292465D01*
X259464Y171598D02*
X259761Y170104D01*
Y169342D02*
Y170104D01*
X259228Y172167D02*
Y196150D01*
X259131Y172402D02*
X295465D01*
X35000Y164700D02*
X38700D01*
D14*
X173700Y45700D02*
D03*
X73800Y120500D02*
D03*
X73900Y129300D02*
D03*
X74100Y138800D02*
D03*
X99100Y186800D02*
D03*
X88100Y181500D02*
D03*
X82600Y160000D02*
D03*
X82700Y172000D02*
D03*
X111200Y148200D02*
D03*
X119900Y148300D02*
D03*
X130500Y147900D02*
D03*
X140700Y148300D02*
D03*
X18109Y91002D02*
D03*
Y81002D02*
D03*
Y71002D02*
D03*
Y61002D02*
D03*
Y51002D02*
D03*
X71691Y91198D02*
D03*
Y81198D02*
D03*
Y71198D02*
D03*
Y61198D02*
D03*
Y51198D02*
D03*
D26*
X189333Y45700D02*
X190128Y44905D01*
X173700Y45700D02*
X189333D01*
X237800Y76600D02*
X243300Y71100D01*
Y18900D02*
Y71100D01*
X240300Y15900D02*
X243300Y18900D01*
D27*
X217800Y25400D02*
Y48200D01*
Y25400D02*
X218600Y24600D01*
Y24500D02*
Y24600D01*
D28*
X198202Y182902D02*
X198400Y183100D01*
X163998Y182902D02*
X198202D01*
X154000Y192700D02*
X163898Y182802D01*
X65200Y192700D02*
X154000D01*
X63400Y190900D02*
X65200Y192700D01*
X143900Y92400D02*
X147628D01*
Y69302D02*
Y92400D01*
X80600Y36200D02*
X82600Y38200D01*
Y69500D01*
Y160000D02*
X82700Y160100D01*
Y172000D01*
X239300Y33100D02*
Y55200D01*
X236000Y58500D02*
X239300Y55200D01*
X224000Y58500D02*
X236000D01*
X237200Y31000D02*
X239300Y33100D01*
X80600Y30600D02*
Y36200D01*
D30*
X119600Y88556D02*
D03*
X111726Y96430D02*
D03*
X119600D02*
D03*
Y104304D02*
D03*
X111726D02*
D03*
Y120052D02*
D03*
X119600D02*
D03*
Y112178D02*
D03*
X111726D02*
D03*
Y135800D02*
D03*
X119600D02*
D03*
Y127926D02*
D03*
X111726D02*
D03*
D31*
Y88556D02*
D03*
D32*
X117628Y69302D02*
D03*
X127628D02*
D03*
X137628D02*
D03*
X147628D02*
D03*
X142628Y59302D02*
D03*
X132628D02*
D03*
X122628D02*
D03*
X112628D02*
D03*
X156012Y15010D02*
D03*
X104144Y14810D02*
D03*
X114144D02*
D03*
X146012Y15010D02*
D03*
D33*
X152469Y34302D02*
D03*
X107687Y34102D02*
D03*
D34*
X160628Y46302D02*
D03*
X99416Y46310D02*
D03*
D35*
X208239Y33094D02*
D03*
D36*
X190128Y20102D02*
D03*
Y44905D02*
D03*
D37*
X18109Y41002D02*
D03*
X71691Y41198D02*
D03*
D38*
X273600Y137400D02*
D03*
X71700Y149600D02*
D03*
X198400Y183100D02*
D03*
X163998Y182902D02*
D03*
X92400Y186800D02*
D03*
X82600Y69500D02*
D03*
X63900Y123400D02*
D03*
X66800Y132900D02*
D03*
X74000Y145700D02*
D03*
X81600Y181500D02*
D03*
D39*
X143900Y92400D02*
D03*
X224000Y58500D02*
D03*
X237200Y31000D02*
D03*
X217800Y48200D02*
D03*
X237800Y76600D02*
D03*
X240300Y15900D02*
D03*
X52555Y133055D02*
D03*
X283500Y5700D02*
D03*
X400Y118600D02*
D03*
X29100Y185900D02*
D03*
X80600Y30600D02*
D03*
X63400Y190900D02*
D03*
X69900Y169500D02*
D03*
X58600Y131600D02*
D03*
X38700Y114600D02*
D03*
X13400Y106600D02*
D03*
X4500Y144800D02*
D03*
X238800Y8900D02*
D03*
X265700D02*
D03*
X4500Y165600D02*
D03*
X218600Y24500D02*
D03*
X35100Y164600D02*
D03*
D40*
X251790Y90759D02*
D03*
X225373D02*
D03*
X225609Y169342D02*
D03*
X252026D02*
D03*
M02*
