Designator Footprint               Mid X         Mid Y         Ref X         Ref Y         Pad X         Pad Y TB      Rotation Comment        

R37        0603_R            1717.634mil    186.739mil   1717.635mil    186.738mil   1687.319mil    186.739mil  T        360.00 R-10K          
R7         0603_R            1718.619mil    116.857mil   1718.619mil    116.857mil   1688.304mil    116.857mil  T        360.00 R-10K          
H2         HEADER2_-_1.5MM   1273.768mil    642.518mil    1225.32mil    693.518mil   1332.792mil    672.959mil  T        270.00 header2-1.5MM  
U13        OLED_BOARD         986.769mil   2374.266mil   1386.374mil   2374.266mil   1386.374mil   2374.266mil  B        180.00 OLED_BOARD     
R21        0603_R             908.548mil   2583.265mil    908.548mil   2583.265mil    908.548mil    2613.58mil  T        270.00 R-4K7          
R19        0603_R             780.548mil   2583.265mil    780.548mil   2583.265mil    780.548mil    2613.58mil  T        270.00 R-910K         
R18        0603_R             860.351mil   2713.313mil    860.351mil   2713.313mil    860.351mil   2743.628mil  T        270.00 R-4K7          
R16        0603_R             929.249mil   2715.282mil    929.249mil   2715.282mil    929.249mil   2745.597mil  T        270.00 R-4K7          
H1         0603_R             708.548mil   1943.266mil    708.548mil   1943.266mil    708.548mil   1973.581mil  T        270.00 NC             
U2         HM_10C             569.548mil   1406.969mil    559.548mil   1828.071mil    569.548mil   1052.638mil  T        180.00 BLE            
R15        0603_R            1401.548mil   2290.266mil   1401.548mil   2290.266mil   1371.233mil   2290.266mil  T        360.00 R-10K          
D8         0805_LED_S1       1039.548mil   1153.638mil   1039.548mil   1153.638mil   1039.548mil    1119.19mil  B        270.00 BLUE_LED       
C26        0603_C             345.548mil   2570.638mil    345.548mil   2570.639mil    345.548mil   2600.953mil  T        270.00 C-47p          
U17        1-SOT-89(SOT-89-3)    536.548mil   2104.541mil    536.548mil   2055.329mil    477.492mil   2055.328mil  T        270.00 HT-7533        
R79        0603_R             256.547mil   2216.266mil    256.548mil   2216.266mil    286.862mil   2216.266mil  T        180.00 R-10K          
R78        0603_R             608.548mil   2308.265mil    608.548mil   2308.266mil    608.548mil    2338.58mil  T        270.00 R-10K          
R76        0603_R             370.548mil   2198.266mil    370.548mil   2198.266mil    370.548mil   2167.951mil  T         90.00 R-1K           
R75        0603_R             370.548mil   2332.266mil    370.548mil   2332.266mil    370.548mil   2301.951mil  T         90.00 R-10K          
Q15        1-SOT-23(SOT-23-3)    263.548mil   2334.266mil    263.548mil   2334.266mil    226.146mil   2285.054mil  T        270.00 SI2302DS       
Q14        1-SOT-23(SOT-23-3)    503.548mil   2311.266mil    503.548mil   2311.266mil    466.146mil   2262.054mil  T        270.00 SS8550         
C32        1-CASE-A_3216      553.548mil   2439.266mil    553.548mil   2439.266mil    605.122mil   2439.266mil  T        360.00 C-10u          
C23        1-CASE-A_3216      280.627mil    108.983mil    280.627mil    108.983mil    332.202mil    108.983mil  T        360.00 C-10u          
Y3         1-HC-49S          1585.745mil   3079.455mil   1585.745mil   3079.455mil   1682.201mil   3079.455mil  T        180.00 XTAL-27.12M    
U16        QFN32               563.74mil   2904.048mil     455.24mil   2972.968mil     444.24mil   2972.968mil  T          0.00 RC522          
R74        0603_R             858.383mil   2844.218mil    858.383mil   2844.219mil    858.383mil   2874.533mil  T        270.00 R-5K1          
R73        0603_R             786.532mil   2841.265mil    786.532mil   2841.266mil    786.532mil    2871.58mil  T        270.00 R-820R         
R72        0603_R             259.548mil   3027.637mil    259.548mil   3027.638mil    259.548mil   3057.952mil  T        270.00 R-1K           
R71        0603_R             261.548mil   2895.639mil    261.548mil   2895.638mil    261.548mil   2865.324mil  T         90.00 R-470K         
L2         1-1206_L           543.548mil   2570.638mil    543.548mil   2570.638mil    543.548mil     2629.3mil  T        270.00 2.2uH          
L1         1-1206_L           262.548mil   2564.638mil    262.548mil   2564.638mil    262.548mil     2623.3mil  T        270.00 2.2uH          
C31        0603_C             835.744mil   2949.534mil    835.745mil   2949.534mil    866.059mil   2949.534mil  T        180.00 C-15p          
C30        0603_C              836.73mil   3019.416mil    836.729mil   3019.416mil    806.415mil   3019.416mil  T        360.00 C-15p          
C29        0603_C             781.611mil   2714.101mil    781.611mil   2714.102mil    781.611mil   2744.416mil  T        270.00 C-104          
C28        0603_C             930.233mil   2848.157mil    930.233mil   2848.156mil    930.233mil   2817.842mil  T         90.00 C-104          
C27        0603_C             437.548mil   2570.639mil    437.548mil   2570.638mil    437.548mil   2540.324mil  T         90.00 C-47p          
C25        0603_C             334.548mil   3024.637mil    334.548mil   3024.638mil    334.548mil   3054.952mil  T        270.00 C-104          
C24        0603_C             333.548mil   2897.639mil    333.548mil   2897.638mil    333.548mil   2867.324mil  T         90.00 C-104          
接锁体        HEADER4-_CHA-1.5MM   1545.658mil    824.638mil   1544.075mil    835.638mil   1457.076mil    824.638mil  T        360.00 Z-1.5MM*4      
接设置板1      HEADER5-_CHA-1.5MM   1412.548mil    192.638mil   1412.438mil    208.638mil   1294.438mil    192.638mil  T        360.00 Z-1.5*5PIN     
接指纹        HEADER6-_CHA-1.5MM    966.966mil    204.638mil    969.493mil    206.638mil    819.328mil    204.638mil  T        360.00 Z-1.5*6PIN     
Y2         1-HC-49S          1526.548mil   1555.638mil   1526.548mil   1555.638mil   1526.548mil   1652.094mil  T        270.00 XTAL-8M        
Y1         晶振_-_小            1287.308mil   1061.858mil    1236.43mil     921.11mil   1314.186mil    923.078mil  T        180.00 XTAL-32k       
U20        1-SOT-89(SOT-89-3)   1753.761mil   1222.638mil   1802.973mil   1222.638mil   1802.974mil   1163.582mil  T        360.00 HT-7533        
U19        1-SOT-89(SOT-89-3)   1856.548mil    828.914mil   1856.548mil    779.701mil   1797.492mil    779.702mil  T        270.00 HT-7533        
U12        1-SOT-89(SOT-89-3)    503.603mil    171.851mil    503.603mil    122.638mil    444.548mil    122.638mil  T        270.00 HT-7533        
U11        1-SOT-89(SOT-89-3)    298.344mil    250.714mil    298.344mil    201.501mil    239.289mil    201.501mil  T        270.00 HT-7533        
U10        1-SOIC-14_150mil    1418.91mil   2707.638mil    1418.91mil   2707.638mil   1316.548mil   2857.638mil  T        270.00 CD4066         
U8         1-SOIC-14_150mil   1751.548mil   2709.638mil   1751.548mil   2709.638mil   1649.186mil   2859.638mil  T        270.00 cd4002/TI      
U6         1-SOIC-8_150mil   1708.548mil   2289.266mil   1708.548mil   2289.266mil    1810.91mil   2214.266mil  T         90.00 NY3P           
U5         1-SOIC-8_150mil   1524.548mil   1053.638mil   1524.548mil   1053.638mil   1449.548mil    951.276mil  T          0.00 L9110S         
U4         1-SOIC-14_150mil   1002.548mil   1180.276mil   1002.548mil   1180.276mil   1152.548mil   1282.638mil  T        180.00 CD4066         
U3         1-SOIC-8_150mil    945.548mil    859.638mil    945.548mil    859.638mil    870.548mil    757.276mil  T        360.00 DS1302         
U1         1-LQFP-64_10x10x05P   1039.485mil   1675.912mil   1039.484mil   1675.912mil   1257.989mil   1528.274mil  T         90.00 STM32F103RCT6  
T-H1       HEADER9-软排线-0.5MM    1148.02mil   2902.408mil   1204.839mil   2911.148mil   1204.839mil   2989.888mil  T        270.00 Header 9       
R86        0603_R             1716.65mil     49.927mil    1716.65mil     49.927mil   1746.965mil     49.927mil  T        180.00 R-10K          
R84        0603_R            1524.548mil    594.639mil   1524.548mil    594.638mil   1524.548mil    564.324mil  B         90.00 R-300R         
R83        0603_R             862.548mil   1151.639mil    862.548mil   1151.638mil    862.548mil   1121.324mil  B         90.00 R-300R         
R65        0603_R            1248.548mil   2152.265mil   1248.548mil   2152.266mil   1248.548mil    2182.58mil  T        270.00 R-470K         
R64        0603_R            1259.549mil   2062.266mil   1259.548mil   2062.266mil   1229.234mil   2062.266mil  T        360.00 R-1M           
R63        0603_R             632.988mil   1210.361mil    632.989mil   1210.361mil    663.303mil   1210.361mil  T        180.00 R-10K          
R61        0603_R             739.547mil    759.638mil    739.548mil    759.638mil    769.862mil    759.638mil  T        180.00 R-10K          
R55        0603_R             154.548mil    597.639mil    154.548mil    597.638mil    154.548mil    567.324mil  B         90.00 R-300R         
R52        0603_R             229.548mil   1688.637mil    229.548mil   1688.638mil    229.548mil   1718.952mil  B        270.00 R-300R         
R51        0603_R             905.548mil   1694.637mil    905.548mil   1694.638mil    905.548mil   1724.952mil  B        270.00 R-300R         
R50        0603_R            1781.548mil    589.637mil   1781.548mil    589.638mil   1781.548mil    619.952mil  B        270.00 R-300R         
R49        0603_R             919.548mil   1990.266mil    919.548mil   1990.266mil    919.548mil   1959.951mil  B         90.00 R-300R         
R48        0603_R             419.548mil    595.637mil    419.548mil    595.638mil    419.548mil    625.952mil  B        270.00 R-300R         
R47        0603_R            1183.547mil   1188.266mil   1183.548mil   1188.266mil   1213.862mil   1188.266mil  B        180.00 R-300R         
R46        0603_R             394.548mil   1134.637mil    394.548mil   1134.638mil    394.548mil   1164.952mil  B        270.00 R-300R         
R45        0603_R            1563.548mil   2248.637mil   1563.548mil   2248.638mil   1563.548mil   2278.952mil  B        270.00 R-300R         
R40        0603_R            1070.548mil    592.637mil   1070.548mil    592.638mil   1070.548mil    622.952mil  B        270.00 R-300R         
R39        0603_R            1580.548mil   1141.953mil   1580.548mil   1141.953mil   1580.548mil   1172.268mil  B        270.00 R-300R         
R36        0603_R             788.548mil    399.323mil    788.548mil    399.323mil    788.548mil    429.638mil  T        270.00 R-10K          
R35        0603_R              795.39mil     534.18mil     795.39mil    534.179mil     795.39mil    503.865mil  T         90.00 R-200R         
R34        0603_R            1675.548mil   1032.323mil   1675.548mil   1032.323mil   1675.548mil   1002.008mil  T         90.00 R-10K          
R33        0603_R            1754.548mil   1034.323mil   1754.548mil   1034.323mil   1754.548mil   1004.008mil  T         90.00 R-0R           
R32        0603_R            1826.548mil   1015.637mil   1826.548mil   1015.638mil   1826.548mil   1045.952mil  T        270.00 R-1K           
R30        0603_R            1211.729mil    2610.95mil   1211.729mil   2610.951mil   1211.729mil   2641.265mil  T        270.00 R-10K          
R29        0603_R             219.548mil   2251.265mil    219.548mil   2251.266mil    219.548mil    2281.58mil  B        270.00 R-300R         
R28        0603_R            1739.548mil   1696.953mil   1739.548mil   1696.953mil   1739.548mil   1727.268mil  B        270.00 R-300R         
R26        0603_R            1704.547mil   1361.638mil   1704.548mil   1361.638mil   1734.862mil   1361.638mil  T        180.00 R-10K          
R25        0603_R             684.547mil    373.638mil    684.548mil    373.638mil    714.862mil    373.638mil  T        180.00 R-10K          
R24        0603_R            1716.233mil   1605.638mil   1716.233mil   1605.638mil   1685.918mil   1605.638mil  T        360.00 R-10K          
R23        0603_R             549.328mil    542.053mil    549.327mil    542.053mil    519.013mil    542.053mil  T        360.00 R-10K          
R22        0603_R             523.738mil    473.156mil    523.737mil    473.156mil    493.423mil    473.156mil  T        360.00 R-1K           
R20        0603_R            1868.549mil   2947.638mil   1868.548mil   2947.638mil   1838.234mil   2947.638mil  T        360.00 R-10K          
R13        0603_R             902.549mil    369.638mil    902.548mil    369.638mil    872.234mil    369.638mil  T        360.00 R-10K          
R11        0603_R            1823.548mil   1429.323mil   1823.548mil   1429.323mil   1823.548mil   1399.008mil  T         90.00 R-1k           
R10        0603_R            1816.548mil   1569.639mil   1816.548mil   1569.638mil   1816.548mil   1539.324mil  T         90.00 R-10K          
R8         0603_R            1490.548mil   2153.265mil   1490.548mil   2153.266mil   1490.548mil    2183.58mil  T        270.00 R-0R           
R6         0603_R            1531.547mil   1897.638mil   1531.548mil   1897.638mil   1561.862mil   1897.638mil  T        180.00 R-10K          
R5         0603_R            1350.548mil   2154.637mil   1350.548mil   2154.638mil   1350.548mil   2184.952mil  T        270.00 R-0R           
R4         0603_R            1296.549mil   1305.638mil   1296.548mil   1305.638mil   1266.234mil   1305.638mil  T          0.00 R-10K          
R2         0603_R            1680.547mil   2484.638mil   1680.548mil   2484.638mil   1710.862mil   2484.638mil  T        180.00 R-10K          
R1         0603_R            1414.548mil   2152.637mil   1414.548mil   2152.638mil   1414.548mil   2182.952mil  T        270.00 R-10K          
Q13        1-SOT-23(SOT-23-3)    632.005mil   1322.565mil    632.005mil   1322.565mil    594.603mil   1273.353mil  T        270.00 SI2302DS       
Q10        1-SOT-23(SOT-23-3)    737.548mil    883.851mil    737.548mil    883.851mil    700.146mil    834.638mil  T        270.00 SI2302DS       
Q9         1-SOT-23(SOT-23-3)   1868.225mil   3068.628mil   1868.225mil   3068.628mil   1830.823mil   3019.416mil  T        270.00 SI2301DS       
Q8         1-SOT-23(SOT-23-3)   1710.548mil   1488.638mil   1710.548mil   1488.638mil   1673.146mil   1439.426mil  T        270.00 SI2302DS       
Q7         1-SOT-23(SOT-23-3)    895.548mil    518.638mil    895.548mil    518.638mil    858.146mil    469.426mil  T        270.00 SS8550         
Q4         1-SOT-23(SOT-23-3)    693.028mil    522.368mil    693.028mil    522.368mil    655.626mil    473.156mil  T        270.00 SI2302DS       
Q3         1-SOT-23(SOT-23-3)    551.296mil    655.242mil    551.296mil    655.242mil    513.894mil    606.029mil  T        270.00 SS8550         
Q2         1-SOT-23(SOT-23-3)   1392.832mil   2946.581mil   1392.832mil   2946.581mil   1442.044mil   2909.178mil  T        360.00 SI2301DS       
Q1         1-SOT-23(SOT-23-3)   1714.548mil   1717.266mil   1714.548mil   1717.266mil   1677.146mil   1668.054mil  T        270.00 SS8550         
JP1        header4             47.548mil   2286.748mil     52.548mil   2346.638mil     47.548mil   2168.638mil  T        270.00 HEADER4        
D17        0805_LED_S1       1654.548mil   1695.638mil   1654.548mil   1695.638mil   1654.548mil    1661.19mil  B        270.00 BLUE_LED       
D16        0805_LED_S1       1607.548mil    597.638mil   1607.548mil    597.638mil   1607.548mil     563.19mil  B        270.00 RED_LED        
D15        0805_LED_S1        943.548mil   1150.638mil    943.548mil   1150.638mil    943.548mil    1116.19mil  B        270.00 RED_LED        
D14        0805_LED_S1        242.548mil    600.638mil    242.548mil    600.638mil    242.548mil     566.19mil  B        270.00 RED_LED        
D13        0805_LED_S1        315.548mil   1685.638mil    315.548mil   1685.638mil    315.548mil    1651.19mil  B        270.00 BLUE_LED       
D12        0805_LED_S1        987.548mil   1692.638mil    987.548mil   1692.638mil    987.548mil    1658.19mil  B        270.00 BLUE_LED       
D11        0805_LED_S1       1700.548mil    597.638mil   1700.548mil    597.638mil   1700.548mil     563.19mil  B        270.00 BLUE_LED       
D10        0805_LED_S1        982.548mil   2221.266mil    982.548mil   2221.266mil    982.548mil   2186.818mil  B        270.00 BLUE_LED       
D9         0805_LED_S1        337.548mil    598.638mil    337.548mil    598.638mil    337.548mil     564.19mil  B        270.00 BLUE_LED       
D7         0805_LED_S1        315.548mil   1131.638mil    315.548mil   1131.638mil    315.548mil    1097.19mil  B        270.00 BLUE_LED       
D6         0805_LED_S1       1648.548mil   2252.638mil   1648.548mil   2252.638mil   1648.548mil    2218.19mil  B        270.00 BLUE_LED       
D5         0805_LED_S1        987.548mil    592.638mil    987.548mil    592.638mil    987.548mil     558.19mil  B        270.00 BLUE_LED       
D4         0805_LED_S1       1662.548mil   1151.087mil   1662.548mil   1151.087mil   1662.548mil   1116.638mil  B        270.00 BLUE_LED       
D3         1-SMA(DO-214AC)    319.997mil    569.612mil    319.997mil    569.612mil    237.319mil    569.612mil  T        180.00 IN5819,SS14    
D2         1-SMA(DO-214AC)   1474.548mil    344.638mil   1474.548mil    344.638mil    1391.87mil    344.638mil  T        180.00 IN5819,SS14    
D1         0805_LED_S1        297.548mil   2252.266mil    297.548mil   2252.266mil    297.548mil   2217.818mil  B        270.00 BLUE_LED       
C43        1-CASE-A_3216     1919.548mil   1493.213mil   1919.548mil   1493.213mil   1919.548mil   1544.788mil  T         90.00 C-10u          
C42        1-CASE-A_3216     1908.548mil   1181.063mil   1908.548mil   1181.063mil   1908.548mil   1232.638mil  T         90.00 C-10u          
C41        0603_C            1130.037mil    875.715mil   1130.036mil    875.715mil   1160.352mil    875.715mil  T        180.00 C-6p           
C40        0603_C            1136.549mil    969.638mil   1136.548mil    969.638mil   1166.864mil    969.638mil  T        180.00 C-6p           
C39        1-CASE-A_3216     1807.973mil    558.638mil   1807.973mil    558.638mil   1859.548mil    558.638mil  T        360.00 C-10u          
C36        1-CASE-A_3216      657.548mil    182.638mil    657.548mil    182.638mil    657.548mil    234.212mil  T         90.00 C-10u          
C35        1-CASE-A_3216      508.123mil    365.638mil    508.123mil    365.638mil    559.698mil    365.638mil  T        360.00 C-10u          
C34        1-CASE-A_3216      346.572mil    455.439mil    346.572mil    455.439mil    398.146mil    455.439mil  T        360.00 C-10u          
C33        1-CASE-A_3216      543.548mil   1973.266mil    543.548mil   1973.266mil    595.122mil   1973.266mil  T        360.00 C-10u          
C12        1-CASE-A_3216     1814.548mil    666.638mil   1814.548mil    666.638mil   1866.122mil    666.638mil  T        360.00 C-10u          
C9         0603_C            1909.548mil   2336.639mil   1909.548mil   2336.638mil   1909.548mil   2366.954mil  T        270.00 C-104          
C8         0603_C            1702.548mil   2135.266mil   1702.548mil   2135.266mil   1672.233mil   2135.266mil  T        360.00 C-104          
C7         0603_C             684.548mil   1512.267mil    684.548mil   1512.266mil    684.548mil   1542.582mil  T        270.00 C-104          
C5         0603_C            1347.549mil   1436.266mil   1347.548mil   1436.266mil   1317.234mil   1436.266mil  T        360.00 C-104          
C3         0603_C            1533.863mil   1971.638mil   1533.863mil   1971.638mil   1503.548mil   1971.638mil  T          0.00 C-104          
C2         0603_C            1532.549mil   1831.638mil   1532.548mil   1831.638mil   1562.864mil   1831.638mil  T        180.00 C-22p          
C1         0603_C            1544.549mil   1291.638mil   1544.548mil   1291.638mil   1574.864mil   1291.638mil  T        180.00 C-22p          
USB        Micro_USB         -158.996mil   1022.836mil   -309.744mil   1022.835mil    -92.894mil   1074.016mil  T        180.00 Micro_USB      
R27        0603_R             844.548mil   2583.265mil    844.548mil   2583.266mil    844.548mil    2613.58mil  T        270.00 R-4K7          
C16        0603_C             652.548mil   2583.267mil    652.548mil   2583.266mil    652.548mil   2613.582mil  T        270.00 C-225          
C15        0603_C             716.548mil   2583.267mil    716.548mil   2583.266mil    716.548mil   2613.582mil  T        270.00 C-475          
C14        0603_C             1281.61mil   2250.715mil   1281.611mil   2250.715mil   1311.925mil   2250.715mil  T        180.00 C-105          
C13        0603_C            1318.233mil   2468.266mil   1318.234mil   2468.266mil   1348.548mil   2468.266mil  T        180.00 C-105          
C10        0603_C            1196.547mil   2467.266mil   1196.548mil   2467.266mil   1166.232mil   2467.266mil  T        360.00 C-105          
R31        0603_R            1559.171mil    2941.66mil    1559.17mil    2941.66mil   1528.856mil    2941.66mil  T        360.00 R-10K          

