"Designator","Footprint","Mid X","Mid Y","Ref X","Ref Y","Pad X","Pad Y","Layer","Rotation","Comment"
""
"U9","刷卡线圈","1135.189mil","1897.536mil","831.189mil","1083.036mil","1132.189mil","1902.036mil","T","0.00","刷卡线圈"
"U7","BS83B12","117.804mil","2621.146mil","118.189mil","2625.036mil","231.19mil","2503.036mil","B","360.00","BS83B12A"
"T-H2","HEADER9-软排线-0.5MM","1492.842mil","2838.702mil","1436.023mil","2847.441mil","1436.023mil","2926.181mil","B","270.00","Header 9"
"R17","0603_R","24.874mil","2986.036mil","24.875mil","2986.036mil","55.189mil","2986.036mil","B","180.00","R-10K"
"R12","0603_R","153.874mil","2839.036mil","153.875mil","2839.036mil","184.189mil","2839.036mil","B","180.00","R-200R"
"R9","0603_R","24.874mil","2917.036mil","24.875mil","2917.036mil","55.189mil","2917.036mil","B","180.00","R-10K"
"P13","PAD_-HOLE_-8MM-铝合金","1039.213mil","524.214mil","846.189mil","531.036mil","1039.213mil","524.214mil","T","0.00","PAD"
"P12","PAD_-HOLE_-8MM-铝合金","1709.213mil","524.214mil","1516.189mil","531.036mil","1709.213mil","524.214mil","T","0.00","PAD"
"P11","PAD_-HOLE_-8MM-铝合金","371.213mil","524.214mil","178.189mil","531.036mil","371.213mil","524.214mil","T","0.00","PAD"
"P9","PAD_-HOLE_-8MM-铝合金","1708.213mil","1073.214mil","1515.189mil","1080.036mil","1708.213mil","1073.214mil","T","0.00","PAD"
"P8","PAD_-HOLE_-8MM-铝合金","1039.213mil","1075.214mil","846.189mil","1082.036mil","1039.213mil","1075.214mil","T","0.00","PAD"
"P7","PAD_-HOLE_-8MM-铝合金","369.213mil","1075.214mil","176.189mil","1082.036mil","369.213mil","1075.214mil","T","0.00","PAD"
"P6","PAD_-HOLE_-8MM-铝合金","1709.213mil","1626.214mil","1516.189mil","1633.036mil","1709.213mil","1626.214mil","T","0.00","PAD"
"P5","PAD_-HOLE_-8MM-铝合金","1042.213mil","1624.214mil","849.189mil","1631.036mil","1042.213mil","1624.214mil","T","0.00","PAD"
"P4","PAD_-HOLE_-8MM-铝合金","368.213mil","1629.214mil","175.189mil","1636.036mil","368.213mil","1629.214mil","T","0.00","PAD"
"P3","PAD_-HOLE_-8MM-铝合金_-_DUPLICATE","1708.213mil","2156.528mil","1515.189mil","2183.036mil","1708.213mil","2156.528mil","T","0.00","PAD"
"P2","PAD_-HOLE_-8MM-铝合金_-_FOR-2","1040.189mil","2162.352mil","847.165mil","2187.858mil","1040.189mil","2162.352mil","T","0.00","PAD"
"P1","PAD_-HOLE_-8MM-铝合金_-_FOR-1","372.189mil","2164.036mil","179.165mil","2190.543mil","372.189mil","2164.036mil","T","0.00","PAD"
"C22","0603_C","1743.189mil","2549.037mil","1743.189mil","2549.036mil","1743.189mil","2518.722mil","B","90.00","C-15p"
"C21","0603_C","1680.189mil","2548.037mil","1680.189mil","2548.036mil","1680.189mil","2578.352mil","B","270.00","C-240p"
"C20","0603_C","1617.189mil","2548.037mil","1617.189mil","2548.036mil","1617.189mil","2517.722mil","B","90.00","C-15p"
"C19","0603_C","1491.189mil","2546.037mil","1491.189mil","2546.036mil","1491.189mil","2576.352mil","B","270.00","C-15p"
"C18","0603_C","1429.189mil","2550.037mil","1429.189mil","2550.036mil","1429.189mil","2519.722mil","B","90.00","C-240p"
"C17","0603_C","1555.189mil","2548.037mil","1555.189mil","2548.036mil","1555.189mil","2517.722mil","B","90.00","C-15p"
"C11","0603_C","151.874mil","2987.036mil","151.875mil","2987.036mil","182.189mil","2987.036mil","B","180.00","C-104"
"C6","0603_C","22.876mil","2843.036mil","22.875mil","2843.036mil","-7.439mil","2843.036mil","B","360.00","C-103"
"C4","0603_C","153.188mil","2912.036mil","153.189mil","2912.036mil","122.873mil","2912.036mil","B","360.00","C-104"

