"Designator","Footprint","Mid X","Mid Y","Ref X","Ref Y","Pad X","Pad Y","Layer","Rotation","Comment"
""
"R14","0603_R","1040.474mil","813.866mil","1040.474mil","813.866mil","1040.474mil","783.551mil","T","90.00","R-10K"
"S3-CLR","四脚按键_-_贴","1007.813mil","817.201mil","1007.475mil","827.367mil","911.356mil","890.036mil","B","270.00","按键4*4*7"
"接设置板2","header5-_tie-1.25mm","690.868mil","617.5mil","551.262mil","556.606mil","780.703mil","549.134mil","T","180.00","Z-1.25mm*5-贴"
"电源","header2_-_2mm","846.395mil","208.866mil","827.474mil","259.866mil","934.947mil","249.151mil","T","270.00","Z-2*2PIN"
"R3","0603_R","967.474mil","809.866mil","967.474mil","809.866mil","967.474mil","840.181mil","T","270.00","R-10K"
"S1-MODE","四脚按键_-_贴","370.813mil","817.201mil","370.474mil","827.366mil","274.356mil","890.035mil","B","270.00","按键4*4*7"

