%YAML 1.1
%TAG !u! tag:unity3d.com,2011:
--- !u!114 &11400000
MonoBehaviour:
  m_ObjectHideFlags: 0
  m_CorrespondingSourceObject: {fileID: 0}
  m_PrefabInstance: {fileID: 0}
  m_PrefabAsset: {fileID: 0}
  m_GameObject: {fileID: 0}
  m_Enabled: 1
  m_EditorHideFlags: 0
  m_Script: {fileID: 11500000, guid: 9d1514134bc4fbd41bb739b1b9a49231, type: 3}
  m_Name: Woodcutter
  m_EditorClassIdentifier: 
  m_DefaultSprite: {fileID: 21300228, guid: 60c21e840b4d35d409972a4f30ac6bc6, type: 3}
  m_DefaultGameObject: {fileID: 1252270306258677390, guid: b71f86a901f7cd14399b6ea78883d8f9,
    type: 3}
  m_DefaultColliderType: 1
  m_TilingRules: []
