%YAML 1.1
%TAG !u! tag:unity3d.com,2011:
--- !u!1045 &1
EditorBuildSettings:
  m_ObjectHideFlags: 0
  serializedVersion: 2
  m_Scenes:
  - enabled: 1
    path: Assets/Scenes/Menu.unity
    guid: c453499eb03d7bf4780bde26662952a6
  - enabled: 1
    path: Assets/Scenes/SpawnPoint.unity
    guid: 32ab695393fa6be44a8d4cee5de028e2
  - enabled: 1
    path: Assets/Scenes/Waiting.unity
    guid: 7abd7258df903f04e9b8617bac0059ac
  - enabled: 1
    path: Assets/Scenes/Game.unity
    guid: b61a3ffaa9ff7964e80fda91babce67d
  m_configObjects: {}
