%YAML 1.1
%TAG !u! tag:unity3d.com,2011:
--- !u!114 &11400000
MonoBehaviour:
  m_ObjectHideFlags: 0
  m_PrefabParentObject: {fileID: 0}
  m_PrefabInternal: {fileID: 0}
  m_GameObject: {fileID: 0}
  m_Enabled: 1
  m_EditorHideFlags: 0
  m_Script: {fileID: 11500000, guid: 402798794fb5ab44c9c317133714af07, type: 3}
  m_Name: Enemy05
  m_EditorClassIdentifier: 
  MovePattern:
  - {x: 1, y: 0}
  - {x: -1, y: 0}
  - {x: 0, y: 1}
  - {x: 0, y: -1}
  - {x: -2, y: 0}
  - {x: 2, y: 0}
