%YAML 1.1
%TAG !u! tag:unity3d.com,2011:
--- !u!114 &11400000
MonoBehaviour:
  m_ObjectHideFlags: 0
  m_CorrespondingSourceObject: {fileID: 0}
  m_PrefabInstance: {fileID: 0}
  m_PrefabAsset: {fileID: 0}
  m_GameObject: {fileID: 0}
  m_Enabled: 1
  m_EditorHideFlags: 0
  m_Script: {fileID: 11500000, guid: 0c626902a6cccee4abd714341964475f, type: 3}
  m_Name: Rock 1
  m_EditorClassIdentifier: 
  _Name: Rocky
  _Prefab: {fileID: 2126607627491342309, guid: c39e35ea005179441971c366d8b12daf, type: 3}
  _Type: 1
  _HookLevel: 0
