%YAML 1.1
%TAG !u! tag:unity3d.com,2011:
--- !u!114 &11400000
MonoBehaviour:
  m_ObjectHideFlags: 0
  m_CorrespondingSourceObject: {fileID: 0}
  m_PrefabInstance: {fileID: 0}
  m_PrefabAsset: {fileID: 0}
  m_GameObject: {fileID: 0}
  m_Enabled: 1
  m_EditorHideFlags: 0
  m_Script: {fileID: 11500000, guid: 555f36c5e2934ca2a70e7f2123cee91b, type: 3}
  m_Name: RetractHook
  m_EditorClassIdentifier: 
  updateType: 0
  retractSpeed: 3
  targetDistanceFromCharacter: 2
