%YAML 1.1
%TAG !u! tag:unity3d.com,2011:
--- !u!114 &11400000
MonoBehaviour:
  m_ObjectHideFlags: 0
  m_CorrespondingSourceObject: {fileID: 0}
  m_PrefabInstance: {fileID: 0}
  m_PrefabAsset: {fileID: 0}
  m_GameObject: {fileID: 0}
  m_Enabled: 1
  m_EditorHideFlags: 0
  m_Script: {fileID: 11500000, guid: 5b8bc337bb11f97408fad2e1c47cd678, type: 3}
  m_Name: 1_1_1 Factory
  m_EditorClassIdentifier: 
  inputCount: 1
  outputCount: 1
  factorySize: 1
  factoryPrefab: {fileID: 5451235764766416775, guid: 4b8ecdedc7b071d409a3fe807de33acd,
    type: 3}
