%YAML 1.1
%TAG !u! tag:unity3d.com,2011:
--- !u!74 &7400000
AnimationClip:
  m_ObjectHideFlags: 0
  m_CorrespondingSourceObject: {fileID: 0}
  m_PrefabInstance: {fileID: 0}
  m_PrefabAsset: {fileID: 0}
  m_Name: Run_1
  serializedVersion: 6
  m_Legacy: 0
  m_Compressed: 0
  m_UseHighQualityCurve: 1
  m_RotationCurves: []
  m_CompressedRotationCurves: []
  m_EulerCurves: []
  m_PositionCurves: []
  m_ScaleCurves: []
  m_FloatCurves: []
  m_PPtrCurves:
  - curve:
    - time: 0
      value: {fileID: 21300000, guid: 242b28424bb62f14cb19e4d5c9b68ae0, type: 3}
    - time: 0.11666667
      value: {fileID: 21300000, guid: 987772e613616a44daf857e1501b1ac7, type: 3}
    - time: 0.21666667
      value: {fileID: 21300000, guid: 4741a3aa0dab24d4ab3301654f0cfa42, type: 3}
    - time: 0.33333334
      value: {fileID: 21300000, guid: 1af1e54ac61fb2b4aaf6fd668d1c09e7, type: 3}
    - time: 0.45
      value: {fileID: 21300000, guid: f718e535094bca64aabf956179344796, type: 3}
    - time: 0.55
      value: {fileID: 21300000, guid: 90545308c659f2943b25b93454ee1f9c, type: 3}
    - time: 0.6666667
      value: {fileID: 21300000, guid: 42e36683c71f2f64e99ed578d34746a1, type: 3}
    - time: 0.78333336
      value: {fileID: 21300000, guid: 0fb06e6dd5859714da933fabb3de4f44, type: 3}
    - time: 0.8833333
      value: {fileID: 21300000, guid: c1f6dcf5ad1a1ec4a981ed985e1a2335, type: 3}
    - time: 1
      value: {fileID: 21300000, guid: 5188982c64b57354390d1fae8f638b6c, type: 3}
    attribute: m_Sprite
    path: 
    classID: 212
    script: {fileID: 0}
  m_SampleRate: 60
  m_WrapMode: 0
  m_Bounds:
    m_Center: {x: 0, y: 0, z: 0}
    m_Extent: {x: 0, y: 0, z: 0}
  m_ClipBindingConstant:
    genericBindings:
    - serializedVersion: 2
      path: 0
      attribute: 0
      script: {fileID: 0}
      typeID: 212
      customType: 23
      isPPtrCurve: 1
    pptrCurveMapping:
    - {fileID: 21300000, guid: 242b28424bb62f14cb19e4d5c9b68ae0, type: 3}
    - {fileID: 21300000, guid: 987772e613616a44daf857e1501b1ac7, type: 3}
    - {fileID: 21300000, guid: 4741a3aa0dab24d4ab3301654f0cfa42, type: 3}
    - {fileID: 21300000, guid: 1af1e54ac61fb2b4aaf6fd668d1c09e7, type: 3}
    - {fileID: 21300000, guid: f718e535094bca64aabf956179344796, type: 3}
    - {fileID: 21300000, guid: 90545308c659f2943b25b93454ee1f9c, type: 3}
    - {fileID: 21300000, guid: 42e36683c71f2f64e99ed578d34746a1, type: 3}
    - {fileID: 21300000, guid: 0fb06e6dd5859714da933fabb3de4f44, type: 3}
    - {fileID: 21300000, guid: c1f6dcf5ad1a1ec4a981ed985e1a2335, type: 3}
    - {fileID: 21300000, guid: 5188982c64b57354390d1fae8f638b6c, type: 3}
  m_AnimationClipSettings:
    serializedVersion: 2
    m_AdditiveReferencePoseClip: {fileID: 0}
    m_AdditiveReferencePoseTime: 0
    m_StartTime: 0
    m_StopTime: 1.0166667
    m_OrientationOffsetY: 0
    m_Level: 0
    m_CycleOffset: 0
    m_HasAdditiveReferencePose: 0
    m_LoopTime: 1
    m_LoopBlend: 0
    m_LoopBlendOrientation: 0
    m_LoopBlendPositionY: 0
    m_LoopBlendPositionXZ: 0
    m_KeepOriginalOrientation: 0
    m_KeepOriginalPositionY: 1
    m_KeepOriginalPositionXZ: 0
    m_HeightFromFeet: 0
    m_Mirror: 0
  m_EditorCurves: []
  m_EulerEditorCurves: []
  m_HasGenericRootTransform: 0
  m_HasMotionFloatCurves: 0
  m_Events: []
