%YAML 1.1
%TAG !u! tag:unity3d.com,2011:
--- !u!114 &11400000
MonoBehaviour:
  m_ObjectHideFlags: 0
  m_CorrespondingSourceObject: {fileID: 0}
  m_PrefabInstance: {fileID: 0}
  m_PrefabAsset: {fileID: 0}
  m_GameObject: {fileID: 0}
  m_Enabled: 1
  m_EditorHideFlags: 0
  m_Script: {fileID: 11500000, guid: 5b8bc337bb11f97408fad2e1c47cd678, type: 3}
  m_Name: 1_1_1 Harvester
  m_EditorClassIdentifier: 
  factoryType: 1
  inputCount: 1
  outputCount: 1
  factorySize: 1
  factoryPrefab: {fileID: 6014757056870613340, guid: b5e22a917b968ef4ea39a99b6e103d10,
    type: 3}
