%YAML 1.1
%TAG !u! tag:unity3d.com,2011:
--- !u!1001 &1791900106497367771
PrefabInstance:
  m_ObjectHideFlags: 0
  serializedVersion: 2
  m_Modification:
    m_TransformParent: {fileID: 0}
    m_Modifications:
    - target: {fileID: 5451235764766416774, guid: 4b8ecdedc7b071d409a3fe807de33acd,
        type: 3}
      propertyPath: m_LocalPosition.x
      value: 0
      objectReference: {fileID: 0}
    - target: {fileID: 5451235764766416774, guid: 4b8ecdedc7b071d409a3fe807de33acd,
        type: 3}
      propertyPath: m_LocalPosition.y
      value: 0
      objectReference: {fileID: 0}
    - target: {fileID: 5451235764766416774, guid: 4b8ecdedc7b071d409a3fe807de33acd,
        type: 3}
      propertyPath: m_LocalPosition.z
      value: 0
      objectReference: {fileID: 0}
    - target: {fileID: 5451235764766416774, guid: 4b8ecdedc7b071d409a3fe807de33acd,
        type: 3}
      propertyPath: m_LocalRotation.x
      value: -0
      objectReference: {fileID: 0}
    - target: {fileID: 5451235764766416774, guid: 4b8ecdedc7b071d409a3fe807de33acd,
        type: 3}
      propertyPath: m_LocalRotation.y
      value: -0
      objectReference: {fileID: 0}
    - target: {fileID: 5451235764766416774, guid: 4b8ecdedc7b071d409a3fe807de33acd,
        type: 3}
      propertyPath: m_LocalRotation.z
      value: -0
      objectReference: {fileID: 0}
    - target: {fileID: 5451235764766416774, guid: 4b8ecdedc7b071d409a3fe807de33acd,
        type: 3}
      propertyPath: m_LocalRotation.w
      value: 1
      objectReference: {fileID: 0}
    - target: {fileID: 5451235764766416774, guid: 4b8ecdedc7b071d409a3fe807de33acd,
        type: 3}
      propertyPath: m_RootOrder
      value: 0
      objectReference: {fileID: 0}
    - target: {fileID: 5451235764766416774, guid: 4b8ecdedc7b071d409a3fe807de33acd,
        type: 3}
      propertyPath: m_LocalEulerAnglesHint.x
      value: 0
      objectReference: {fileID: 0}
    - target: {fileID: 5451235764766416774, guid: 4b8ecdedc7b071d409a3fe807de33acd,
        type: 3}
      propertyPath: m_LocalEulerAnglesHint.y
      value: 0
      objectReference: {fileID: 0}
    - target: {fileID: 5451235764766416774, guid: 4b8ecdedc7b071d409a3fe807de33acd,
        type: 3}
      propertyPath: m_LocalEulerAnglesHint.z
      value: 0
      objectReference: {fileID: 0}
    - target: {fileID: 5451235764766416775, guid: 4b8ecdedc7b071d409a3fe807de33acd,
        type: 3}
      propertyPath: m_Name
      value: 1_1_1 Harvester
      objectReference: {fileID: 0}
    m_RemovedComponents:
    - {fileID: 4561727011931219618, guid: 4b8ecdedc7b071d409a3fe807de33acd, type: 3}
  m_SourcePrefab: {fileID: 100100000, guid: 4b8ecdedc7b071d409a3fe807de33acd, type: 3}
