%YAML 1.1
%TAG !u! tag:unity3d.com,2011:
--- !u!114 &11400000
MonoBehaviour:
  m_ObjectHideFlags: 0
  m_PrefabParentObject: {fileID: 0}
  m_PrefabInternal: {fileID: 0}
  m_GameObject: {fileID: 0}
  m_Enabled: 1
  m_EditorHideFlags: 0
  m_Script: {fileID: 11500000, guid: 0218812646e3c3a4cb6faec5db9199c4, type: 3}
  m_Name: Refuel
  m_EditorClassIdentifier: 
  _Name: Refuel
  _ServiceDuration: 7.5
  _ServiceReward: 35
  _TimeUntilFailed: 0
  _Icon: {fileID: 21300000, guid: 2321ffb9699c8894bb7df35a6eac8c59, type: 3}
