{
	"meta": {
		"version": "3.0.0",
		"report_json_url": "https://raw.githubusercontent.com/eosc-synergy/interLink.assess.sqaaas/main/.report/assessment_output.json"
	},
	"repository": [
		{
			"url": "https://github.com/interTwin-eu/interLink",
			"name": "interTwin-eu/interLink",
			"tag": "main",
			"commit_id": "b2fb1e56f009cf31ca7fd3dc49e16bf23bc0e743",
			"is_main_repo": true,
			"avatar_url": "https://avatars.githubusercontent.com/u/123980631?v=4",
			"description": null,
			"languages": null,
			"topics": null,
			"stargazers_count": null,
			"watchers_count": null,
			"contributors_count": null,
			"forks_count": null,
			"badge_status": "bronze"
		}
	],
	"report": {
		"QC.Acc": {
			"valid": true,
			"subcriteria": {
				"QC.Acc01": {
					"description": "Is the source code managed with a Version Control System?",
					"requirement_level": "MUST",
					"hint": "The source code shall be managed with Git and remain publicly available for this criterion to be successful. Please check <a href=\"https://git-scm.com/book/es/v2\" target=\"_blank\">Pro Git</a> docs about how to get started using Git tool. Guidelines provided by the most popular social coding platforms (<a href=\"https://docs.github.com/get-started\" target=\"_blank\">GitHub</a>, <a href=\"https://about.gitlab.com/get-started/\" target=\"_blank\">GitLab</a>) are also a good starting point",
					"evidence": [
						{
							"valid": true,
							"message": "Source code uses Git for version control",
							"plugin": {
								"name": "report2sqaaas-plugin-boolean",
								"version": "1.2.0"
							},
							"tool": {
								"name": "git",
								"lang": "scm",
								"version": "2.34.1",
								"docker": {
									"image": "bitnami/git:2.34.1",
									"reviewed": "2021-12-30"
								},
								"ci": {
									"name": "QC.Acc github.com/interTwin-eu/interLink git",
									"status": "SUCCESS",
									"stdout_command": [
										"git rev-parse --is-inside-work-tree"
									],
									"stdout_text": "true",
									"url": "https://jenkins.eosc-synergy.eu/job/eosc-synergy-org/job/interLink.assess.sqaaas/job/main/3/execution/node/34/log?consoleFull"
								},
								"level": "REQUIRED",
								"build_repo": "https://github.com/eosc-synergy/interLink.assess.sqaaas"
							},
							"standard": {
								"title": "A set of Common Software Quality Assurance Baseline Criteria for Research Projects",
								"version": "v4.0",
								"url": "https://github.com/indigo-dc/sqa-baseline/releases/tag/v4.0"
							},
							"data_unstructured": {}
						}
					],
					"valid": true
				}
			},
			"coverage": {
				"percentage": 100,
				"total_subcriteria": 1,
				"success_subcriteria": 1
			}
		},
		"QC.Doc": {
			"valid": true,
			"subcriteria": {
				"QC.Doc06.1": {
					"description": "Is the software scope outlined in the code repository?",
					"requirement_level": "MUST",
					"hint": "A README file presents your software to the audience interested in your software project. Several online sites simplify the task of creating the README file, such as <a href=\"https://www.makeareadme.com/\" target=\"_blank\">Make a README</a> or <a href=\"https://readme.so/\" target=\"_blank\">readme.so</a> sites. Be sure to add it to the code repository's root path",
					"evidence": [
						{
							"valid": true,
							"message": "A README file is present in the code repository",
							"plugin": {
								"name": "report2sqaaas-plugin-find_doc_files",
								"version": "1.2.0"
							},
							"tool": {
								"name": "find_doc_files.py",
								"lang": "Contribution-enabling Files",
								"version": "latest",
								"docker": {
									"dockerfile": "QC.Doc/Dockerfile",
									"reviewed": "2022-01-26"
								},
								"ci": {
									"name": "QC.Doc github.com/interTwin-eu/interLink find_doc_files.py",
									"status": "SUCCESS",
									"stdout_command": [
										"find_doc_files.py --file_type all"
									],
									"stdout_text": "{\"README\": [{\"file_name\": \"README.md\", \"size\": 1604}], \"CODE_OF_CONDUCT\": [{\"file_name\": \".github/CODE_OF_CONDUCT.md\", \"size\": 3969}], \"CONTRIBUTING\": [{\"file_name\": \"CONTRIBUTING.md\", \"size\": 3650}]}",
									"url": "https://jenkins.eosc-synergy.eu/job/eosc-synergy-org/job/interLink.assess.sqaaas/job/main/3/execution/node/43/log?consoleFull"
								},
								"level": "REQUIRED",
								"build_repo": "https://github.com/eosc-synergy/interLink.assess.sqaaas"
							},
							"standard": {
								"title": "A set of Common Software Quality Assurance Baseline Criteria for Research Projects",
								"version": "v4.0",
								"url": "https://github.com/indigo-dc/sqa-baseline/releases/tag/v4.0"
							},
							"data_unstructured": {
								"README": [
									{
										"file_name": "README.md",
										"size": 1604
									}
								],
								"CODE_OF_CONDUCT": [
									{
										"file_name": ".github/CODE_OF_CONDUCT.md",
										"size": 3969
									}
								],
								"CONTRIBUTING": [
									{
										"file_name": "CONTRIBUTING.md",
										"size": 3650
									}
								]
							}
						}
					],
					"valid": true
				},
				"QC.Doc06.3": {
					"description": "Does the project establish a code of conduct for its participants?",
					"requirement_level": "MUST",
					"hint": "A CODE_OF_CONDUCT file sets the path for a constructive, respectful and positive atmosphere among all the contributors in your software project. Of course you can define your own, but in case you want to rely on external and widely-adopted code of conducts check out some of the most popular ones: <a href=\"https://contributor-covenant.org/\" target=\"_blank\">Contributor Covenant</a> or <a href=\"https://web.archive.org/web/20200330154000/http://citizencodeofconduct.org/\" target=\"_blank\">Citizen Code of Conduct</a>",
					"evidence": [
						{
							"valid": true,
							"message": "A CODE_OF_CONDUCT file is present in the code repository",
							"plugin": {
								"name": "report2sqaaas-plugin-find_doc_files",
								"version": "1.2.0"
							},
							"tool": {
								"name": "find_doc_files.py",
								"lang": "Contribution-enabling Files",
								"version": "latest",
								"docker": {
									"dockerfile": "QC.Doc/Dockerfile",
									"reviewed": "2022-01-26"
								},
								"ci": {
									"name": "QC.Doc github.com/interTwin-eu/interLink find_doc_files.py",
									"status": "SUCCESS",
									"stdout_command": [
										"find_doc_files.py --file_type all"
									],
									"stdout_text": "{\"README\": [{\"file_name\": \"README.md\", \"size\": 1604}], \"CODE_OF_CONDUCT\": [{\"file_name\": \".github/CODE_OF_CONDUCT.md\", \"size\": 3969}], \"CONTRIBUTING\": [{\"file_name\": \"CONTRIBUTING.md\", \"size\": 3650}]}",
									"url": "https://jenkins.eosc-synergy.eu/job/eosc-synergy-org/job/interLink.assess.sqaaas/job/main/3/execution/node/43/log?consoleFull"
								},
								"level": "REQUIRED",
								"build_repo": "https://github.com/eosc-synergy/interLink.assess.sqaaas"
							},
							"standard": {
								"title": "A set of Common Software Quality Assurance Baseline Criteria for Research Projects",
								"version": "v4.0",
								"url": "https://github.com/indigo-dc/sqa-baseline/releases/tag/v4.0"
							},
							"data_unstructured": {
								"README": [
									{
										"file_name": "README.md",
										"size": 1604
									}
								],
								"CODE_OF_CONDUCT": [
									{
										"file_name": ".github/CODE_OF_CONDUCT.md",
										"size": 3969
									}
								],
								"CONTRIBUTING": [
									{
										"file_name": "CONTRIBUTING.md",
										"size": 3650
									}
								]
							}
						}
					],
					"valid": true
				},
				"QC.Doc06.2": {
					"description": "Is there a clear path or guidelines on how to contribute to the code?",
					"requirement_level": "MUST",
					"hint": "A CONTRIBUTING file shall be present in the root path of the code repository describing the expected workflow to follow when adding contributions. Please check <a href=\"https://mozillascience.github.io/working-open-workshop/contributing/\" target=\"_blank\">Mozilla's guidelines</a> and <a href=\"https://github.com/github/docs/blob/main/CONTRIBUTING.md\" target=\"_blank\">GitHub's CONTRIBUTING.md example</a> to get inspired on how to write a good CONTRIBUTING file",
					"evidence": [
						{
							"valid": true,
							"message": "A CONTRIBUTING file is present in the code repository",
							"plugin": {
								"name": "report2sqaaas-plugin-find_doc_files",
								"version": "1.2.0"
							},
							"tool": {
								"name": "find_doc_files.py",
								"lang": "Contribution-enabling Files",
								"version": "latest",
								"docker": {
									"dockerfile": "QC.Doc/Dockerfile",
									"reviewed": "2022-01-26"
								},
								"ci": {
									"name": "QC.Doc github.com/interTwin-eu/interLink find_doc_files.py",
									"status": "SUCCESS",
									"stdout_command": [
										"find_doc_files.py --file_type all"
									],
									"stdout_text": "{\"README\": [{\"file_name\": \"README.md\", \"size\": 1604}], \"CODE_OF_CONDUCT\": [{\"file_name\": \".github/CODE_OF_CONDUCT.md\", \"size\": 3969}], \"CONTRIBUTING\": [{\"file_name\": \"CONTRIBUTING.md\", \"size\": 3650}]}",
									"url": "https://jenkins.eosc-synergy.eu/job/eosc-synergy-org/job/interLink.assess.sqaaas/job/main/3/execution/node/43/log?consoleFull"
								},
								"level": "REQUIRED",
								"build_repo": "https://github.com/eosc-synergy/interLink.assess.sqaaas"
							},
							"standard": {
								"title": "A set of Common Software Quality Assurance Baseline Criteria for Research Projects",
								"version": "v4.0",
								"url": "https://github.com/indigo-dc/sqa-baseline/releases/tag/v4.0"
							},
							"data_unstructured": {
								"README": [
									{
										"file_name": "README.md",
										"size": 1604
									}
								],
								"CODE_OF_CONDUCT": [
									{
										"file_name": ".github/CODE_OF_CONDUCT.md",
										"size": 3969
									}
								],
								"CONTRIBUTING": [
									{
										"file_name": "CONTRIBUTING.md",
										"size": 3650
									}
								]
							}
						}
					],
					"valid": true
				},
				"QC.Doc01.1": {
					"description": "Are docs managed in the same repository as code?",
					"requirement_level": "MAY",
					"hint": "This subcriterion will succeed if the documentation files exist on the same repository as the source code, e.g. under a <code>docs/</code> folder",
					"evidence": [
						{
							"valid": true,
							"message": "Documentation resides in the same repository as code",
							"plugin": {
								"name": "report2sqaaas-plugin-boolean",
								"version": "1.2.0"
							},
							"tool": {
								"name": "git",
								"lang": null,
								"version": null,
								"docker": null,
								"ci": {
									"name": "QC.Doc github.com/interTwin-eu/interLink git",
									"status": "SUCCESS",
									"stdout_command": [
										"git rev-parse --is-inside-work-tree"
									],
									"stdout_text": "true",
									"url": "https://jenkins.eosc-synergy.eu/job/eosc-synergy-org/job/interLink.assess.sqaaas/job/main/3/execution/node/52/log?consoleFull"
								},
								"level": "REQUIRED",
								"build_repo": "https://github.com/eosc-synergy/interLink.assess.sqaaas"
							},
							"standard": {
								"title": "A set of Common Software Quality Assurance Baseline Criteria for Research Projects",
								"version": "v4.0",
								"url": "https://github.com/indigo-dc/sqa-baseline/releases/tag/v4.0"
							},
							"data_unstructured": {}
						}
					],
					"valid": true
				}
			},
			"coverage": {
				"percentage": 100,
				"total_subcriteria": 4,
				"success_subcriteria": 4
			}
		},
		"QC.Lic": {
			"valid": true,
			"subcriteria": {
				"QC.Lic01": {
					"description": "Is code licensed to be freely used, modified and distributed by others?",
					"requirement_level": "MUST",
					"hint": "<p>Your source code repository shall be distributed under an open source license for this subcriterion to pass successfully. Be sure to have a license file present in the code repository matching the name <code>LICENSE</code> with optional extensions (depending on the format used): <code>[.md|.rst|.txt]</code>.</p><p>Valid licenses are any of those approved either by the <a href=\"https://opensource.org/licenses\" target=\"_blank\">Open Source Initiative</a> and/or the Free Software Foundation <a href=\"https://www.gnu.org/licenses/license-list.html\" target=\"_blank\"></a>. You can also check the <a href=\"https://choosealicense.com/\" target=\"_blank\">choosealicense.com</a> site</p>",
					"evidence": [
						{
							"valid": true,
							"message": "An Open Source license found in the code repository: MIT",
							"plugin": {
								"name": "report2sqaaas-plugin-licensee",
								"version": "1.2.0"
							},
							"tool": {
								"name": "licensee",
								"lang": "license",
								"version": "9.15.1",
								"docker": {
									"dockerfile": "QC.Lic/licensee/Dockerfile",
									"reviewed": "2021-06-28"
								},
								"ci": {
									"name": "QC.Lic github.com/interTwin-eu/interLink licensee",
									"status": "SUCCESS",
									"stdout_command": [
										"licensee detect . --confidence 60 --json"
									],
									"stdout_text": "{\"licenses\":[{\"key\":\"mit\",\"spdx_id\":\"MIT\",\"meta\":{\"title\":\"MIT License\",\"source\":\"https://spdx.org/licenses/MIT.html\",\"description\":\"A short and simple permissive license with conditions only requiring preservation of copyright and license notices. Licensed works, modifications, and larger works may be distributed under different terms and without source code.\",\"how\":\"Create a text file (typically named LICENSE or LICENSE.txt) in the root of your source code and copy the text of the license into the file. Replace [year] with the current year and [fullname] with the name (or names) of the copyright holders.\",\"using\":{\"Babel\":\"https://github.com/babel/babel/blob/master/LICENSE\",\".NET\":\"https://github.com/dotnet/runtime/blob/main/LICENSE.TXT\",\"Rails\":\"https://github.com/rails/rails/blob/master/MIT-LICENSE\"},\"featured\":true,\"hidden\":false,\"nickname\":null,\"note\":null},\"url\":\"http://choosealicense.com/licenses/mit/\",\"rules\":{\"permissions\":[{\"tag\":\"commercial-use\",\"label\":\"Commercial use\",\"description\":\"The licensed material and derivatives may be used for commercial purposes.\"},{\"tag\":\"modifications\",\"label\":\"Modification\",\"description\":\"The licensed material may be modified.\"},{\"tag\":\"distribution\",\"label\":\"Distribution\",\"description\":\"The licensed material may be distributed.\"},{\"tag\":\"private-use\",\"label\":\"Private use\",\"description\":\"The licensed material may be used and modified in private.\"}],\"conditions\":[{\"tag\":\"include-copyright\",\"label\":\"License and copyright notice\",\"description\":\"A copy of the license and copyright notice must be included with the licensed material.\"}],\"limitations\":[{\"tag\":\"liability\",\"label\":\"Liability\",\"description\":\"This license includes a limitation of liability.\"},{\"tag\":\"warranty\",\"label\":\"Warranty\",\"description\":\"This license explicitly states that it does NOT provide any warranty.\"}]},\"fields\":[{\"name\":\"year\",\"description\":\"The current year\"},{\"name\":\"fullname\",\"description\":\"The full name or username of the repository owner\"}],\"other\":false,\"gpl\":false,\"lgpl\":false,\"cc\":false},{\"key\":\"other\",\"spdx_id\":\"NOASSERTION\",\"meta\":{\"title\":null,\"source\":null,\"description\":null,\"how\":null,\"using\":null,\"featured\":false,\"hidden\":true,\"nickname\":null,\"note\":null},\"url\":\"http://choosealicense.com/licenses/other/\",\"rules\":{\"permissions\":[],\"conditions\":[],\"limitations\":[]},\"fields\":[],\"other\":true,\"gpl\":false,\"lgpl\":false,\"cc\":false}],\"matched_files\":[{\"filename\":\"LICENSE\",\"content\":\"MIT License\\n\\nCopyright (c) 2023 interTwin Community\\n\\nPermission is hereby granted, free of charge, to any person obtaining a copy\\nof this software and associated documentation files (the \\\"Software\\\"), to deal\\nin the Software without restriction, including without limitation the rights\\nto use, copy, modify, merge, publish, distribute, sublicense, and/or sell\\ncopies of the Software, and to permit persons to whom the Software is\\nfurnished to do so, subject to the following conditions:\\n\\nThe above copyright notice and this permission notice shall be included in all\\ncopies or substantial portions of the Software.\\n\\nTHE SOFTWARE IS PROVIDED \\\"AS IS\\\", WITHOUT WARRANTY OF ANY KIND, EXPRESS OR\\nIMPLIED, INCLUDING BUT NOT LIMITED TO THE WARRANTIES OF MERCHANTABILITY,\\nFITNESS FOR A PARTICULAR PURPOSE AND NONINFRINGEMENT. IN NO EVENT SHALL THE\\nAUTHORS OR COPYRIGHT HOLDERS BE LIABLE FOR ANY CLAIM, DAMAGES OR OTHER\\nLIABILITY, WHETHER IN AN ACTION OF CONTRACT, TORT OR OTHERWISE, ARISING FROM,\\nOUT OF OR IN CONNECTION WITH THE SOFTWARE OR THE USE OR OTHER DEALINGS IN THE\\nSOFTWARE.\\n\",\"content_hash\":\"4c2c763d64bbc7ef2e58b0ec6d06d90cee9755c9\",\"content_normalized\":\"permission is hereby granted, free of charge, to any person obtaining a copy of this software and associated documentation files (the 'software'), to deal in the software without restriction, including without limitation the rights to use, copy, modify, merge, publish, distribute, sublicense, and/or sell copies of the software, and to permit persons to whom the software is furnished to do so, subject to the following conditions: the above copyright notice and this permission notice shall be included in all copies or substantial portions of the software. the software is provided 'as is', without warranty of any kind, express or implied, including but not limited to the warranties of merchantability, fitness for a particular purpose and noninfringement. in no event shall the authors or copyright holders be liable for any claim, damages or other liability, whether in an action of contract, tort or otherwise, arising from, out of or in connection with the software or the use or other dealings in the software.\",\"matcher\":{\"name\":\"exact\",\"confidence\":100},\"matched_license\":\"MIT\",\"attribution\":\"Copyright (c) 2023 interTwin Community\"},{\"filename\":\"COPYRIGHT\",\"content\":\"This project is licensed under MIT.\\n\\nCopyrights in this project are retained by their contributors.\\nNo copyright assignment is required to contribute to this project.\\n\",\"content_hash\":\"fc7c92616e4353936eb44819f8733479636cdd22\",\"content_normalized\":\"this project is licensed under mit. copyrights in this project are retained by their contributors. no copyright assignment is required to contribute to this project.\",\"matcher\":null,\"matched_license\":\"NOASSERTION\",\"attribution\":null}]}",
									"url": "https://jenkins.eosc-synergy.eu/job/eosc-synergy-org/job/interLink.assess.sqaaas/job/main/3/execution/node/61/log?consoleFull"
								},
								"level": "REQUIRED",
								"build_repo": "https://github.com/eosc-synergy/interLink.assess.sqaaas"
							},
							"standard": {
								"title": "A set of Common Software Quality Assurance Baseline Criteria for Research Projects",
								"version": "v4.0",
								"url": "https://github.com/indigo-dc/sqa-baseline/releases/tag/v4.0"
							},
							"data_unstructured": {
								"licenses": [
									{
										"key": "mit",
										"spdx_id": "MIT",
										"meta": {
											"title": "MIT License",
											"source": "https://spdx.org/licenses/MIT.html",
											"description": "A short and simple permissive license with conditions only requiring preservation of copyright and license notices. Licensed works, modifications, and larger works may be distributed under different terms and without source code.",
											"how": "Create a text file (typically named LICENSE or LICENSE.txt) in the root of your source code and copy the text of the license into the file. Replace [year] with the current year and [fullname] with the name (or names) of the copyright holders.",
											"using": {
												"Babel": "https://github.com/babel/babel/blob/master/LICENSE",
												".NET": "https://github.com/dotnet/runtime/blob/main/LICENSE.TXT",
												"Rails": "https://github.com/rails/rails/blob/master/MIT-LICENSE"
											},
											"featured": true,
											"hidden": false,
											"nickname": null,
											"note": null
										},
										"url": "http://choosealicense.com/licenses/mit/",
										"rules": {
											"permissions": [
												{
													"tag": "commercial-use",
													"label": "Commercial use",
													"description": "The licensed material and derivatives may be used for commercial purposes."
												},
												{
													"tag": "modifications",
													"label": "Modification",
													"description": "The licensed material may be modified."
												},
												{
													"tag": "distribution",
													"label": "Distribution",
													"description": "The licensed material may be distributed."
												},
												{
													"tag": "private-use",
													"label": "Private use",
													"description": "The licensed material may be used and modified in private."
												}
											],
											"conditions": [
												{
													"tag": "include-copyright",
													"label": "License and copyright notice",
													"description": "A copy of the license and copyright notice must be included with the licensed material."
												}
											],
											"limitations": [
												{
													"tag": "liability",
													"label": "Liability",
													"description": "This license includes a limitation of liability."
												},
												{
													"tag": "warranty",
													"label": "Warranty",
													"description": "This license explicitly states that it does NOT provide any warranty."
												}
											]
										},
										"fields": [
											{
												"name": "year",
												"description": "The current year"
											},
											{
												"name": "fullname",
												"description": "The full name or username of the repository owner"
											}
										],
										"other": false,
										"gpl": false,
										"lgpl": false,
										"cc": false
									},
									{
										"key": "other",
										"spdx_id": "NOASSERTION",
										"meta": {
											"title": null,
											"source": null,
											"description": null,
											"how": null,
											"using": null,
											"featured": false,
											"hidden": true,
											"nickname": null,
											"note": null
										},
										"url": "http://choosealicense.com/licenses/other/",
										"rules": {
											"permissions": [],
											"conditions": [],
											"limitations": []
										},
										"fields": [],
										"other": true,
										"gpl": false,
										"lgpl": false,
										"cc": false
									}
								],
								"matched_files": [
									{
										"filename": "LICENSE",
										"content": "MIT License\n\nCopyright (c) 2023 interTwin Community\n\nPermission is hereby granted, free of charge, to any person obtaining a copy\nof this software and associated documentation files (the \"Software\"), to deal\nin the Software without restriction, including without limitation the rights\nto use, copy, modify, merge, publish, distribute, sublicense, and/or sell\ncopies of the Software, and to permit persons to whom the Software is\nfurnished to do so, subject to the following conditions:\n\nThe above copyright notice and this permission notice shall be included in all\ncopies or substantial portions of the Software.\n\nTHE SOFTWARE IS PROVIDED \"AS IS\", WITHOUT WARRANTY OF ANY KIND, EXPRESS OR\nIMPLIED, INCLUDING BUT NOT LIMITED TO THE WARRANTIES OF MERCHANTABILITY,\nFITNESS FOR A PARTICULAR PURPOSE AND NONINFRINGEMENT. IN NO EVENT SHALL THE\nAUTHORS OR COPYRIGHT HOLDERS BE LIABLE FOR ANY CLAIM, DAMAGES OR OTHER\nLIABILITY, WHETHER IN AN ACTION OF CONTRACT, TORT OR OTHERWISE, ARISING FROM,\nOUT OF OR IN CONNECTION WITH THE SOFTWARE OR THE USE OR OTHER DEALINGS IN THE\nSOFTWARE.\n",
										"content_hash": "4c2c763d64bbc7ef2e58b0ec6d06d90cee9755c9",
										"content_normalized": "permission is hereby granted, free of charge, to any person obtaining a copy of this software and associated documentation files (the 'software'), to deal in the software without restriction, including without limitation the rights to use, copy, modify, merge, publish, distribute, sublicense, and/or sell copies of the software, and to permit persons to whom the software is furnished to do so, subject to the following conditions: the above copyright notice and this permission notice shall be included in all copies or substantial portions of the software. the software is provided 'as is', without warranty of any kind, express or implied, including but not limited to the warranties of merchantability, fitness for a particular purpose and noninfringement. in no event shall the authors or copyright holders be liable for any claim, damages or other liability, whether in an action of contract, tort or otherwise, arising from, out of or in connection with the software or the use or other dealings in the software.",
										"matcher": {
											"name": "exact",
											"confidence": 100
										},
										"matched_license": "MIT",
										"attribution": "Copyright (c) 2023 interTwin Community"
									},
									{
										"filename": "COPYRIGHT",
										"content": "This project is licensed under MIT.\n\nCopyrights in this project are retained by their contributors.\nNo copyright assignment is required to contribute to this project.\n",
										"content_hash": "fc7c92616e4353936eb44819f8733479636cdd22",
										"content_normalized": "this project is licensed under mit. copyrights in this project are retained by their contributors. no copyright assignment is required to contribute to this project.",
										"matcher": null,
										"matched_license": "NOASSERTION",
										"attribution": null
									}
								]
							}
						}
					],
					"valid": true
				},
				"QC.Lic01.1": {
					"description": "Is LICENSE file placed in the root path of the code repository?",
					"requirement_level": "MUST",
					"hint": "Most social coding platforms require the license file to placed in the root path of the code repository, so it is a good practice to use this location by default. Allowed file names are <code>LICENSE</code>, <code>LICENSE.md</code>, <code>LICENSE.rst</code>, <code>LICENSE.txt</code>",
					"evidence": [
						{
							"valid": true,
							"message": "LICENSE file is visible at the root path of the code repository: LICENSE",
							"plugin": {
								"name": "report2sqaaas-plugin-licensee",
								"version": "1.2.0"
							},
							"tool": {
								"name": "licensee",
								"lang": "license",
								"version": "9.15.1",
								"docker": {
									"dockerfile": "QC.Lic/licensee/Dockerfile",
									"reviewed": "2021-06-28"
								},
								"ci": {
									"name": "QC.Lic github.com/interTwin-eu/interLink licensee",
									"status": "SUCCESS",
									"stdout_command": [
										"licensee detect . --confidence 60 --json"
									],
									"stdout_text": "{\"licenses\":[{\"key\":\"mit\",\"spdx_id\":\"MIT\",\"meta\":{\"title\":\"MIT License\",\"source\":\"https://spdx.org/licenses/MIT.html\",\"description\":\"A short and simple permissive license with conditions only requiring preservation of copyright and license notices. Licensed works, modifications, and larger works may be distributed under different terms and without source code.\",\"how\":\"Create a text file (typically named LICENSE or LICENSE.txt) in the root of your source code and copy the text of the license into the file. Replace [year] with the current year and [fullname] with the name (or names) of the copyright holders.\",\"using\":{\"Babel\":\"https://github.com/babel/babel/blob/master/LICENSE\",\".NET\":\"https://github.com/dotnet/runtime/blob/main/LICENSE.TXT\",\"Rails\":\"https://github.com/rails/rails/blob/master/MIT-LICENSE\"},\"featured\":true,\"hidden\":false,\"nickname\":null,\"note\":null},\"url\":\"http://choosealicense.com/licenses/mit/\",\"rules\":{\"permissions\":[{\"tag\":\"commercial-use\",\"label\":\"Commercial use\",\"description\":\"The licensed material and derivatives may be used for commercial purposes.\"},{\"tag\":\"modifications\",\"label\":\"Modification\",\"description\":\"The licensed material may be modified.\"},{\"tag\":\"distribution\",\"label\":\"Distribution\",\"description\":\"The licensed material may be distributed.\"},{\"tag\":\"private-use\",\"label\":\"Private use\",\"description\":\"The licensed material may be used and modified in private.\"}],\"conditions\":[{\"tag\":\"include-copyright\",\"label\":\"License and copyright notice\",\"description\":\"A copy of the license and copyright notice must be included with the licensed material.\"}],\"limitations\":[{\"tag\":\"liability\",\"label\":\"Liability\",\"description\":\"This license includes a limitation of liability.\"},{\"tag\":\"warranty\",\"label\":\"Warranty\",\"description\":\"This license explicitly states that it does NOT provide any warranty.\"}]},\"fields\":[{\"name\":\"year\",\"description\":\"The current year\"},{\"name\":\"fullname\",\"description\":\"The full name or username of the repository owner\"}],\"other\":false,\"gpl\":false,\"lgpl\":false,\"cc\":false},{\"key\":\"other\",\"spdx_id\":\"NOASSERTION\",\"meta\":{\"title\":null,\"source\":null,\"description\":null,\"how\":null,\"using\":null,\"featured\":false,\"hidden\":true,\"nickname\":null,\"note\":null},\"url\":\"http://choosealicense.com/licenses/other/\",\"rules\":{\"permissions\":[],\"conditions\":[],\"limitations\":[]},\"fields\":[],\"other\":true,\"gpl\":false,\"lgpl\":false,\"cc\":false}],\"matched_files\":[{\"filename\":\"LICENSE\",\"content\":\"MIT License\\n\\nCopyright (c) 2023 interTwin Community\\n\\nPermission is hereby granted, free of charge, to any person obtaining a copy\\nof this software and associated documentation files (the \\\"Software\\\"), to deal\\nin the Software without restriction, including without limitation the rights\\nto use, copy, modify, merge, publish, distribute, sublicense, and/or sell\\ncopies of the Software, and to permit persons to whom the Software is\\nfurnished to do so, subject to the following conditions:\\n\\nThe above copyright notice and this permission notice shall be included in all\\ncopies or substantial portions of the Software.\\n\\nTHE SOFTWARE IS PROVIDED \\\"AS IS\\\", WITHOUT WARRANTY OF ANY KIND, EXPRESS OR\\nIMPLIED, INCLUDING BUT NOT LIMITED TO THE WARRANTIES OF MERCHANTABILITY,\\nFITNESS FOR A PARTICULAR PURPOSE AND NONINFRINGEMENT. IN NO EVENT SHALL THE\\nAUTHORS OR COPYRIGHT HOLDERS BE LIABLE FOR ANY CLAIM, DAMAGES OR OTHER\\nLIABILITY, WHETHER IN AN ACTION OF CONTRACT, TORT OR OTHERWISE, ARISING FROM,\\nOUT OF OR IN CONNECTION WITH THE SOFTWARE OR THE USE OR OTHER DEALINGS IN THE\\nSOFTWARE.\\n\",\"content_hash\":\"4c2c763d64bbc7ef2e58b0ec6d06d90cee9755c9\",\"content_normalized\":\"permission is hereby granted, free of charge, to any person obtaining a copy of this software and associated documentation files (the 'software'), to deal in the software without restriction, including without limitation the rights to use, copy, modify, merge, publish, distribute, sublicense, and/or sell copies of the software, and to permit persons to whom the software is furnished to do so, subject to the following conditions: the above copyright notice and this permission notice shall be included in all copies or substantial portions of the software. the software is provided 'as is', without warranty of any kind, express or implied, including but not limited to the warranties of merchantability, fitness for a particular purpose and noninfringement. in no event shall the authors or copyright holders be liable for any claim, damages or other liability, whether in an action of contract, tort or otherwise, arising from, out of or in connection with the software or the use or other dealings in the software.\",\"matcher\":{\"name\":\"exact\",\"confidence\":100},\"matched_license\":\"MIT\",\"attribution\":\"Copyright (c) 2023 interTwin Community\"},{\"filename\":\"COPYRIGHT\",\"content\":\"This project is licensed under MIT.\\n\\nCopyrights in this project are retained by their contributors.\\nNo copyright assignment is required to contribute to this project.\\n\",\"content_hash\":\"fc7c92616e4353936eb44819f8733479636cdd22\",\"content_normalized\":\"this project is licensed under mit. copyrights in this project are retained by their contributors. no copyright assignment is required to contribute to this project.\",\"matcher\":null,\"matched_license\":\"NOASSERTION\",\"attribution\":null}]}",
									"url": "https://jenkins.eosc-synergy.eu/job/eosc-synergy-org/job/interLink.assess.sqaaas/job/main/3/execution/node/61/log?consoleFull"
								},
								"level": "REQUIRED",
								"build_repo": "https://github.com/eosc-synergy/interLink.assess.sqaaas"
							},
							"standard": {
								"title": "A set of Common Software Quality Assurance Baseline Criteria for Research Projects",
								"version": "v4.0",
								"url": "https://github.com/indigo-dc/sqa-baseline/releases/tag/v4.0"
							},
							"data_unstructured": {
								"licenses": [
									{
										"key": "mit",
										"spdx_id": "MIT",
										"meta": {
											"title": "MIT License",
											"source": "https://spdx.org/licenses/MIT.html",
											"description": "A short and simple permissive license with conditions only requiring preservation of copyright and license notices. Licensed works, modifications, and larger works may be distributed under different terms and without source code.",
											"how": "Create a text file (typically named LICENSE or LICENSE.txt) in the root of your source code and copy the text of the license into the file. Replace [year] with the current year and [fullname] with the name (or names) of the copyright holders.",
											"using": {
												"Babel": "https://github.com/babel/babel/blob/master/LICENSE",
												".NET": "https://github.com/dotnet/runtime/blob/main/LICENSE.TXT",
												"Rails": "https://github.com/rails/rails/blob/master/MIT-LICENSE"
											},
											"featured": true,
											"hidden": false,
											"nickname": null,
											"note": null
										},
										"url": "http://choosealicense.com/licenses/mit/",
										"rules": {
											"permissions": [
												{
													"tag": "commercial-use",
													"label": "Commercial use",
													"description": "The licensed material and derivatives may be used for commercial purposes."
												},
												{
													"tag": "modifications",
													"label": "Modification",
													"description": "The licensed material may be modified."
												},
												{
													"tag": "distribution",
													"label": "Distribution",
													"description": "The licensed material may be distributed."
												},
												{
													"tag": "private-use",
													"label": "Private use",
													"description": "The licensed material may be used and modified in private."
												}
											],
											"conditions": [
												{
													"tag": "include-copyright",
													"label": "License and copyright notice",
													"description": "A copy of the license and copyright notice must be included with the licensed material."
												}
											],
											"limitations": [
												{
													"tag": "liability",
													"label": "Liability",
													"description": "This license includes a limitation of liability."
												},
												{
													"tag": "warranty",
													"label": "Warranty",
													"description": "This license explicitly states that it does NOT provide any warranty."
												}
											]
										},
										"fields": [
											{
												"name": "year",
												"description": "The current year"
											},
											{
												"name": "fullname",
												"description": "The full name or username of the repository owner"
											}
										],
										"other": false,
										"gpl": false,
										"lgpl": false,
										"cc": false
									},
									{
										"key": "other",
										"spdx_id": "NOASSERTION",
										"meta": {
											"title": null,
											"source": null,
											"description": null,
											"how": null,
											"using": null,
											"featured": false,
											"hidden": true,
											"nickname": null,
											"note": null
										},
										"url": "http://choosealicense.com/licenses/other/",
										"rules": {
											"permissions": [],
											"conditions": [],
											"limitations": []
										},
										"fields": [],
										"other": true,
										"gpl": false,
										"lgpl": false,
										"cc": false
									}
								],
								"matched_files": [
									{
										"filename": "LICENSE",
										"content": "MIT License\n\nCopyright (c) 2023 interTwin Community\n\nPermission is hereby granted, free of charge, to any person obtaining a copy\nof this software and associated documentation files (the \"Software\"), to deal\nin the Software without restriction, including without limitation the rights\nto use, copy, modify, merge, publish, distribute, sublicense, and/or sell\ncopies of the Software, and to permit persons to whom the Software is\nfurnished to do so, subject to the following conditions:\n\nThe above copyright notice and this permission notice shall be included in all\ncopies or substantial portions of the Software.\n\nTHE SOFTWARE IS PROVIDED \"AS IS\", WITHOUT WARRANTY OF ANY KIND, EXPRESS OR\nIMPLIED, INCLUDING BUT NOT LIMITED TO THE WARRANTIES OF MERCHANTABILITY,\nFITNESS FOR A PARTICULAR PURPOSE AND NONINFRINGEMENT. IN NO EVENT SHALL THE\nAUTHORS OR COPYRIGHT HOLDERS BE LIABLE FOR ANY CLAIM, DAMAGES OR OTHER\nLIABILITY, WHETHER IN AN ACTION OF CONTRACT, TORT OR OTHERWISE, ARISING FROM,\nOUT OF OR IN CONNECTION WITH THE SOFTWARE OR THE USE OR OTHER DEALINGS IN THE\nSOFTWARE.\n",
										"content_hash": "4c2c763d64bbc7ef2e58b0ec6d06d90cee9755c9",
										"content_normalized": "permission is hereby granted, free of charge, to any person obtaining a copy of this software and associated documentation files (the 'software'), to deal in the software without restriction, including without limitation the rights to use, copy, modify, merge, publish, distribute, sublicense, and/or sell copies of the software, and to permit persons to whom the software is furnished to do so, subject to the following conditions: the above copyright notice and this permission notice shall be included in all copies or substantial portions of the software. the software is provided 'as is', without warranty of any kind, express or implied, including but not limited to the warranties of merchantability, fitness for a particular purpose and noninfringement. in no event shall the authors or copyright holders be liable for any claim, damages or other liability, whether in an action of contract, tort or otherwise, arising from, out of or in connection with the software or the use or other dealings in the software.",
										"matcher": {
											"name": "exact",
											"confidence": 100
										},
										"matched_license": "MIT",
										"attribution": "Copyright (c) 2023 interTwin Community"
									},
									{
										"filename": "COPYRIGHT",
										"content": "This project is licensed under MIT.\n\nCopyrights in this project are retained by their contributors.\nNo copyright assignment is required to contribute to this project.\n",
										"content_hash": "fc7c92616e4353936eb44819f8733479636cdd22",
										"content_normalized": "this project is licensed under mit. copyrights in this project are retained by their contributors. no copyright assignment is required to contribute to this project.",
										"matcher": null,
										"matched_license": "NOASSERTION",
										"attribution": null
									}
								]
							}
						}
					],
					"valid": true
				},
				"QC.Lic02": {
					"description": "Does the code use a license approved by Open Source Initiative?",
					"requirement_level": "MUST",
					"hint": "The <a href=\"https://opensource.org/\" target=\"_blank\">Open Source Initiative (OSI)</a> sets out the requirements for software to be legally declared as Open Source. The license in use shall be in the list of <a href=\"https://opensource.org/license-list.html\" target=\"_blank\">OSI-approved licenses</a> for this criterion to be successful",
					"evidence": [
						{
							"valid": true,
							"message": "License MIT is approved by the Open Source Initiative",
							"plugin": {
								"name": "report2sqaaas-plugin-licensee",
								"version": "1.2.0"
							},
							"tool": {
								"name": "licensee",
								"lang": "license",
								"version": "9.15.1",
								"docker": {
									"dockerfile": "QC.Lic/licensee/Dockerfile",
									"reviewed": "2021-06-28"
								},
								"ci": {
									"name": "QC.Lic github.com/interTwin-eu/interLink licensee",
									"status": "SUCCESS",
									"stdout_command": [
										"licensee detect . --confidence 60 --json"
									],
									"stdout_text": "{\"licenses\":[{\"key\":\"mit\",\"spdx_id\":\"MIT\",\"meta\":{\"title\":\"MIT License\",\"source\":\"https://spdx.org/licenses/MIT.html\",\"description\":\"A short and simple permissive license with conditions only requiring preservation of copyright and license notices. Licensed works, modifications, and larger works may be distributed under different terms and without source code.\",\"how\":\"Create a text file (typically named LICENSE or LICENSE.txt) in the root of your source code and copy the text of the license into the file. Replace [year] with the current year and [fullname] with the name (or names) of the copyright holders.\",\"using\":{\"Babel\":\"https://github.com/babel/babel/blob/master/LICENSE\",\".NET\":\"https://github.com/dotnet/runtime/blob/main/LICENSE.TXT\",\"Rails\":\"https://github.com/rails/rails/blob/master/MIT-LICENSE\"},\"featured\":true,\"hidden\":false,\"nickname\":null,\"note\":null},\"url\":\"http://choosealicense.com/licenses/mit/\",\"rules\":{\"permissions\":[{\"tag\":\"commercial-use\",\"label\":\"Commercial use\",\"description\":\"The licensed material and derivatives may be used for commercial purposes.\"},{\"tag\":\"modifications\",\"label\":\"Modification\",\"description\":\"The licensed material may be modified.\"},{\"tag\":\"distribution\",\"label\":\"Distribution\",\"description\":\"The licensed material may be distributed.\"},{\"tag\":\"private-use\",\"label\":\"Private use\",\"description\":\"The licensed material may be used and modified in private.\"}],\"conditions\":[{\"tag\":\"include-copyright\",\"label\":\"License and copyright notice\",\"description\":\"A copy of the license and copyright notice must be included with the licensed material.\"}],\"limitations\":[{\"tag\":\"liability\",\"label\":\"Liability\",\"description\":\"This license includes a limitation of liability.\"},{\"tag\":\"warranty\",\"label\":\"Warranty\",\"description\":\"This license explicitly states that it does NOT provide any warranty.\"}]},\"fields\":[{\"name\":\"year\",\"description\":\"The current year\"},{\"name\":\"fullname\",\"description\":\"The full name or username of the repository owner\"}],\"other\":false,\"gpl\":false,\"lgpl\":false,\"cc\":false},{\"key\":\"other\",\"spdx_id\":\"NOASSERTION\",\"meta\":{\"title\":null,\"source\":null,\"description\":null,\"how\":null,\"using\":null,\"featured\":false,\"hidden\":true,\"nickname\":null,\"note\":null},\"url\":\"http://choosealicense.com/licenses/other/\",\"rules\":{\"permissions\":[],\"conditions\":[],\"limitations\":[]},\"fields\":[],\"other\":true,\"gpl\":false,\"lgpl\":false,\"cc\":false}],\"matched_files\":[{\"filename\":\"LICENSE\",\"content\":\"MIT License\\n\\nCopyright (c) 2023 interTwin Community\\n\\nPermission is hereby granted, free of charge, to any person obtaining a copy\\nof this software and associated documentation files (the \\\"Software\\\"), to deal\\nin the Software without restriction, including without limitation the rights\\nto use, copy, modify, merge, publish, distribute, sublicense, and/or sell\\ncopies of the Software, and to permit persons to whom the Software is\\nfurnished to do so, subject to the following conditions:\\n\\nThe above copyright notice and this permission notice shall be included in all\\ncopies or substantial portions of the Software.\\n\\nTHE SOFTWARE IS PROVIDED \\\"AS IS\\\", WITHOUT WARRANTY OF ANY KIND, EXPRESS OR\\nIMPLIED, INCLUDING BUT NOT LIMITED TO THE WARRANTIES OF MERCHANTABILITY,\\nFITNESS FOR A PARTICULAR PURPOSE AND NONINFRINGEMENT. IN NO EVENT SHALL THE\\nAUTHORS OR COPYRIGHT HOLDERS BE LIABLE FOR ANY CLAIM, DAMAGES OR OTHER\\nLIABILITY, WHETHER IN AN ACTION OF CONTRACT, TORT OR OTHERWISE, ARISING FROM,\\nOUT OF OR IN CONNECTION WITH THE SOFTWARE OR THE USE OR OTHER DEALINGS IN THE\\nSOFTWARE.\\n\",\"content_hash\":\"4c2c763d64bbc7ef2e58b0ec6d06d90cee9755c9\",\"content_normalized\":\"permission is hereby granted, free of charge, to any person obtaining a copy of this software and associated documentation files (the 'software'), to deal in the software without restriction, including without limitation the rights to use, copy, modify, merge, publish, distribute, sublicense, and/or sell copies of the software, and to permit persons to whom the software is furnished to do so, subject to the following conditions: the above copyright notice and this permission notice shall be included in all copies or substantial portions of the software. the software is provided 'as is', without warranty of any kind, express or implied, including but not limited to the warranties of merchantability, fitness for a particular purpose and noninfringement. in no event shall the authors or copyright holders be liable for any claim, damages or other liability, whether in an action of contract, tort or otherwise, arising from, out of or in connection with the software or the use or other dealings in the software.\",\"matcher\":{\"name\":\"exact\",\"confidence\":100},\"matched_license\":\"MIT\",\"attribution\":\"Copyright (c) 2023 interTwin Community\"},{\"filename\":\"COPYRIGHT\",\"content\":\"This project is licensed under MIT.\\n\\nCopyrights in this project are retained by their contributors.\\nNo copyright assignment is required to contribute to this project.\\n\",\"content_hash\":\"fc7c92616e4353936eb44819f8733479636cdd22\",\"content_normalized\":\"this project is licensed under mit. copyrights in this project are retained by their contributors. no copyright assignment is required to contribute to this project.\",\"matcher\":null,\"matched_license\":\"NOASSERTION\",\"attribution\":null}]}",
									"url": "https://jenkins.eosc-synergy.eu/job/eosc-synergy-org/job/interLink.assess.sqaaas/job/main/3/execution/node/61/log?consoleFull"
								},
								"level": "REQUIRED",
								"build_repo": "https://github.com/eosc-synergy/interLink.assess.sqaaas"
							},
							"standard": {
								"title": "A set of Common Software Quality Assurance Baseline Criteria for Research Projects",
								"version": "v4.0",
								"url": "https://github.com/indigo-dc/sqa-baseline/releases/tag/v4.0"
							},
							"data_unstructured": {
								"licenses": [
									{
										"key": "mit",
										"spdx_id": "MIT",
										"meta": {
											"title": "MIT License",
											"source": "https://spdx.org/licenses/MIT.html",
											"description": "A short and simple permissive license with conditions only requiring preservation of copyright and license notices. Licensed works, modifications, and larger works may be distributed under different terms and without source code.",
											"how": "Create a text file (typically named LICENSE or LICENSE.txt) in the root of your source code and copy the text of the license into the file. Replace [year] with the current year and [fullname] with the name (or names) of the copyright holders.",
											"using": {
												"Babel": "https://github.com/babel/babel/blob/master/LICENSE",
												".NET": "https://github.com/dotnet/runtime/blob/main/LICENSE.TXT",
												"Rails": "https://github.com/rails/rails/blob/master/MIT-LICENSE"
											},
											"featured": true,
											"hidden": false,
											"nickname": null,
											"note": null
										},
										"url": "http://choosealicense.com/licenses/mit/",
										"rules": {
											"permissions": [
												{
													"tag": "commercial-use",
													"label": "Commercial use",
													"description": "The licensed material and derivatives may be used for commercial purposes."
												},
												{
													"tag": "modifications",
													"label": "Modification",
													"description": "The licensed material may be modified."
												},
												{
													"tag": "distribution",
													"label": "Distribution",
													"description": "The licensed material may be distributed."
												},
												{
													"tag": "private-use",
													"label": "Private use",
													"description": "The licensed material may be used and modified in private."
												}
											],
											"conditions": [
												{
													"tag": "include-copyright",
													"label": "License and copyright notice",
													"description": "A copy of the license and copyright notice must be included with the licensed material."
												}
											],
											"limitations": [
												{
													"tag": "liability",
													"label": "Liability",
													"description": "This license includes a limitation of liability."
												},
												{
													"tag": "warranty",
													"label": "Warranty",
													"description": "This license explicitly states that it does NOT provide any warranty."
												}
											]
										},
										"fields": [
											{
												"name": "year",
												"description": "The current year"
											},
											{
												"name": "fullname",
												"description": "The full name or username of the repository owner"
											}
										],
										"other": false,
										"gpl": false,
										"lgpl": false,
										"cc": false
									},
									{
										"key": "other",
										"spdx_id": "NOASSERTION",
										"meta": {
											"title": null,
											"source": null,
											"description": null,
											"how": null,
											"using": null,
											"featured": false,
											"hidden": true,
											"nickname": null,
											"note": null
										},
										"url": "http://choosealicense.com/licenses/other/",
										"rules": {
											"permissions": [],
											"conditions": [],
											"limitations": []
										},
										"fields": [],
										"other": true,
										"gpl": false,
										"lgpl": false,
										"cc": false
									}
								],
								"matched_files": [
									{
										"filename": "LICENSE",
										"content": "MIT License\n\nCopyright (c) 2023 interTwin Community\n\nPermission is hereby granted, free of charge, to any person obtaining a copy\nof this software and associated documentation files (the \"Software\"), to deal\nin the Software without restriction, including without limitation the rights\nto use, copy, modify, merge, publish, distribute, sublicense, and/or sell\ncopies of the Software, and to permit persons to whom the Software is\nfurnished to do so, subject to the following conditions:\n\nThe above copyright notice and this permission notice shall be included in all\ncopies or substantial portions of the Software.\n\nTHE SOFTWARE IS PROVIDED \"AS IS\", WITHOUT WARRANTY OF ANY KIND, EXPRESS OR\nIMPLIED, INCLUDING BUT NOT LIMITED TO THE WARRANTIES OF MERCHANTABILITY,\nFITNESS FOR A PARTICULAR PURPOSE AND NONINFRINGEMENT. IN NO EVENT SHALL THE\nAUTHORS OR COPYRIGHT HOLDERS BE LIABLE FOR ANY CLAIM, DAMAGES OR OTHER\nLIABILITY, WHETHER IN AN ACTION OF CONTRACT, TORT OR OTHERWISE, ARISING FROM,\nOUT OF OR IN CONNECTION WITH THE SOFTWARE OR THE USE OR OTHER DEALINGS IN THE\nSOFTWARE.\n",
										"content_hash": "4c2c763d64bbc7ef2e58b0ec6d06d90cee9755c9",
										"content_normalized": "permission is hereby granted, free of charge, to any person obtaining a copy of this software and associated documentation files (the 'software'), to deal in the software without restriction, including without limitation the rights to use, copy, modify, merge, publish, distribute, sublicense, and/or sell copies of the software, and to permit persons to whom the software is furnished to do so, subject to the following conditions: the above copyright notice and this permission notice shall be included in all copies or substantial portions of the software. the software is provided 'as is', without warranty of any kind, express or implied, including but not limited to the warranties of merchantability, fitness for a particular purpose and noninfringement. in no event shall the authors or copyright holders be liable for any claim, damages or other liability, whether in an action of contract, tort or otherwise, arising from, out of or in connection with the software or the use or other dealings in the software.",
										"matcher": {
											"name": "exact",
											"confidence": 100
										},
										"matched_license": "MIT",
										"attribution": "Copyright (c) 2023 interTwin Community"
									},
									{
										"filename": "COPYRIGHT",
										"content": "This project is licensed under MIT.\n\nCopyrights in this project are retained by their contributors.\nNo copyright assignment is required to contribute to this project.\n",
										"content_hash": "fc7c92616e4353936eb44819f8733479636cdd22",
										"content_normalized": "this project is licensed under mit. copyrights in this project are retained by their contributors. no copyright assignment is required to contribute to this project.",
										"matcher": null,
										"matched_license": "NOASSERTION",
										"attribution": null
									}
								]
							}
						}
					],
					"valid": true
				},
				"QC.Lic02.1": {
					"description": "Does the code use an Open Source Initiative's popular-recognized license?",
					"requirement_level": "MAY",
					"hint": "The Open Source Initiative (OSI) sets out the requirements for software to be legally declared as Open Source. OSI provides a list of popular licenses that shall match most of the demands. The license in use shall be in the list of <a href=\"https://opensource.org/license-list.html\" target=\"_blank\">OSI popular licenses</a> for this criterion to be successful",
					"evidence": [
						{
							"valid": true,
							"message": "License MIT is listed under the Open Source Initiative popular category",
							"plugin": {
								"name": "report2sqaaas-plugin-licensee",
								"version": "1.2.0"
							},
							"tool": {
								"name": "licensee",
								"lang": "license",
								"version": "9.15.1",
								"docker": {
									"dockerfile": "QC.Lic/licensee/Dockerfile",
									"reviewed": "2021-06-28"
								},
								"ci": {
									"name": "QC.Lic github.com/interTwin-eu/interLink licensee",
									"status": "SUCCESS",
									"stdout_command": [
										"licensee detect . --confidence 60 --json"
									],
									"stdout_text": "{\"licenses\":[{\"key\":\"mit\",\"spdx_id\":\"MIT\",\"meta\":{\"title\":\"MIT License\",\"source\":\"https://spdx.org/licenses/MIT.html\",\"description\":\"A short and simple permissive license with conditions only requiring preservation of copyright and license notices. Licensed works, modifications, and larger works may be distributed under different terms and without source code.\",\"how\":\"Create a text file (typically named LICENSE or LICENSE.txt) in the root of your source code and copy the text of the license into the file. Replace [year] with the current year and [fullname] with the name (or names) of the copyright holders.\",\"using\":{\"Babel\":\"https://github.com/babel/babel/blob/master/LICENSE\",\".NET\":\"https://github.com/dotnet/runtime/blob/main/LICENSE.TXT\",\"Rails\":\"https://github.com/rails/rails/blob/master/MIT-LICENSE\"},\"featured\":true,\"hidden\":false,\"nickname\":null,\"note\":null},\"url\":\"http://choosealicense.com/licenses/mit/\",\"rules\":{\"permissions\":[{\"tag\":\"commercial-use\",\"label\":\"Commercial use\",\"description\":\"The licensed material and derivatives may be used for commercial purposes.\"},{\"tag\":\"modifications\",\"label\":\"Modification\",\"description\":\"The licensed material may be modified.\"},{\"tag\":\"distribution\",\"label\":\"Distribution\",\"description\":\"The licensed material may be distributed.\"},{\"tag\":\"private-use\",\"label\":\"Private use\",\"description\":\"The licensed material may be used and modified in private.\"}],\"conditions\":[{\"tag\":\"include-copyright\",\"label\":\"License and copyright notice\",\"description\":\"A copy of the license and copyright notice must be included with the licensed material.\"}],\"limitations\":[{\"tag\":\"liability\",\"label\":\"Liability\",\"description\":\"This license includes a limitation of liability.\"},{\"tag\":\"warranty\",\"label\":\"Warranty\",\"description\":\"This license explicitly states that it does NOT provide any warranty.\"}]},\"fields\":[{\"name\":\"year\",\"description\":\"The current year\"},{\"name\":\"fullname\",\"description\":\"The full name or username of the repository owner\"}],\"other\":false,\"gpl\":false,\"lgpl\":false,\"cc\":false},{\"key\":\"other\",\"spdx_id\":\"NOASSERTION\",\"meta\":{\"title\":null,\"source\":null,\"description\":null,\"how\":null,\"using\":null,\"featured\":false,\"hidden\":true,\"nickname\":null,\"note\":null},\"url\":\"http://choosealicense.com/licenses/other/\",\"rules\":{\"permissions\":[],\"conditions\":[],\"limitations\":[]},\"fields\":[],\"other\":true,\"gpl\":false,\"lgpl\":false,\"cc\":false}],\"matched_files\":[{\"filename\":\"LICENSE\",\"content\":\"MIT License\\n\\nCopyright (c) 2023 interTwin Community\\n\\nPermission is hereby granted, free of charge, to any person obtaining a copy\\nof this software and associated documentation files (the \\\"Software\\\"), to deal\\nin the Software without restriction, including without limitation the rights\\nto use, copy, modify, merge, publish, distribute, sublicense, and/or sell\\ncopies of the Software, and to permit persons to whom the Software is\\nfurnished to do so, subject to the following conditions:\\n\\nThe above copyright notice and this permission notice shall be included in all\\ncopies or substantial portions of the Software.\\n\\nTHE SOFTWARE IS PROVIDED \\\"AS IS\\\", WITHOUT WARRANTY OF ANY KIND, EXPRESS OR\\nIMPLIED, INCLUDING BUT NOT LIMITED TO THE WARRANTIES OF MERCHANTABILITY,\\nFITNESS FOR A PARTICULAR PURPOSE AND NONINFRINGEMENT. IN NO EVENT SHALL THE\\nAUTHORS OR COPYRIGHT HOLDERS BE LIABLE FOR ANY CLAIM, DAMAGES OR OTHER\\nLIABILITY, WHETHER IN AN ACTION OF CONTRACT, TORT OR OTHERWISE, ARISING FROM,\\nOUT OF OR IN CONNECTION WITH THE SOFTWARE OR THE USE OR OTHER DEALINGS IN THE\\nSOFTWARE.\\n\",\"content_hash\":\"4c2c763d64bbc7ef2e58b0ec6d06d90cee9755c9\",\"content_normalized\":\"permission is hereby granted, free of charge, to any person obtaining a copy of this software and associated documentation files (the 'software'), to deal in the software without restriction, including without limitation the rights to use, copy, modify, merge, publish, distribute, sublicense, and/or sell copies of the software, and to permit persons to whom the software is furnished to do so, subject to the following conditions: the above copyright notice and this permission notice shall be included in all copies or substantial portions of the software. the software is provided 'as is', without warranty of any kind, express or implied, including but not limited to the warranties of merchantability, fitness for a particular purpose and noninfringement. in no event shall the authors or copyright holders be liable for any claim, damages or other liability, whether in an action of contract, tort or otherwise, arising from, out of or in connection with the software or the use or other dealings in the software.\",\"matcher\":{\"name\":\"exact\",\"confidence\":100},\"matched_license\":\"MIT\",\"attribution\":\"Copyright (c) 2023 interTwin Community\"},{\"filename\":\"COPYRIGHT\",\"content\":\"This project is licensed under MIT.\\n\\nCopyrights in this project are retained by their contributors.\\nNo copyright assignment is required to contribute to this project.\\n\",\"content_hash\":\"fc7c92616e4353936eb44819f8733479636cdd22\",\"content_normalized\":\"this project is licensed under mit. copyrights in this project are retained by their contributors. no copyright assignment is required to contribute to this project.\",\"matcher\":null,\"matched_license\":\"NOASSERTION\",\"attribution\":null}]}",
									"url": "https://jenkins.eosc-synergy.eu/job/eosc-synergy-org/job/interLink.assess.sqaaas/job/main/3/execution/node/61/log?consoleFull"
								},
								"level": "REQUIRED",
								"build_repo": "https://github.com/eosc-synergy/interLink.assess.sqaaas"
							},
							"standard": {
								"title": "A set of Common Software Quality Assurance Baseline Criteria for Research Projects",
								"version": "v4.0",
								"url": "https://github.com/indigo-dc/sqa-baseline/releases/tag/v4.0"
							},
							"data_unstructured": {
								"licenses": [
									{
										"key": "mit",
										"spdx_id": "MIT",
										"meta": {
											"title": "MIT License",
											"source": "https://spdx.org/licenses/MIT.html",
											"description": "A short and simple permissive license with conditions only requiring preservation of copyright and license notices. Licensed works, modifications, and larger works may be distributed under different terms and without source code.",
											"how": "Create a text file (typically named LICENSE or LICENSE.txt) in the root of your source code and copy the text of the license into the file. Replace [year] with the current year and [fullname] with the name (or names) of the copyright holders.",
											"using": {
												"Babel": "https://github.com/babel/babel/blob/master/LICENSE",
												".NET": "https://github.com/dotnet/runtime/blob/main/LICENSE.TXT",
												"Rails": "https://github.com/rails/rails/blob/master/MIT-LICENSE"
											},
											"featured": true,
											"hidden": false,
											"nickname": null,
											"note": null
										},
										"url": "http://choosealicense.com/licenses/mit/",
										"rules": {
											"permissions": [
												{
													"tag": "commercial-use",
													"label": "Commercial use",
													"description": "The licensed material and derivatives may be used for commercial purposes."
												},
												{
													"tag": "modifications",
													"label": "Modification",
													"description": "The licensed material may be modified."
												},
												{
													"tag": "distribution",
													"label": "Distribution",
													"description": "The licensed material may be distributed."
												},
												{
													"tag": "private-use",
													"label": "Private use",
													"description": "The licensed material may be used and modified in private."
												}
											],
											"conditions": [
												{
													"tag": "include-copyright",
													"label": "License and copyright notice",
													"description": "A copy of the license and copyright notice must be included with the licensed material."
												}
											],
											"limitations": [
												{
													"tag": "liability",
													"label": "Liability",
													"description": "This license includes a limitation of liability."
												},
												{
													"tag": "warranty",
													"label": "Warranty",
													"description": "This license explicitly states that it does NOT provide any warranty."
												}
											]
										},
										"fields": [
											{
												"name": "year",
												"description": "The current year"
											},
											{
												"name": "fullname",
												"description": "The full name or username of the repository owner"
											}
										],
										"other": false,
										"gpl": false,
										"lgpl": false,
										"cc": false
									},
									{
										"key": "other",
										"spdx_id": "NOASSERTION",
										"meta": {
											"title": null,
											"source": null,
											"description": null,
											"how": null,
											"using": null,
											"featured": false,
											"hidden": true,
											"nickname": null,
											"note": null
										},
										"url": "http://choosealicense.com/licenses/other/",
										"rules": {
											"permissions": [],
											"conditions": [],
											"limitations": []
										},
										"fields": [],
										"other": true,
										"gpl": false,
										"lgpl": false,
										"cc": false
									}
								],
								"matched_files": [
									{
										"filename": "LICENSE",
										"content": "MIT License\n\nCopyright (c) 2023 interTwin Community\n\nPermission is hereby granted, free of charge, to any person obtaining a copy\nof this software and associated documentation files (the \"Software\"), to deal\nin the Software without restriction, including without limitation the rights\nto use, copy, modify, merge, publish, distribute, sublicense, and/or sell\ncopies of the Software, and to permit persons to whom the Software is\nfurnished to do so, subject to the following conditions:\n\nThe above copyright notice and this permission notice shall be included in all\ncopies or substantial portions of the Software.\n\nTHE SOFTWARE IS PROVIDED \"AS IS\", WITHOUT WARRANTY OF ANY KIND, EXPRESS OR\nIMPLIED, INCLUDING BUT NOT LIMITED TO THE WARRANTIES OF MERCHANTABILITY,\nFITNESS FOR A PARTICULAR PURPOSE AND NONINFRINGEMENT. IN NO EVENT SHALL THE\nAUTHORS OR COPYRIGHT HOLDERS BE LIABLE FOR ANY CLAIM, DAMAGES OR OTHER\nLIABILITY, WHETHER IN AN ACTION OF CONTRACT, TORT OR OTHERWISE, ARISING FROM,\nOUT OF OR IN CONNECTION WITH THE SOFTWARE OR THE USE OR OTHER DEALINGS IN THE\nSOFTWARE.\n",
										"content_hash": "4c2c763d64bbc7ef2e58b0ec6d06d90cee9755c9",
										"content_normalized": "permission is hereby granted, free of charge, to any person obtaining a copy of this software and associated documentation files (the 'software'), to deal in the software without restriction, including without limitation the rights to use, copy, modify, merge, publish, distribute, sublicense, and/or sell copies of the software, and to permit persons to whom the software is furnished to do so, subject to the following conditions: the above copyright notice and this permission notice shall be included in all copies or substantial portions of the software. the software is provided 'as is', without warranty of any kind, express or implied, including but not limited to the warranties of merchantability, fitness for a particular purpose and noninfringement. in no event shall the authors or copyright holders be liable for any claim, damages or other liability, whether in an action of contract, tort or otherwise, arising from, out of or in connection with the software or the use or other dealings in the software.",
										"matcher": {
											"name": "exact",
											"confidence": 100
										},
										"matched_license": "MIT",
										"attribution": "Copyright (c) 2023 interTwin Community"
									},
									{
										"filename": "COPYRIGHT",
										"content": "This project is licensed under MIT.\n\nCopyrights in this project are retained by their contributors.\nNo copyright assignment is required to contribute to this project.\n",
										"content_hash": "fc7c92616e4353936eb44819f8733479636cdd22",
										"content_normalized": "this project is licensed under mit. copyrights in this project are retained by their contributors. no copyright assignment is required to contribute to this project.",
										"matcher": null,
										"matched_license": "NOASSERTION",
										"attribution": null
									}
								]
							}
						}
					],
					"valid": true
				}
			},
			"coverage": {
				"percentage": 100,
				"total_subcriteria": 4,
				"success_subcriteria": 4
			}
		},
		"QC.Ver": {
			"valid": true,
			"subcriteria": {
				"QC.Ver01.0": {
					"description": "Are tags being used for releasing software",
					"requirement_level": "MUST",
					"hint": "Git tags are a convenient way to release software. This subcriterion checks if any git tag is present in the code history. More info on it-scm.com/book/en/v2/Git-Basics-Tagging\" target=\"_blank\">git tagging</a>",
					"evidence": [
						{
							"valid": true,
							"message": "The code repository uses tags for releasing new software versions",
							"plugin": {
								"name": "report2sqaaas-plugin-is_semver",
								"version": "1.0.0"
							},
							"tool": {
								"name": "get_git_tags.py",
								"lang": "Semantic Versioning",
								"version": "latest",
								"docker": {
									"dockerfile": "QC.Ver/Dockerfile",
									"reviewed": "2022-05-10"
								},
								"ci": {
									"name": "QC.Ver github.com/interTwin-eu/interLink get_git_tags.py",
									"status": "SUCCESS",
									"stdout_command": [
										"get_git_tags.py"
									],
									"stdout_text": "['0.1.0', '0.0.4', '0.0.4-pre8', '0.0.4-pre7', '0.0.4-pre6', '0.0.4-pre5', '0.0.4-pre4', '0.0.4-pre3', '0.0.4-pre2', '0.0.4-pre1', '0.0.3', '0.0.3-pre16', '0.0.3-pre15', '0.0.3-pre14', '0.0.3-pre13', '0.0.3-pre12', '0.0.3-pre11', '0.0.3-pre19', '0.0.3-pre10', '0.0.3-pre9', '0.0.3-pre8', '0.0.3-pre7', '0.0.3-pre6', '0.0.2-patch8', '0.0.2-patch7', '0.0.2-patch6-vega2', '0.0.2-patch6-vega', '0.0.2-patch6', '0.0.2-patch5', '0.0.2-patch4', '0.0.2-patch3', '0.0.2-patch2', '0.0.2-patch1', '0.0.2', '0.0.3-pre5', '0.0.3-pre4', '0.0.3-pre3', '0.0.3-pre2', '0.0.3-pre1', '0.0.2-pre7', '0.0.2-pre6', '0.0.2-pre5', '0.0.2-pre4', '0.0.2-pre3', '0.0.2-pre2', '0.0.2-pre1', '0.0.1', '0.0.1-pre15', '0.0.1-pre14', '0.0.1-pre13', '0.0.1-pre12', '0.0.1-pre11', '0.0.1-pre10', '0.0.1-pre9', '0.0.1-pre8', '0.0.1-pre7', '0.0.1-pre6', '0.0.1-pre5', '0.0.1-pre4', '0.0.1-pre3', '0.0.1-pre2', '0.0.1-pre1']",
									"url": "https://jenkins.eosc-synergy.eu/job/eosc-synergy-org/job/interLink.assess.sqaaas/job/main/3/execution/node/70/log?consoleFull"
								},
								"level": "REQUIRED",
								"build_repo": "https://github.com/eosc-synergy/interLink.assess.sqaaas"
							},
							"standard": {
								"title": "A set of Common Software Quality Assurance Baseline Criteria for Research Projects",
								"version": "v4.0",
								"url": "https://github.com/indigo-dc/sqa-baseline/releases/tag/v4.0"
							},
							"data_unstructured": [
								"0.1.0",
								"0.0.4",
								"0.0.4-pre8",
								"0.0.4-pre7",
								"0.0.4-pre6",
								"0.0.4-pre5",
								"0.0.4-pre4",
								"0.0.4-pre3",
								"0.0.4-pre2",
								"0.0.4-pre1",
								"0.0.3",
								"0.0.3-pre16",
								"0.0.3-pre15",
								"0.0.3-pre14",
								"0.0.3-pre13",
								"0.0.3-pre12",
								"0.0.3-pre11",
								"0.0.3-pre19",
								"0.0.3-pre10",
								"0.0.3-pre9",
								"0.0.3-pre8",
								"0.0.3-pre7",
								"0.0.3-pre6",
								"0.0.2-patch8",
								"0.0.2-patch7",
								"0.0.2-patch6-vega2",
								"0.0.2-patch6-vega",
								"0.0.2-patch6",
								"0.0.2-patch5",
								"0.0.2-patch4",
								"0.0.2-patch3",
								"0.0.2-patch2",
								"0.0.2-patch1",
								"0.0.2",
								"0.0.3-pre5",
								"0.0.3-pre4",
								"0.0.3-pre3",
								"0.0.3-pre2",
								"0.0.3-pre1",
								"0.0.2-pre7",
								"0.0.2-pre6",
								"0.0.2-pre5",
								"0.0.2-pre4",
								"0.0.2-pre3",
								"0.0.2-pre2",
								"0.0.2-pre1",
								"0.0.1",
								"0.0.1-pre15",
								"0.0.1-pre14",
								"0.0.1-pre13",
								"0.0.1-pre12",
								"0.0.1-pre11",
								"0.0.1-pre10",
								"0.0.1-pre9",
								"0.0.1-pre8",
								"0.0.1-pre7",
								"0.0.1-pre6",
								"0.0.1-pre5",
								"0.0.1-pre4",
								"0.0.1-pre3",
								"0.0.1-pre2",
								"0.0.1-pre1"
							]
						}
					],
					"valid": true
				},
				"QC.Ver01": {
					"description": "Is the latest release compliant with Semantic Versioning (SemVer) specification?",
					"requirement_level": "SHOULD",
					"hint": "Latest tag must be compliant with <a href=\"https://semver.org\" target=\"_blank\">SemVer specification</a>",
					"evidence": [
						{
							"valid": true,
							"message": "Latest release tag 0.1.0 is SemVer compliant",
							"plugin": {
								"name": "report2sqaaas-plugin-is_semver",
								"version": "1.0.0"
							},
							"tool": {
								"name": "get_git_tags.py",
								"lang": "Semantic Versioning",
								"version": "latest",
								"docker": {
									"dockerfile": "QC.Ver/Dockerfile",
									"reviewed": "2022-05-10"
								},
								"ci": {
									"name": "QC.Ver github.com/interTwin-eu/interLink get_git_tags.py",
									"status": "SUCCESS",
									"stdout_command": [
										"get_git_tags.py"
									],
									"stdout_text": "['0.1.0', '0.0.4', '0.0.4-pre8', '0.0.4-pre7', '0.0.4-pre6', '0.0.4-pre5', '0.0.4-pre4', '0.0.4-pre3', '0.0.4-pre2', '0.0.4-pre1', '0.0.3', '0.0.3-pre16', '0.0.3-pre15', '0.0.3-pre14', '0.0.3-pre13', '0.0.3-pre12', '0.0.3-pre11', '0.0.3-pre19', '0.0.3-pre10', '0.0.3-pre9', '0.0.3-pre8', '0.0.3-pre7', '0.0.3-pre6', '0.0.2-patch8', '0.0.2-patch7', '0.0.2-patch6-vega2', '0.0.2-patch6-vega', '0.0.2-patch6', '0.0.2-patch5', '0.0.2-patch4', '0.0.2-patch3', '0.0.2-patch2', '0.0.2-patch1', '0.0.2', '0.0.3-pre5', '0.0.3-pre4', '0.0.3-pre3', '0.0.3-pre2', '0.0.3-pre1', '0.0.2-pre7', '0.0.2-pre6', '0.0.2-pre5', '0.0.2-pre4', '0.0.2-pre3', '0.0.2-pre2', '0.0.2-pre1', '0.0.1', '0.0.1-pre15', '0.0.1-pre14', '0.0.1-pre13', '0.0.1-pre12', '0.0.1-pre11', '0.0.1-pre10', '0.0.1-pre9', '0.0.1-pre8', '0.0.1-pre7', '0.0.1-pre6', '0.0.1-pre5', '0.0.1-pre4', '0.0.1-pre3', '0.0.1-pre2', '0.0.1-pre1']",
									"url": "https://jenkins.eosc-synergy.eu/job/eosc-synergy-org/job/interLink.assess.sqaaas/job/main/3/execution/node/70/log?consoleFull"
								},
								"level": "REQUIRED",
								"build_repo": "https://github.com/eosc-synergy/interLink.assess.sqaaas"
							},
							"standard": {
								"title": "A set of Common Software Quality Assurance Baseline Criteria for Research Projects",
								"version": "v4.0",
								"url": "https://github.com/indigo-dc/sqa-baseline/releases/tag/v4.0"
							},
							"data_unstructured": [
								"0.1.0",
								"0.0.4",
								"0.0.4-pre8",
								"0.0.4-pre7",
								"0.0.4-pre6",
								"0.0.4-pre5",
								"0.0.4-pre4",
								"0.0.4-pre3",
								"0.0.4-pre2",
								"0.0.4-pre1",
								"0.0.3",
								"0.0.3-pre16",
								"0.0.3-pre15",
								"0.0.3-pre14",
								"0.0.3-pre13",
								"0.0.3-pre12",
								"0.0.3-pre11",
								"0.0.3-pre19",
								"0.0.3-pre10",
								"0.0.3-pre9",
								"0.0.3-pre8",
								"0.0.3-pre7",
								"0.0.3-pre6",
								"0.0.2-patch8",
								"0.0.2-patch7",
								"0.0.2-patch6-vega2",
								"0.0.2-patch6-vega",
								"0.0.2-patch6",
								"0.0.2-patch5",
								"0.0.2-patch4",
								"0.0.2-patch3",
								"0.0.2-patch2",
								"0.0.2-patch1",
								"0.0.2",
								"0.0.3-pre5",
								"0.0.3-pre4",
								"0.0.3-pre3",
								"0.0.3-pre2",
								"0.0.3-pre1",
								"0.0.2-pre7",
								"0.0.2-pre6",
								"0.0.2-pre5",
								"0.0.2-pre4",
								"0.0.2-pre3",
								"0.0.2-pre2",
								"0.0.2-pre1",
								"0.0.1",
								"0.0.1-pre15",
								"0.0.1-pre14",
								"0.0.1-pre13",
								"0.0.1-pre12",
								"0.0.1-pre11",
								"0.0.1-pre10",
								"0.0.1-pre9",
								"0.0.1-pre8",
								"0.0.1-pre7",
								"0.0.1-pre6",
								"0.0.1-pre5",
								"0.0.1-pre4",
								"0.0.1-pre3",
								"0.0.1-pre2",
								"0.0.1-pre1"
							]
						}
					],
					"valid": true
				},
				"QC.Ver02": {
					"description": "Are all release tags with Semantic Versioning (SemVer) specification?",
					"requirement_level": "SHOULD",
					"hint": "Existent release tags shall be <a href=\"https://semver.org\" target=\"_blank\">SemVer</a> compliant for this subcriterion to be successful",
					"evidence": [
						{
							"valid": true,
							"message": "All release tags are SemVer compliant",
							"plugin": {
								"name": "report2sqaaas-plugin-is_semver",
								"version": "1.0.0"
							},
							"tool": {
								"name": "get_git_tags.py",
								"lang": "Semantic Versioning",
								"version": "latest",
								"docker": {
									"dockerfile": "QC.Ver/Dockerfile",
									"reviewed": "2022-05-10"
								},
								"ci": {
									"name": "QC.Ver github.com/interTwin-eu/interLink get_git_tags.py",
									"status": "SUCCESS",
									"stdout_command": [
										"get_git_tags.py"
									],
									"stdout_text": "['0.1.0', '0.0.4', '0.0.4-pre8', '0.0.4-pre7', '0.0.4-pre6', '0.0.4-pre5', '0.0.4-pre4', '0.0.4-pre3', '0.0.4-pre2', '0.0.4-pre1', '0.0.3', '0.0.3-pre16', '0.0.3-pre15', '0.0.3-pre14', '0.0.3-pre13', '0.0.3-pre12', '0.0.3-pre11', '0.0.3-pre19', '0.0.3-pre10', '0.0.3-pre9', '0.0.3-pre8', '0.0.3-pre7', '0.0.3-pre6', '0.0.2-patch8', '0.0.2-patch7', '0.0.2-patch6-vega2', '0.0.2-patch6-vega', '0.0.2-patch6', '0.0.2-patch5', '0.0.2-patch4', '0.0.2-patch3', '0.0.2-patch2', '0.0.2-patch1', '0.0.2', '0.0.3-pre5', '0.0.3-pre4', '0.0.3-pre3', '0.0.3-pre2', '0.0.3-pre1', '0.0.2-pre7', '0.0.2-pre6', '0.0.2-pre5', '0.0.2-pre4', '0.0.2-pre3', '0.0.2-pre2', '0.0.2-pre1', '0.0.1', '0.0.1-pre15', '0.0.1-pre14', '0.0.1-pre13', '0.0.1-pre12', '0.0.1-pre11', '0.0.1-pre10', '0.0.1-pre9', '0.0.1-pre8', '0.0.1-pre7', '0.0.1-pre6', '0.0.1-pre5', '0.0.1-pre4', '0.0.1-pre3', '0.0.1-pre2', '0.0.1-pre1']",
									"url": "https://jenkins.eosc-synergy.eu/job/eosc-synergy-org/job/interLink.assess.sqaaas/job/main/3/execution/node/70/log?consoleFull"
								},
								"level": "REQUIRED",
								"build_repo": "https://github.com/eosc-synergy/interLink.assess.sqaaas"
							},
							"standard": {
								"title": "A set of Common Software Quality Assurance Baseline Criteria for Research Projects",
								"version": "v4.0",
								"url": "https://github.com/indigo-dc/sqa-baseline/releases/tag/v4.0"
							},
							"data_unstructured": [
								"0.1.0",
								"0.0.4",
								"0.0.4-pre8",
								"0.0.4-pre7",
								"0.0.4-pre6",
								"0.0.4-pre5",
								"0.0.4-pre4",
								"0.0.4-pre3",
								"0.0.4-pre2",
								"0.0.4-pre1",
								"0.0.3",
								"0.0.3-pre16",
								"0.0.3-pre15",
								"0.0.3-pre14",
								"0.0.3-pre13",
								"0.0.3-pre12",
								"0.0.3-pre11",
								"0.0.3-pre19",
								"0.0.3-pre10",
								"0.0.3-pre9",
								"0.0.3-pre8",
								"0.0.3-pre7",
								"0.0.3-pre6",
								"0.0.2-patch8",
								"0.0.2-patch7",
								"0.0.2-patch6-vega2",
								"0.0.2-patch6-vega",
								"0.0.2-patch6",
								"0.0.2-patch5",
								"0.0.2-patch4",
								"0.0.2-patch3",
								"0.0.2-patch2",
								"0.0.2-patch1",
								"0.0.2",
								"0.0.3-pre5",
								"0.0.3-pre4",
								"0.0.3-pre3",
								"0.0.3-pre2",
								"0.0.3-pre1",
								"0.0.2-pre7",
								"0.0.2-pre6",
								"0.0.2-pre5",
								"0.0.2-pre4",
								"0.0.2-pre3",
								"0.0.2-pre2",
								"0.0.2-pre1",
								"0.0.1",
								"0.0.1-pre15",
								"0.0.1-pre14",
								"0.0.1-pre13",
								"0.0.1-pre12",
								"0.0.1-pre11",
								"0.0.1-pre10",
								"0.0.1-pre9",
								"0.0.1-pre8",
								"0.0.1-pre7",
								"0.0.1-pre6",
								"0.0.1-pre5",
								"0.0.1-pre4",
								"0.0.1-pre3",
								"0.0.1-pre2",
								"0.0.1-pre1"
							]
						}
					],
					"valid": true
				}
			},
			"coverage": {
				"percentage": 100,
				"total_subcriteria": 3,
				"success_subcriteria": 3
			}
		},
		"QC.Met": {
			"valid": false,
			"subcriteria": {
				"QC.Met01": {
					"description": "Is the software citable?",
					"valid": false,
					"hint": "The two formats for software citation supported by SQAaaS are: 1) <a href=\"https://codemeta.github.io/\" target=\"_blank\">CodeMeta</a> and 2) <a href=\"https://citation-file-format.github.io/\" target=\"_blank\">Citation File Format (CFF)</a>. While CodeMeta provides you with a more comprehensive description, CFF is a more lightweight, good-enough approach to software (with built-in support by GitHub) citation. Both provide tools (<a href=\"https://codemeta.github.io/codemeta-generator/\" target=\"_blank\">CodeMeta generator</a>, <a href=\"https://citation-file-format.github.io/cff-initializer-javascript/#/\" target=\"_blank\">CFFINIT</a>)to easily generate a working citation file. Once having the file, be sure to add it to the root path of your code repo.",
					"evidence": [
						{
							"valid": false,
							"message": "No matching files found for language <CodeMeta> in repository searching by extensions or filenames\nNo matching files found for language <Citation File Format> in repository searching by extensions or filenames"
						}
					],
					"required_for_next_level_badge": true
				}
			},
			"coverage": {
				"percentage": 0,
				"total_subcriteria": 1,
				"success_subcriteria": 0
			}
		},
		"QC.Sec": {
			"valid": false,
			"subcriteria": {
				"QC.Sec02": {
					"description": "Is the source code passing Static Analysis Security Testing (SAST)?",
					"valid": false,
					"hint": "Please check & solve the security weaknesses found by the SAST tool",
					"evidence": [
						{
							"valid": false,
							"message": "No matching files found for language <Python> in repository searching by extensions or filenames\nNo matching files found for language <Go> in repository searching by extensions or filenames"
						}
					],
					"required_for_next_level_badge": false
				}
			},
			"coverage": {
				"percentage": 0,
				"total_subcriteria": 1,
				"success_subcriteria": 0
			}
		},
		"QC.Sty": {
			"valid": false,
			"subcriteria": {
				"QC.Sty01": {
					"description": "Is the software product following a style standard for {lang_name} files?",
					"valid": false,
					"hint": "Please check & solve the security weaknesses found by the linter tool",
					"evidence": [
						{
							"valid": false,
							"message": "No matching files found for language <Dockerfile> in repository searching by extensions or filenames\nNo matching files found for language <JSON> in repository searching by extensions or filenames\nNo matching files found for language <Python> in repository searching by extensions or filenames\nNo matching files found for language <Go> in repository searching by extensions or filenames\nNo matching files found for language <Ruby> in repository searching by extensions or filenames\nNo matching files found for language <Java> in repository searching by extensions or filenames"
						}
					],
					"required_for_next_level_badge": false
				}
			},
			"coverage": {
				"percentage": 0,
				"total_subcriteria": 1,
				"success_subcriteria": 0
			}
		},
		"QC.Uni": {
			"valid": false,
			"subcriteria": {
				"QC.Uni01": {
					"description": "Are the tests passing through an automated means?",
					"valid": false,
					"hint": "Please check & solve the failing test cases found by the {tool_name} tool",
					"evidence": [
						{
							"valid": false,
							"message": "No matching files found for language <Python> in repository searching by extensions or filenames"
						}
					],
					"required_for_next_level_badge": false
				}
			},
			"coverage": {
				"percentage": 0,
				"total_subcriteria": 1,
				"success_subcriteria": 0
			}
		}
	},
	"badge": {
		"software": {
			"criteria": {
				"bronze": {
					"to_fulfill": [
						"QC.Lic",
						"QC.Doc",
						"QC.Acc"
					],
					"missing": [],
					"fulfilled": [
						"QC.Lic",
						"QC.Doc",
						"QC.Acc"
					]
				},
				"silver": {
					"to_fulfill": [
						"QC.Ver",
						"QC.Acc",
						"QC.Lic",
						"QC.Doc",
						"QC.Met"
					],
					"missing": [
						"QC.Met"
					],
					"fulfilled": [
						"QC.Doc",
						"QC.Lic",
						"QC.Ver",
						"QC.Acc"
					]
				},
				"gold": {
					"to_fulfill": [
						"QC.Sty",
						"QC.Ver",
						"QC.Uni",
						"QC.Acc",
						"QC.Sec",
						"QC.Lic",
						"QC.Doc",
						"QC.Met"
					],
					"missing": [
						"QC.Sty",
						"QC.Uni",
						"QC.Sec",
						"QC.Met"
					],
					"fulfilled": [
						"QC.Doc",
						"QC.Lic",
						"QC.Ver",
						"QC.Acc"
					]
				}
			},
			"data": {
				"entityType": "Assertion",
				"entityId": "fTuR8UBSS3WANmQM7JClhw",
				"openBadgeId": "https://api.eu.badgr.io/public/assertions/fTuR8UBSS3WANmQM7JClhw",
				"createdAt": "2024-02-02T07:26:53.631969977Z",
				"createdBy": "aS1lWKgIR4u8bGjPZUzAyg",
				"badgeclass": "UOmgyH_TSpSPXiro4aNBoQ",
				"badgeclassOpenBadgeId": "https://api.eu.badgr.io/public/badges/UOmgyH_TSpSPXiro4aNBoQ",
				"issuer": "aS1lWKgIR4u8bGjPZUzAyg",
				"issuerOpenBadgeId": "https://api.eu.badgr.io/public/issuers/aS1lWKgIR4u8bGjPZUzAyg",
				"image": "https://api.eu.badgr.io/public/assertions/fTuR8UBSS3WANmQM7JClhw/image",
				"recipient": {
					"identity": "sha256$595594d3a00e472f2a74b23ca4df50f5c3fab9abdfb66f04b253e411ba3af659",
					"hashed": true,
					"type": "url",
					"salt": "UE57lt62evdDHL8e",
					"plaintextIdentity": "https://github.com/interTwin-eu/interLink"
				},
				"issuedOn": "2024-02-02T07:26:53.631973847Z",
				"narrative": "SQAaaS assessment results for repository https://github.com/interTwin-eu/interLink (commit: b2fb1e56f009cf31ca7fd3dc49e16bf23bc0e743, branch/tag: main)",
				"evidence": [
					{
						"url": "https://github.com/EOSC-synergy/interLink.assess.sqaaas/commit/49d30c26d9f4b034b3c58e0e435f74571215463b",
						"narrative": "SQAaaS build repository"
					},
					{
						"url": "https://jenkins.eosc-synergy.eu/job/eosc-synergy-org/job/interLink.assess.sqaaas/job/main/3/",
						"narrative": "Build page from Jenkins CI"
					}
				],
				"revoked": false,
				"revocationReason": null,
				"acceptance": "Unaccepted",
				"expires": null,
				"extensions": {},
				"assertionRef": {
					"assertionUrl": "https://api.eu.badgr.io/public/assertions/fTuR8UBSS3WANmQM7JClhw"
				},
				"badgeRef": {
					"badgeUrl": "https://api.eu.badgr.io/public/badges/UOmgyH_TSpSPXiro4aNBoQ"
				},
				"issuerRef": {
					"issuerUrl": "https://api.eu.badgr.io/public/issuers/aS1lWKgIR4u8bGjPZUzAyg"
				},
				"pending": null,
				"source": "local",
				"sourceUrl": null,
				"originalJson": null,
				"imagePath": "uploads/badges/assertion-fTuR8UBSS3WANmQM7JClhw.png"
			},
			"share": "<!--\nSPDX-FileCopyrightText: Copyright contributors to the Software Quality Assurance as a Service (SQAaaS) project <sqaaas@ibergrid.eu>\n\nSPDX-License-Identifier: GPL-3.0-only\n-->\n\n<blockquote class=\"badgr-badge\" style=\"font-family: Helvetica, Roboto, &quot;Segoe UI&quot;, Calibri, sans-serif;\"><a href=\"https://api.eu.badgr.io/public/assertions/fTuR8UBSS3WANmQM7JClhw?identity__url=https%3A//github.com/EOSC-synergy/interLink.assess.sqaaas/commit/49d30c26d9f4b034b3c58e0e435f74571215463b\"><img width=\"120px\" height=\"120px\" src=\"https://api.eu.badgr.io/public/assertions/fTuR8UBSS3WANmQM7JClhw/image\"></a><script async=\"async\" src=\"https://eu.badgr.com/assets/widgets.bundle.js\"></script></blockquote>",
			"verification_url": "https://badgecheck.io/?url=https%3A%2F%2Fapi.eu.badgr.io%2Fpublic%2Fassertions%2FfTuR8UBSS3WANmQM7JClhw?identity__url=https%3A%2F%2Fgithub.com%2FEOSC-synergy%2FinterLink.assess.sqaaas%2Fcommit%2F49d30c26d9f4b034b3c58e0e435f74571215463b&amp;identity__url=https%3A%2F%2Fgithub.com%2FEOSC-synergy%2FinterLink.assess.sqaaas%2Fcommit%2F49d30c26d9f4b034b3c58e0e435f74571215463b"
		}
	}
}