{
	"meta": {
		"version": "3.0.0",
		"report_json_url": "https://raw.githubusercontent.com/eosc-synergy/sqaaas.assess.sqaaas/master/.report/assessment_output.json"
	},
	"repository": [
		{
			"url": "https://github.com/EOSC-synergy/sqaaas",
			"name": "EOSC-synergy/sqaaas",
			"tag": "master",
			"commit_id": "ca6333efec3cfd534934473c681cf7e3f8c609cf",
			"is_main_repo": true,
			"avatar_url": "https://avatars.githubusercontent.com/u/57723286?v=4",
			"description": null,
			"languages": null,
			"topics": null,
			"stargazers_count": null,
			"watchers_count": null,
			"contributors_count": null,
			"forks_count": null,
			"badge_status": "no_badge"
		}
	],
	"report": {
		"QC.Acc": {
			"valid": true,
			"subcriteria": {
				"QC.Acc01": {
					"description": "Is the source code managed with a Version Control System?",
					"requirement_level": "MUST",
					"hint": "The source code shall be managed with Git and remain publicly available for this criterion to be successful. Please check <a href=\"https://git-scm.com/book/es/v2\" target=\"_blank\">Pro Git</a> docs about how to get started using Git tool. Guidelines provided by the most popular social coding platforms (<a href=\"https://docs.github.com/get-started\" target=\"_blank\">GitHub</a>, <a href=\"https://about.gitlab.com/get-started/\" target=\"_blank\">GitLab</a>) are also a good starting point",
					"evidence": [
						{
							"valid": true,
							"message": "Source code uses Git for version control",
							"plugin": {
								"name": "report2sqaaas-plugin-boolean",
								"version": "1.2.0"
							},
							"tool": {
								"name": "git",
								"lang": "scm",
								"version": "2.34.1",
								"docker": {
									"image": "bitnami/git:2.34.1",
									"reviewed": "2021-12-30"
								},
								"ci": {
									"name": "QC.Acc github.com/EOSC-synergy/sqaaas git",
									"status": "SUCCESS",
									"stdout_command": [
										"git rev-parse --is-inside-work-tree"
									],
									"stdout_text": "true",
									"url": "https://jenkins.eosc-synergy.eu/job/eosc-synergy-org/job/SQAaaS.assess.sqaaas/job/master/2/execution/node/34/log?consoleFull"
								},
								"level": "REQUIRED",
								"build_repo": "https://github.com/eosc-synergy/sqaaas.assess.sqaaas"
							},
							"standard": {
								"title": "A set of Common Software Quality Assurance Baseline Criteria for Research Projects",
								"version": "v4.0",
								"url": "https://github.com/indigo-dc/sqa-baseline/releases/tag/v4.0"
							},
							"data_unstructured": {}
						}
					],
					"valid": true
				}
			},
			"coverage": {
				"percentage": 100,
				"total_subcriteria": 1,
				"success_subcriteria": 1
			}
		},
		"QC.Doc": {
			"valid": false,
			"subcriteria": {
				"QC.Doc06.1": {
					"description": "Is the software scope outlined in the code repository?",
					"requirement_level": "MUST",
					"hint": "A README file presents your software to the audience interested in your software project. Several online sites simplify the task of creating the README file, such as <a href=\"https://www.makeareadme.com/\" target=\"_blank\">Make a README</a> or <a href=\"https://readme.so/\" target=\"_blank\">readme.so</a> sites. Be sure to add it to the code repository's root path",
					"evidence": [
						{
							"valid": true,
							"message": "A README file is present in the code repository",
							"plugin": {
								"name": "report2sqaaas-plugin-find_doc_files",
								"version": "1.2.0"
							},
							"tool": {
								"name": "find_doc_files.py",
								"lang": "Contribution-enabling Files",
								"version": "latest",
								"docker": {
									"dockerfile": "QC.Doc/Dockerfile",
									"reviewed": "2022-01-26"
								},
								"ci": {
									"name": "QC.Doc github.com/EOSC-synergy/sqaaas find_doc_files.py",
									"status": "SUCCESS",
									"stdout_command": [
										"find_doc_files.py --file_type all"
									],
									"stdout_text": "{\"README\": [{\"file_name\": \"README.md\", \"size\": 3822}], \"CODE_OF_CONDUCT\": [], \"CONTRIBUTING\": []}",
									"url": "https://jenkins.eosc-synergy.eu/job/eosc-synergy-org/job/SQAaaS.assess.sqaaas/job/master/2/execution/node/43/log?consoleFull"
								},
								"level": "REQUIRED",
								"build_repo": "https://github.com/eosc-synergy/sqaaas.assess.sqaaas"
							},
							"standard": {
								"title": "A set of Common Software Quality Assurance Baseline Criteria for Research Projects",
								"version": "v4.0",
								"url": "https://github.com/indigo-dc/sqa-baseline/releases/tag/v4.0"
							},
							"data_unstructured": {
								"README": [
									{
										"file_name": "README.md",
										"size": 3822
									}
								],
								"CODE_OF_CONDUCT": [],
								"CONTRIBUTING": []
							}
						}
					],
					"valid": true
				},
				"QC.Doc06.3": {
					"description": "Does the project establish a code of conduct for its participants?",
					"requirement_level": "MUST",
					"hint": "A CODE_OF_CONDUCT file sets the path for a constructive, respectful and positive atmosphere among all the contributors in your software project. Of course you can define your own, but in case you want to rely on external and widely-adopted code of conducts check out some of the most popular ones: <a href=\"https://contributor-covenant.org/\" target=\"_blank\">Contributor Covenant</a> or <a href=\"https://web.archive.org/web/20200330154000/http://citizencodeofconduct.org/\" target=\"_blank\">Citizen Code of Conduct</a>",
					"evidence": [
						{
							"valid": false,
							"message": "A CODE_OF_CONDUCT file is not present in the code repository",
							"plugin": {
								"name": "report2sqaaas-plugin-find_doc_files",
								"version": "1.2.0"
							},
							"tool": {
								"name": "find_doc_files.py",
								"lang": "Contribution-enabling Files",
								"version": "latest",
								"docker": {
									"dockerfile": "QC.Doc/Dockerfile",
									"reviewed": "2022-01-26"
								},
								"ci": {
									"name": "QC.Doc github.com/EOSC-synergy/sqaaas find_doc_files.py",
									"status": "SUCCESS",
									"stdout_command": [
										"find_doc_files.py --file_type all"
									],
									"stdout_text": "{\"README\": [{\"file_name\": \"README.md\", \"size\": 3822}], \"CODE_OF_CONDUCT\": [], \"CONTRIBUTING\": []}",
									"url": "https://jenkins.eosc-synergy.eu/job/eosc-synergy-org/job/SQAaaS.assess.sqaaas/job/master/2/execution/node/43/log?consoleFull"
								},
								"level": "REQUIRED",
								"build_repo": "https://github.com/eosc-synergy/sqaaas.assess.sqaaas"
							},
							"standard": {
								"title": "A set of Common Software Quality Assurance Baseline Criteria for Research Projects",
								"version": "v4.0",
								"url": "https://github.com/indigo-dc/sqa-baseline/releases/tag/v4.0"
							},
							"data_unstructured": {
								"README": [
									{
										"file_name": "README.md",
										"size": 3822
									}
								],
								"CODE_OF_CONDUCT": [],
								"CONTRIBUTING": []
							}
						}
					],
					"valid": false,
					"required_for_next_level_badge": true
				},
				"QC.Doc06.2": {
					"description": "Is there a clear path or guidelines on how to contribute to the code?",
					"requirement_level": "MUST",
					"hint": "A CONTRIBUTING file shall be present in the root path of the code repository describing the expected workflow to follow when adding contributions. Please check <a href=\"https://mozillascience.github.io/working-open-workshop/contributing/\" target=\"_blank\">Mozilla's guidelines</a> and <a href=\"https://github.com/github/docs/blob/main/CONTRIBUTING.md\" target=\"_blank\">GitHub's CONTRIBUTING.md example</a> to get inspired on how to write a good CONTRIBUTING file",
					"evidence": [
						{
							"valid": false,
							"message": "A CONTRIBUTING file is not present in the code repository",
							"plugin": {
								"name": "report2sqaaas-plugin-find_doc_files",
								"version": "1.2.0"
							},
							"tool": {
								"name": "find_doc_files.py",
								"lang": "Contribution-enabling Files",
								"version": "latest",
								"docker": {
									"dockerfile": "QC.Doc/Dockerfile",
									"reviewed": "2022-01-26"
								},
								"ci": {
									"name": "QC.Doc github.com/EOSC-synergy/sqaaas find_doc_files.py",
									"status": "SUCCESS",
									"stdout_command": [
										"find_doc_files.py --file_type all"
									],
									"stdout_text": "{\"README\": [{\"file_name\": \"README.md\", \"size\": 3822}], \"CODE_OF_CONDUCT\": [], \"CONTRIBUTING\": []}",
									"url": "https://jenkins.eosc-synergy.eu/job/eosc-synergy-org/job/SQAaaS.assess.sqaaas/job/master/2/execution/node/43/log?consoleFull"
								},
								"level": "REQUIRED",
								"build_repo": "https://github.com/eosc-synergy/sqaaas.assess.sqaaas"
							},
							"standard": {
								"title": "A set of Common Software Quality Assurance Baseline Criteria for Research Projects",
								"version": "v4.0",
								"url": "https://github.com/indigo-dc/sqa-baseline/releases/tag/v4.0"
							},
							"data_unstructured": {
								"README": [
									{
										"file_name": "README.md",
										"size": 3822
									}
								],
								"CODE_OF_CONDUCT": [],
								"CONTRIBUTING": []
							}
						}
					],
					"valid": false,
					"required_for_next_level_badge": true
				},
				"QC.Doc01.1": {
					"description": "Are docs managed in the same repository as code?",
					"requirement_level": "MAY",
					"hint": "This subcriterion will succeed if the documentation files exist on the same repository as the source code, e.g. under a <code>docs/</code> folder",
					"evidence": [
						{
							"valid": true,
							"message": "Documentation resides in the same repository as code",
							"plugin": {
								"name": "report2sqaaas-plugin-boolean",
								"version": "1.2.0"
							},
							"tool": {
								"name": "git",
								"lang": null,
								"version": null,
								"docker": null,
								"ci": {
									"name": "QC.Doc github.com/EOSC-synergy/sqaaas git",
									"status": "SUCCESS",
									"stdout_command": [
										"git rev-parse --is-inside-work-tree"
									],
									"stdout_text": "true",
									"url": "https://jenkins.eosc-synergy.eu/job/eosc-synergy-org/job/SQAaaS.assess.sqaaas/job/master/2/execution/node/52/log?consoleFull"
								},
								"level": "REQUIRED",
								"build_repo": "https://github.com/eosc-synergy/sqaaas.assess.sqaaas"
							},
							"standard": {
								"title": "A set of Common Software Quality Assurance Baseline Criteria for Research Projects",
								"version": "v4.0",
								"url": "https://github.com/indigo-dc/sqa-baseline/releases/tag/v4.0"
							},
							"data_unstructured": {}
						}
					],
					"valid": true
				}
			},
			"coverage": {
				"percentage": 50,
				"total_subcriteria": 4,
				"success_subcriteria": 2
			}
		},
		"QC.Ver": {
			"valid": false,
			"subcriteria": {
				"QC.Ver01.0": {
					"description": "Are tags being used for releasing software",
					"requirement_level": "MUST",
					"hint": "Git tags are a convenient way to release software. This subcriterion checks if any git tag is present in the code history. More info on it-scm.com/book/en/v2/Git-Basics-Tagging\" target=\"_blank\">git tagging</a>",
					"evidence": [
						{
							"valid": false,
							"message": "The code repository does not use tags for releasing new software versions",
							"plugin": {
								"name": "report2sqaaas-plugin-is_semver",
								"version": "1.0.0"
							},
							"tool": {
								"name": "get_git_tags.py",
								"lang": "Semantic Versioning",
								"version": "latest",
								"docker": {
									"dockerfile": "QC.Ver/Dockerfile",
									"reviewed": "2022-05-10"
								},
								"ci": {
									"name": "QC.Ver github.com/EOSC-synergy/sqaaas get_git_tags.py",
									"status": "SUCCESS",
									"stdout_command": [
										"get_git_tags.py"
									],
									"stdout_text": "[]",
									"url": "https://jenkins.eosc-synergy.eu/job/eosc-synergy-org/job/SQAaaS.assess.sqaaas/job/master/2/execution/node/70/log?consoleFull"
								},
								"level": "REQUIRED",
								"build_repo": "https://github.com/eosc-synergy/sqaaas.assess.sqaaas"
							},
							"standard": {
								"title": "A set of Common Software Quality Assurance Baseline Criteria for Research Projects",
								"version": "v4.0",
								"url": "https://github.com/indigo-dc/sqa-baseline/releases/tag/v4.0"
							},
							"data_unstructured": []
						}
					],
					"valid": false,
					"required_for_next_level_badge": false
				},
				"QC.Ver01": {
					"description": "Is the latest release compliant with Semantic Versioning (SemVer) specification?",
					"requirement_level": "SHOULD",
					"hint": "Latest tag must be compliant with <a href=\"https://semver.org\" target=\"_blank\">SemVer specification</a>",
					"evidence": [
						{
							"valid": false,
							"message": "Latest release tag None found, but is not SemVer compliant",
							"plugin": {
								"name": "report2sqaaas-plugin-is_semver",
								"version": "1.0.0"
							},
							"tool": {
								"name": "get_git_tags.py",
								"lang": "Semantic Versioning",
								"version": "latest",
								"docker": {
									"dockerfile": "QC.Ver/Dockerfile",
									"reviewed": "2022-05-10"
								},
								"ci": {
									"name": "QC.Ver github.com/EOSC-synergy/sqaaas get_git_tags.py",
									"status": "SUCCESS",
									"stdout_command": [
										"get_git_tags.py"
									],
									"stdout_text": "[]",
									"url": "https://jenkins.eosc-synergy.eu/job/eosc-synergy-org/job/SQAaaS.assess.sqaaas/job/master/2/execution/node/70/log?consoleFull"
								},
								"level": "REQUIRED",
								"build_repo": "https://github.com/eosc-synergy/sqaaas.assess.sqaaas"
							},
							"standard": {
								"title": "A set of Common Software Quality Assurance Baseline Criteria for Research Projects",
								"version": "v4.0",
								"url": "https://github.com/indigo-dc/sqa-baseline/releases/tag/v4.0"
							},
							"data_unstructured": []
						}
					],
					"valid": false,
					"required_for_next_level_badge": false
				},
				"QC.Ver02": {
					"description": "Are all release tags with Semantic Versioning (SemVer) specification?",
					"requirement_level": "SHOULD",
					"hint": "Existent release tags shall be <a href=\"https://semver.org\" target=\"_blank\">SemVer</a> compliant for this subcriterion to be successful",
					"evidence": [
						{
							"valid": true,
							"message": "All release tags are SemVer compliant",
							"plugin": {
								"name": "report2sqaaas-plugin-is_semver",
								"version": "1.0.0"
							},
							"tool": {
								"name": "get_git_tags.py",
								"lang": "Semantic Versioning",
								"version": "latest",
								"docker": {
									"dockerfile": "QC.Ver/Dockerfile",
									"reviewed": "2022-05-10"
								},
								"ci": {
									"name": "QC.Ver github.com/EOSC-synergy/sqaaas get_git_tags.py",
									"status": "SUCCESS",
									"stdout_command": [
										"get_git_tags.py"
									],
									"stdout_text": "[]",
									"url": "https://jenkins.eosc-synergy.eu/job/eosc-synergy-org/job/SQAaaS.assess.sqaaas/job/master/2/execution/node/70/log?consoleFull"
								},
								"level": "REQUIRED",
								"build_repo": "https://github.com/eosc-synergy/sqaaas.assess.sqaaas"
							},
							"standard": {
								"title": "A set of Common Software Quality Assurance Baseline Criteria for Research Projects",
								"version": "v4.0",
								"url": "https://github.com/indigo-dc/sqa-baseline/releases/tag/v4.0"
							},
							"data_unstructured": []
						}
					],
					"valid": true
				}
			},
			"coverage": {
				"percentage": 33,
				"total_subcriteria": 3,
				"success_subcriteria": 1
			}
		},
		"QC.Met": {
			"valid": false,
			"subcriteria": {
				"QC.Met01": {
					"description": "Is the software citable?",
					"valid": false,
					"hint": "The two formats for software citation supported by SQAaaS are: 1) <a href=\"https://codemeta.github.io/\" target=\"_blank\">CodeMeta</a> and 2) <a href=\"https://citation-file-format.github.io/\" target=\"_blank\">Citation File Format (CFF)</a>. While CodeMeta provides you with a more comprehensive description, CFF is a more lightweight, good-enough approach to software (with built-in support by GitHub) citation. Both provide tools (<a href=\"https://codemeta.github.io/codemeta-generator/\" target=\"_blank\">CodeMeta generator</a>, <a href=\"https://citation-file-format.github.io/cff-initializer-javascript/#/\" target=\"_blank\">CFFINIT</a>)to easily generate a working citation file. Once having the file, be sure to add it to the root path of your code repo.",
					"evidence": [
						{
							"valid": false,
							"message": "No matching files found for language <CodeMeta> in repository searching by extensions or filenames\nNo matching files found for language <Citation File Format> in repository searching by extensions or filenames"
						}
					],
					"required_for_next_level_badge": false
				}
			},
			"coverage": {
				"percentage": 0,
				"total_subcriteria": 1,
				"success_subcriteria": 0
			}
		},
		"QC.Sec": {
			"valid": false,
			"subcriteria": {
				"QC.Sec02": {
					"description": "Is the source code passing Static Analysis Security Testing (SAST)?",
					"valid": false,
					"hint": "Please check & solve the security weaknesses found by the SAST tool",
					"evidence": [
						{
							"valid": false,
							"message": "No matching files found for language <Python> in repository searching by extensions or filenames\nNo matching files found for language <Go> in repository searching by extensions or filenames"
						}
					],
					"required_for_next_level_badge": false
				}
			},
			"coverage": {
				"percentage": 0,
				"total_subcriteria": 1,
				"success_subcriteria": 0
			}
		},
		"QC.Sty": {
			"valid": false,
			"subcriteria": {
				"QC.Sty01": {
					"description": "Is the software product following a style standard for {lang_name} files?",
					"valid": false,
					"hint": "Please check & solve the security weaknesses found by the linter tool",
					"evidence": [
						{
							"valid": false,
							"message": "No matching files found for language <Dockerfile> in repository searching by extensions or filenames\nNo matching files found for language <JSON> in repository searching by extensions or filenames\nNo matching files found for language <Python> in repository searching by extensions or filenames\nNo matching files found for language <Go> in repository searching by extensions or filenames\nNo matching files found for language <Ruby> in repository searching by extensions or filenames\nNo matching files found for language <Java> in repository searching by extensions or filenames"
						}
					],
					"required_for_next_level_badge": false
				}
			},
			"coverage": {
				"percentage": 0,
				"total_subcriteria": 1,
				"success_subcriteria": 0
			}
		},
		"QC.Uni": {
			"valid": false,
			"subcriteria": {
				"QC.Uni01": {
					"description": "Are the tests passing through an automated means?",
					"valid": false,
					"hint": "Please check & solve the failing test cases found by the {tool_name} tool",
					"evidence": [
						{
							"valid": false,
							"message": "No matching files found for language <Python> in repository searching by extensions or filenames"
						}
					],
					"required_for_next_level_badge": false
				}
			},
			"coverage": {
				"percentage": 0,
				"total_subcriteria": 1,
				"success_subcriteria": 0
			}
		},
		"QC.Lic": {
			"valid": false,
			"subcriteria": {
				"QC.Lic01": {
					"description": "Is code licensed to be freely used, modified and distributed by others?",
					"valid": false,
					"hint": "<p>Your source code repository shall be distributed under an open source license for this subcriterion to pass successfully. Be sure to have a license file present in the code repository matching the name <code>LICENSE</code> with optional extensions (depending on the format used): <code>[.md|.rst|.txt]</code>.</p><p>Valid licenses are any of those approved either by the <a href=\"https://opensource.org/licenses\" target=\"_blank\">Open Source Initiative</a> and/or the Free Software Foundation <a href=\"https://www.gnu.org/licenses/license-list.html\" target=\"_blank\"></a>. You can also check the <a href=\"https://choosealicense.com/\" target=\"_blank\">choosealicense.com</a> site</p>",
					"evidence": [
						{
							"valid": false,
							"message": "Error raised when validating tool <licensee> with validator plugin <licensee>: argument should be a str or an os.PathLike object where __fspath__ returns a str, not 'NoneType'"
						}
					],
					"required_for_next_level_badge": true
				},
				"QC.Lic01.1": {
					"description": "Is LICENSE file placed in the root path of the code repository?",
					"valid": false,
					"hint": "Most social coding platforms require the license file to placed in the root path of the code repository, so it is a good practice to use this location by default. Allowed file names are <code>LICENSE</code>, <code>LICENSE.md</code>, <code>LICENSE.rst</code>, <code>LICENSE.txt</code>",
					"evidence": [
						{
							"valid": false,
							"message": "Error raised when validating tool <licensee> with validator plugin <licensee>: argument should be a str or an os.PathLike object where __fspath__ returns a str, not 'NoneType'"
						}
					],
					"required_for_next_level_badge": true
				},
				"QC.Lic02": {
					"description": "Does the code use a license approved by Open Source Initiative?",
					"valid": false,
					"hint": "The <a href=\"https://opensource.org/\" target=\"_blank\">Open Source Initiative (OSI)</a> sets out the requirements for software to be legally declared as Open Source. The license in use shall be in the list of <a href=\"https://opensource.org/license-list.html\" target=\"_blank\">OSI-approved licenses</a> for this criterion to be successful",
					"evidence": [
						{
							"valid": false,
							"message": "Error raised when validating tool <licensee> with validator plugin <licensee>: argument should be a str or an os.PathLike object where __fspath__ returns a str, not 'NoneType'"
						}
					],
					"required_for_next_level_badge": true
				},
				"QC.Lic02.1": {
					"description": "Does the code use an Open Source Initiative's popular-recognized license?",
					"valid": false,
					"hint": "The Open Source Initiative (OSI) sets out the requirements for software to be legally declared as Open Source. OSI provides a list of popular licenses that shall match most of the demands. The license in use shall be in the list of <a href=\"https://opensource.org/license-list.html\" target=\"_blank\">OSI popular licenses</a> for this criterion to be successful",
					"evidence": [
						{
							"valid": false,
							"message": "Error raised when validating tool <licensee> with validator plugin <licensee>: argument should be a str or an os.PathLike object where __fspath__ returns a str, not 'NoneType'"
						}
					],
					"required_for_next_level_badge": true
				}
			},
			"coverage": {
				"percentage": 0,
				"total_subcriteria": 4,
				"success_subcriteria": 0
			}
		}
	},
	"badge": {
		"software": {
			"criteria": {
				"bronze": {
					"to_fulfill": [
						"QC.Acc",
						"QC.Lic",
						"QC.Doc"
					],
					"missing": [
						"QC.Lic",
						"QC.Doc"
					],
					"fulfilled": [
						"QC.Acc"
					]
				},
				"silver": {
					"to_fulfill": [
						"QC.Acc",
						"QC.Doc",
						"QC.Lic",
						"QC.Ver",
						"QC.Met"
					],
					"missing": [
						"QC.Lic",
						"QC.Met",
						"QC.Ver",
						"QC.Doc"
					],
					"fulfilled": [
						"QC.Acc"
					]
				},
				"gold": {
					"to_fulfill": [
						"QC.Acc",
						"QC.Sty",
						"QC.Doc",
						"QC.Lic",
						"QC.Uni",
						"QC.Ver",
						"QC.Sec",
						"QC.Met"
					],
					"missing": [
						"QC.Sty",
						"QC.Lic",
						"QC.Uni",
						"QC.Met",
						"QC.Ver",
						"QC.Sec",
						"QC.Doc"
					],
					"fulfilled": [
						"QC.Acc"
					]
				}
			},
			"data": {}
		}
	}
}