{
	"meta": {
		"version": "3.0.0",
		"report_json_url": "https://raw.githubusercontent.com/eosc-synergy/pulsardt.assess.sqaaas/main/.report/assessment_output.json"
	},
	"repository": [
		{
			"url": "https://gitlab.com/ml-ppa/pulsardt",
			"name": "ml-ppa/pulsardt",
			"tag": "main",
			"commit_id": "96f42f0e6479153b902def239f92ae7e5e7b8494",
			"is_main_repo": true,
			"badge_status": "no_badge"
		}
	],
	"report": {
		"QC.Acc": {
			"valid": true,
			"subcriteria": {
				"QC.Acc01": {
					"description": "Is the source code managed with a Version Control System?",
					"requirement_level": "MUST",
					"hint": "The source code shall be managed with Git and remain publicly available for this criterion to be successful. Please check <a href=\"https://git-scm.com/book/es/v2\" target=\"_blank\">Pro Git</a> docs about how to get started using Git tool. Guidelines provided by the most popular social coding platforms (<a href=\"https://docs.github.com/get-started\" target=\"_blank\">GitHub</a>, <a href=\"https://about.gitlab.com/get-started/\" target=\"_blank\">GitLab</a>) are also a good starting point",
					"evidence": [
						{
							"valid": true,
							"message": "Source code uses Git for version control",
							"plugin": {
								"name": "report2sqaaas-plugin-boolean",
								"version": "1.2.0"
							},
							"tool": {
								"name": "git",
								"lang": "scm",
								"version": "2.34.1",
								"docker": {
									"image": "bitnami/git:2.34.1",
									"reviewed": "2021-12-30"
								},
								"ci": {
									"name": "QC.Acc gitlab.com/ml-ppa/pulsardt git",
									"status": "SUCCESS",
									"stdout_command": [
										"git rev-parse --is-inside-work-tree"
									],
									"stdout_text": "true",
									"url": "https://jenkins.eosc-synergy.eu/job/eosc-synergy-org/job/pulsardt.assess.sqaaas/job/main/1/execution/node/34/log?consoleFull"
								},
								"level": "REQUIRED",
								"build_repo": "https://github.com/eosc-synergy/pulsardt.assess.sqaaas"
							},
							"standard": {
								"title": "A set of Common Software Quality Assurance Baseline Criteria for Research Projects",
								"version": "v4.0",
								"url": "https://github.com/indigo-dc/sqa-baseline/releases/tag/v4.0"
							},
							"data_unstructured": {}
						}
					],
					"valid": true
				}
			},
			"coverage": {
				"percentage": 100,
				"total_subcriteria": 1,
				"success_subcriteria": 1
			}
		},
		"QC.Doc": {
			"valid": false,
			"subcriteria": {
				"QC.Doc06.1": {
					"description": "Is the software scope outlined in the code repository?",
					"requirement_level": "MUST",
					"hint": "A README file presents your software to the audience interested in your software project. Several online sites simplify the task of creating the README file, such as <a href=\"https://www.makeareadme.com/\" target=\"_blank\">Make a README</a> or <a href=\"https://readme.so/\" target=\"_blank\">readme.so</a> sites. Be sure to add it to the code repository's root path",
					"evidence": [
						{
							"valid": true,
							"message": "A README file is present in the code repository",
							"plugin": {
								"name": "report2sqaaas-plugin-find_doc_files",
								"version": "1.2.0"
							},
							"tool": {
								"name": "find_doc_files.py",
								"lang": "Contribution-enabling Files",
								"version": "latest",
								"docker": {
									"dockerfile": "QC.Doc/Dockerfile",
									"reviewed": "2022-01-26"
								},
								"ci": {
									"name": "QC.Doc gitlab.com/ml-ppa/pulsardt find_doc_files.py",
									"status": "SUCCESS",
									"stdout_command": [
										"find_doc_files.py --file_type all"
									],
									"stdout_text": "{\"README\": [{\"file_name\": \"README.md\", \"size\": 4225}], \"CODE_OF_CONDUCT\": [], \"CONTRIBUTING\": []}",
									"url": "https://jenkins.eosc-synergy.eu/job/eosc-synergy-org/job/pulsardt.assess.sqaaas/job/main/1/execution/node/43/log?consoleFull"
								},
								"level": "REQUIRED",
								"build_repo": "https://github.com/eosc-synergy/pulsardt.assess.sqaaas"
							},
							"standard": {
								"title": "A set of Common Software Quality Assurance Baseline Criteria for Research Projects",
								"version": "v4.0",
								"url": "https://github.com/indigo-dc/sqa-baseline/releases/tag/v4.0"
							},
							"data_unstructured": {
								"README": [
									{
										"file_name": "README.md",
										"size": 4225
									}
								],
								"CODE_OF_CONDUCT": [],
								"CONTRIBUTING": []
							}
						}
					],
					"valid": true
				},
				"QC.Doc06.3": {
					"description": "Does the project establish a code of conduct for its participants?",
					"requirement_level": "MUST",
					"hint": "A CODE_OF_CONDUCT file sets the path for a constructive, respectful and positive atmosphere among all the contributors in your software project. Of course you can define your own, but in case you want to rely on external and widely-adopted code of conducts check out some of the most popular ones: <a href=\"https://contributor-covenant.org/\" target=\"_blank\">Contributor Covenant</a> or <a href=\"https://web.archive.org/web/20200330154000/http://citizencodeofconduct.org/\" target=\"_blank\">Citizen Code of Conduct</a>",
					"evidence": [
						{
							"valid": false,
							"message": "A CODE_OF_CONDUCT file is not present in the code repository",
							"plugin": {
								"name": "report2sqaaas-plugin-find_doc_files",
								"version": "1.2.0"
							},
							"tool": {
								"name": "find_doc_files.py",
								"lang": "Contribution-enabling Files",
								"version": "latest",
								"docker": {
									"dockerfile": "QC.Doc/Dockerfile",
									"reviewed": "2022-01-26"
								},
								"ci": {
									"name": "QC.Doc gitlab.com/ml-ppa/pulsardt find_doc_files.py",
									"status": "SUCCESS",
									"stdout_command": [
										"find_doc_files.py --file_type all"
									],
									"stdout_text": "{\"README\": [{\"file_name\": \"README.md\", \"size\": 4225}], \"CODE_OF_CONDUCT\": [], \"CONTRIBUTING\": []}",
									"url": "https://jenkins.eosc-synergy.eu/job/eosc-synergy-org/job/pulsardt.assess.sqaaas/job/main/1/execution/node/43/log?consoleFull"
								},
								"level": "REQUIRED",
								"build_repo": "https://github.com/eosc-synergy/pulsardt.assess.sqaaas"
							},
							"standard": {
								"title": "A set of Common Software Quality Assurance Baseline Criteria for Research Projects",
								"version": "v4.0",
								"url": "https://github.com/indigo-dc/sqa-baseline/releases/tag/v4.0"
							},
							"data_unstructured": {
								"README": [
									{
										"file_name": "README.md",
										"size": 4225
									}
								],
								"CODE_OF_CONDUCT": [],
								"CONTRIBUTING": []
							}
						}
					],
					"valid": false,
					"required_for_next_level_badge": true
				},
				"QC.Doc06.2": {
					"description": "Is there a clear path or guidelines on how to contribute to the code?",
					"requirement_level": "MUST",
					"hint": "A CONTRIBUTING file shall be present in the root path of the code repository describing the expected workflow to follow when adding contributions. Please check <a href=\"https://mozillascience.github.io/working-open-workshop/contributing/\" target=\"_blank\">Mozilla's guidelines</a> and <a href=\"https://github.com/github/docs/blob/main/CONTRIBUTING.md\" target=\"_blank\">GitHub's CONTRIBUTING.md example</a> to get inspired on how to write a good CONTRIBUTING file",
					"evidence": [
						{
							"valid": false,
							"message": "A CONTRIBUTING file is not present in the code repository",
							"plugin": {
								"name": "report2sqaaas-plugin-find_doc_files",
								"version": "1.2.0"
							},
							"tool": {
								"name": "find_doc_files.py",
								"lang": "Contribution-enabling Files",
								"version": "latest",
								"docker": {
									"dockerfile": "QC.Doc/Dockerfile",
									"reviewed": "2022-01-26"
								},
								"ci": {
									"name": "QC.Doc gitlab.com/ml-ppa/pulsardt find_doc_files.py",
									"status": "SUCCESS",
									"stdout_command": [
										"find_doc_files.py --file_type all"
									],
									"stdout_text": "{\"README\": [{\"file_name\": \"README.md\", \"size\": 4225}], \"CODE_OF_CONDUCT\": [], \"CONTRIBUTING\": []}",
									"url": "https://jenkins.eosc-synergy.eu/job/eosc-synergy-org/job/pulsardt.assess.sqaaas/job/main/1/execution/node/43/log?consoleFull"
								},
								"level": "REQUIRED",
								"build_repo": "https://github.com/eosc-synergy/pulsardt.assess.sqaaas"
							},
							"standard": {
								"title": "A set of Common Software Quality Assurance Baseline Criteria for Research Projects",
								"version": "v4.0",
								"url": "https://github.com/indigo-dc/sqa-baseline/releases/tag/v4.0"
							},
							"data_unstructured": {
								"README": [
									{
										"file_name": "README.md",
										"size": 4225
									}
								],
								"CODE_OF_CONDUCT": [],
								"CONTRIBUTING": []
							}
						}
					],
					"valid": false,
					"required_for_next_level_badge": true
				},
				"QC.Doc01.1": {
					"description": "Are docs managed in the same repository as code?",
					"requirement_level": "MAY",
					"hint": "This subcriterion will succeed if the documentation files exist on the same repository as the source code, e.g. under a <code>docs/</code> folder",
					"evidence": [
						{
							"valid": true,
							"message": "Documentation resides in the same repository as code",
							"plugin": {
								"name": "report2sqaaas-plugin-boolean",
								"version": "1.2.0"
							},
							"tool": {
								"name": "git",
								"lang": null,
								"version": null,
								"docker": null,
								"ci": {
									"name": "QC.Doc gitlab.com/ml-ppa/pulsardt git",
									"status": "SUCCESS",
									"stdout_command": [
										"git rev-parse --is-inside-work-tree"
									],
									"stdout_text": "true",
									"url": "https://jenkins.eosc-synergy.eu/job/eosc-synergy-org/job/pulsardt.assess.sqaaas/job/main/1/execution/node/52/log?consoleFull"
								},
								"level": "REQUIRED",
								"build_repo": "https://github.com/eosc-synergy/pulsardt.assess.sqaaas"
							},
							"standard": {
								"title": "A set of Common Software Quality Assurance Baseline Criteria for Research Projects",
								"version": "v4.0",
								"url": "https://github.com/indigo-dc/sqa-baseline/releases/tag/v4.0"
							},
							"data_unstructured": {}
						}
					],
					"valid": true
				}
			},
			"coverage": {
				"percentage": 50,
				"total_subcriteria": 4,
				"success_subcriteria": 2
			}
		},
		"QC.Lic": {
			"valid": true,
			"subcriteria": {
				"QC.Lic01": {
					"description": "Is code licensed to be freely used, modified and distributed by others?",
					"requirement_level": "MUST",
					"hint": "<p>Your source code repository shall be distributed under an open source license for this subcriterion to pass successfully. Be sure to have a license file present in the code repository matching the name <code>LICENSE</code> with optional extensions (depending on the format used): <code>[.md|.rst|.txt]</code>.</p><p>Valid licenses are any of those approved either by the <a href=\"https://opensource.org/licenses\" target=\"_blank\">Open Source Initiative</a> and/or the Free Software Foundation <a href=\"https://www.gnu.org/licenses/license-list.html\" target=\"_blank\"></a>. You can also check the <a href=\"https://choosealicense.com/\" target=\"_blank\">choosealicense.com</a> site</p>",
					"evidence": [
						{
							"valid": true,
							"message": "An Open Source license found in the code repository: GPL-3.0",
							"plugin": {
								"name": "report2sqaaas-plugin-licensee",
								"version": "1.2.0"
							},
							"tool": {
								"name": "licensee",
								"lang": "license",
								"version": "9.15.1",
								"docker": {
									"dockerfile": "QC.Lic/licensee/Dockerfile",
									"reviewed": "2021-06-28"
								},
								"ci": {
									"name": "QC.Lic gitlab.com/ml-ppa/pulsardt licensee",
									"status": "SUCCESS",
									"stdout_command": [
										"licensee detect . --confidence 60 --json"
									],
									"stdout_text": "{\"licenses\":[{\"key\":\"gpl-3.0\",\"spdx_id\":\"GPL-3.0\",\"meta\":{\"title\":\"GNU General Public License v3.0\",\"source\":\"https://spdx.org/licenses/GPL-3.0.html\",\"description\":\"Permissions of this strong copyleft license are conditioned on making available complete source code of licensed works and modifications, which include larger works using a licensed work, under the same license. Copyright and license notices must be preserved. Contributors provide an express grant of patent rights.\",\"how\":\"Create a text file (typically named COPYING, as per GNU conventions) in the root of your source code and copy the text of the license into the file.\",\"using\":{\"Ansible\":\"https://github.com/ansible/ansible/blob/devel/COPYING\",\"Bash\":\"https://git.savannah.gnu.org/cgit/bash.git/tree/COPYING\",\"GIMP\":\"https://git.gnome.org/browse/gimp/tree/COPYING\"},\"featured\":true,\"hidden\":false,\"nickname\":\"GNU GPLv3\",\"note\":\"The Free Software Foundation recommends taking the additional step of adding a boilerplate notice to the top of each file. The boilerplate can be found at the end of the license.\"},\"url\":\"http://choosealicense.com/licenses/gpl-3.0/\",\"rules\":{\"permissions\":[{\"tag\":\"commercial-use\",\"label\":\"Commercial use\",\"description\":\"The licensed material and derivatives may be used for commercial purposes.\"},{\"tag\":\"modifications\",\"label\":\"Modification\",\"description\":\"The licensed material may be modified.\"},{\"tag\":\"distribution\",\"label\":\"Distribution\",\"description\":\"The licensed material may be distributed.\"},{\"tag\":\"patent-use\",\"label\":\"Patent use\",\"description\":\"This license provides an express grant of patent rights from contributors.\"},{\"tag\":\"private-use\",\"label\":\"Private use\",\"description\":\"The licensed material may be used and modified in private.\"}],\"conditions\":[{\"tag\":\"include-copyright\",\"label\":\"License and copyright notice\",\"description\":\"A copy of the license and copyright notice must be included with the licensed material.\"},{\"tag\":\"document-changes\",\"label\":\"State changes\",\"description\":\"Changes made to the licensed material must be documented.\"},{\"tag\":\"disclose-source\",\"label\":\"Disclose source\",\"description\":\"Source code must be made available when the licensed material is distributed.\"},{\"tag\":\"same-license\",\"label\":\"Same license\",\"description\":\"Modifications must be released under the same license when distributing the licensed material. In some cases a similar or related license may be used.\"}],\"limitations\":[{\"tag\":\"liability\",\"label\":\"Liability\",\"description\":\"This license includes a limitation of liability.\"},{\"tag\":\"warranty\",\"label\":\"Warranty\",\"description\":\"This license explicitly states that it does NOT provide any warranty.\"}]},\"fields\":[],\"other\":false,\"gpl\":true,\"lgpl\":false,\"cc\":false}],\"matched_files\":[{\"filename\":\"README.md\",\"content\":\"Free to use GNU GENERAL PUBLIC LICENSE Version 3.\",\"content_hash\":\"51c6a5c6439f1b2e030da14b0e60eb5a00df65a3\",\"content_normalized\":\"free to use gnu general public license version 3.\",\"matcher\":{\"name\":\"reference\",\"confidence\":90},\"matched_license\":\"GPL-3.0\",\"attribution\":null}]}",
									"url": "https://jenkins.eosc-synergy.eu/job/eosc-synergy-org/job/pulsardt.assess.sqaaas/job/main/1/execution/node/61/log?consoleFull"
								},
								"level": "REQUIRED",
								"build_repo": "https://github.com/eosc-synergy/pulsardt.assess.sqaaas"
							},
							"standard": {
								"title": "A set of Common Software Quality Assurance Baseline Criteria for Research Projects",
								"version": "v4.0",
								"url": "https://github.com/indigo-dc/sqa-baseline/releases/tag/v4.0"
							},
							"data_unstructured": {
								"licenses": [
									{
										"key": "gpl-3.0",
										"spdx_id": "GPL-3.0",
										"meta": {
											"title": "GNU General Public License v3.0",
											"source": "https://spdx.org/licenses/GPL-3.0.html",
											"description": "Permissions of this strong copyleft license are conditioned on making available complete source code of licensed works and modifications, which include larger works using a licensed work, under the same license. Copyright and license notices must be preserved. Contributors provide an express grant of patent rights.",
											"how": "Create a text file (typically named COPYING, as per GNU conventions) in the root of your source code and copy the text of the license into the file.",
											"using": {
												"Ansible": "https://github.com/ansible/ansible/blob/devel/COPYING",
												"Bash": "https://git.savannah.gnu.org/cgit/bash.git/tree/COPYING",
												"GIMP": "https://git.gnome.org/browse/gimp/tree/COPYING"
											},
											"featured": true,
											"hidden": false,
											"nickname": "GNU GPLv3",
											"note": "The Free Software Foundation recommends taking the additional step of adding a boilerplate notice to the top of each file. The boilerplate can be found at the end of the license."
										},
										"url": "http://choosealicense.com/licenses/gpl-3.0/",
										"rules": {
											"permissions": [
												{
													"tag": "commercial-use",
													"label": "Commercial use",
													"description": "The licensed material and derivatives may be used for commercial purposes."
												},
												{
													"tag": "modifications",
													"label": "Modification",
													"description": "The licensed material may be modified."
												},
												{
													"tag": "distribution",
													"label": "Distribution",
													"description": "The licensed material may be distributed."
												},
												{
													"tag": "patent-use",
													"label": "Patent use",
													"description": "This license provides an express grant of patent rights from contributors."
												},
												{
													"tag": "private-use",
													"label": "Private use",
													"description": "The licensed material may be used and modified in private."
												}
											],
											"conditions": [
												{
													"tag": "include-copyright",
													"label": "License and copyright notice",
													"description": "A copy of the license and copyright notice must be included with the licensed material."
												},
												{
													"tag": "document-changes",
													"label": "State changes",
													"description": "Changes made to the licensed material must be documented."
												},
												{
													"tag": "disclose-source",
													"label": "Disclose source",
													"description": "Source code must be made available when the licensed material is distributed."
												},
												{
													"tag": "same-license",
													"label": "Same license",
													"description": "Modifications must be released under the same license when distributing the licensed material. In some cases a similar or related license may be used."
												}
											],
											"limitations": [
												{
													"tag": "liability",
													"label": "Liability",
													"description": "This license includes a limitation of liability."
												},
												{
													"tag": "warranty",
													"label": "Warranty",
													"description": "This license explicitly states that it does NOT provide any warranty."
												}
											]
										},
										"fields": [],
										"other": false,
										"gpl": true,
										"lgpl": false,
										"cc": false
									}
								],
								"matched_files": [
									{
										"filename": "README.md",
										"content": "Free to use GNU GENERAL PUBLIC LICENSE Version 3.",
										"content_hash": "51c6a5c6439f1b2e030da14b0e60eb5a00df65a3",
										"content_normalized": "free to use gnu general public license version 3.",
										"matcher": {
											"name": "reference",
											"confidence": 90
										},
										"matched_license": "GPL-3.0",
										"attribution": null
									}
								]
							}
						}
					],
					"valid": true
				},
				"QC.Lic01.1": {
					"description": "Is LICENSE file placed in the root path of the code repository?",
					"requirement_level": "MUST",
					"hint": "Most social coding platforms require the license file to placed in the root path of the code repository, so it is a good practice to use this location by default. Allowed file names are <code>LICENSE</code>, <code>LICENSE.md</code>, <code>LICENSE.rst</code>, <code>LICENSE.txt</code>",
					"evidence": [
						{
							"valid": true,
							"message": "LICENSE file is visible at the root path of the code repository: README.md",
							"plugin": {
								"name": "report2sqaaas-plugin-licensee",
								"version": "1.2.0"
							},
							"tool": {
								"name": "licensee",
								"lang": "license",
								"version": "9.15.1",
								"docker": {
									"dockerfile": "QC.Lic/licensee/Dockerfile",
									"reviewed": "2021-06-28"
								},
								"ci": {
									"name": "QC.Lic gitlab.com/ml-ppa/pulsardt licensee",
									"status": "SUCCESS",
									"stdout_command": [
										"licensee detect . --confidence 60 --json"
									],
									"stdout_text": "{\"licenses\":[{\"key\":\"gpl-3.0\",\"spdx_id\":\"GPL-3.0\",\"meta\":{\"title\":\"GNU General Public License v3.0\",\"source\":\"https://spdx.org/licenses/GPL-3.0.html\",\"description\":\"Permissions of this strong copyleft license are conditioned on making available complete source code of licensed works and modifications, which include larger works using a licensed work, under the same license. Copyright and license notices must be preserved. Contributors provide an express grant of patent rights.\",\"how\":\"Create a text file (typically named COPYING, as per GNU conventions) in the root of your source code and copy the text of the license into the file.\",\"using\":{\"Ansible\":\"https://github.com/ansible/ansible/blob/devel/COPYING\",\"Bash\":\"https://git.savannah.gnu.org/cgit/bash.git/tree/COPYING\",\"GIMP\":\"https://git.gnome.org/browse/gimp/tree/COPYING\"},\"featured\":true,\"hidden\":false,\"nickname\":\"GNU GPLv3\",\"note\":\"The Free Software Foundation recommends taking the additional step of adding a boilerplate notice to the top of each file. The boilerplate can be found at the end of the license.\"},\"url\":\"http://choosealicense.com/licenses/gpl-3.0/\",\"rules\":{\"permissions\":[{\"tag\":\"commercial-use\",\"label\":\"Commercial use\",\"description\":\"The licensed material and derivatives may be used for commercial purposes.\"},{\"tag\":\"modifications\",\"label\":\"Modification\",\"description\":\"The licensed material may be modified.\"},{\"tag\":\"distribution\",\"label\":\"Distribution\",\"description\":\"The licensed material may be distributed.\"},{\"tag\":\"patent-use\",\"label\":\"Patent use\",\"description\":\"This license provides an express grant of patent rights from contributors.\"},{\"tag\":\"private-use\",\"label\":\"Private use\",\"description\":\"The licensed material may be used and modified in private.\"}],\"conditions\":[{\"tag\":\"include-copyright\",\"label\":\"License and copyright notice\",\"description\":\"A copy of the license and copyright notice must be included with the licensed material.\"},{\"tag\":\"document-changes\",\"label\":\"State changes\",\"description\":\"Changes made to the licensed material must be documented.\"},{\"tag\":\"disclose-source\",\"label\":\"Disclose source\",\"description\":\"Source code must be made available when the licensed material is distributed.\"},{\"tag\":\"same-license\",\"label\":\"Same license\",\"description\":\"Modifications must be released under the same license when distributing the licensed material. In some cases a similar or related license may be used.\"}],\"limitations\":[{\"tag\":\"liability\",\"label\":\"Liability\",\"description\":\"This license includes a limitation of liability.\"},{\"tag\":\"warranty\",\"label\":\"Warranty\",\"description\":\"This license explicitly states that it does NOT provide any warranty.\"}]},\"fields\":[],\"other\":false,\"gpl\":true,\"lgpl\":false,\"cc\":false}],\"matched_files\":[{\"filename\":\"README.md\",\"content\":\"Free to use GNU GENERAL PUBLIC LICENSE Version 3.\",\"content_hash\":\"51c6a5c6439f1b2e030da14b0e60eb5a00df65a3\",\"content_normalized\":\"free to use gnu general public license version 3.\",\"matcher\":{\"name\":\"reference\",\"confidence\":90},\"matched_license\":\"GPL-3.0\",\"attribution\":null}]}",
									"url": "https://jenkins.eosc-synergy.eu/job/eosc-synergy-org/job/pulsardt.assess.sqaaas/job/main/1/execution/node/61/log?consoleFull"
								},
								"level": "REQUIRED",
								"build_repo": "https://github.com/eosc-synergy/pulsardt.assess.sqaaas"
							},
							"standard": {
								"title": "A set of Common Software Quality Assurance Baseline Criteria for Research Projects",
								"version": "v4.0",
								"url": "https://github.com/indigo-dc/sqa-baseline/releases/tag/v4.0"
							},
							"data_unstructured": {
								"licenses": [
									{
										"key": "gpl-3.0",
										"spdx_id": "GPL-3.0",
										"meta": {
											"title": "GNU General Public License v3.0",
											"source": "https://spdx.org/licenses/GPL-3.0.html",
											"description": "Permissions of this strong copyleft license are conditioned on making available complete source code of licensed works and modifications, which include larger works using a licensed work, under the same license. Copyright and license notices must be preserved. Contributors provide an express grant of patent rights.",
											"how": "Create a text file (typically named COPYING, as per GNU conventions) in the root of your source code and copy the text of the license into the file.",
											"using": {
												"Ansible": "https://github.com/ansible/ansible/blob/devel/COPYING",
												"Bash": "https://git.savannah.gnu.org/cgit/bash.git/tree/COPYING",
												"GIMP": "https://git.gnome.org/browse/gimp/tree/COPYING"
											},
											"featured": true,
											"hidden": false,
											"nickname": "GNU GPLv3",
											"note": "The Free Software Foundation recommends taking the additional step of adding a boilerplate notice to the top of each file. The boilerplate can be found at the end of the license."
										},
										"url": "http://choosealicense.com/licenses/gpl-3.0/",
										"rules": {
											"permissions": [
												{
													"tag": "commercial-use",
													"label": "Commercial use",
													"description": "The licensed material and derivatives may be used for commercial purposes."
												},
												{
													"tag": "modifications",
													"label": "Modification",
													"description": "The licensed material may be modified."
												},
												{
													"tag": "distribution",
													"label": "Distribution",
													"description": "The licensed material may be distributed."
												},
												{
													"tag": "patent-use",
													"label": "Patent use",
													"description": "This license provides an express grant of patent rights from contributors."
												},
												{
													"tag": "private-use",
													"label": "Private use",
													"description": "The licensed material may be used and modified in private."
												}
											],
											"conditions": [
												{
													"tag": "include-copyright",
													"label": "License and copyright notice",
													"description": "A copy of the license and copyright notice must be included with the licensed material."
												},
												{
													"tag": "document-changes",
													"label": "State changes",
													"description": "Changes made to the licensed material must be documented."
												},
												{
													"tag": "disclose-source",
													"label": "Disclose source",
													"description": "Source code must be made available when the licensed material is distributed."
												},
												{
													"tag": "same-license",
													"label": "Same license",
													"description": "Modifications must be released under the same license when distributing the licensed material. In some cases a similar or related license may be used."
												}
											],
											"limitations": [
												{
													"tag": "liability",
													"label": "Liability",
													"description": "This license includes a limitation of liability."
												},
												{
													"tag": "warranty",
													"label": "Warranty",
													"description": "This license explicitly states that it does NOT provide any warranty."
												}
											]
										},
										"fields": [],
										"other": false,
										"gpl": true,
										"lgpl": false,
										"cc": false
									}
								],
								"matched_files": [
									{
										"filename": "README.md",
										"content": "Free to use GNU GENERAL PUBLIC LICENSE Version 3.",
										"content_hash": "51c6a5c6439f1b2e030da14b0e60eb5a00df65a3",
										"content_normalized": "free to use gnu general public license version 3.",
										"matcher": {
											"name": "reference",
											"confidence": 90
										},
										"matched_license": "GPL-3.0",
										"attribution": null
									}
								]
							}
						}
					],
					"valid": true
				},
				"QC.Lic02": {
					"description": "Does the code use a license approved by Open Source Initiative?",
					"requirement_level": "MUST",
					"hint": "The <a href=\"https://opensource.org/\" target=\"_blank\">Open Source Initiative (OSI)</a> sets out the requirements for software to be legally declared as Open Source. The license in use shall be in the list of <a href=\"https://opensource.org/license-list.html\" target=\"_blank\">OSI-approved licenses</a> for this criterion to be successful",
					"evidence": [
						{
							"valid": true,
							"message": "License GPL-3.0 is approved by the Open Source Initiative",
							"plugin": {
								"name": "report2sqaaas-plugin-licensee",
								"version": "1.2.0"
							},
							"tool": {
								"name": "licensee",
								"lang": "license",
								"version": "9.15.1",
								"docker": {
									"dockerfile": "QC.Lic/licensee/Dockerfile",
									"reviewed": "2021-06-28"
								},
								"ci": {
									"name": "QC.Lic gitlab.com/ml-ppa/pulsardt licensee",
									"status": "SUCCESS",
									"stdout_command": [
										"licensee detect . --confidence 60 --json"
									],
									"stdout_text": "{\"licenses\":[{\"key\":\"gpl-3.0\",\"spdx_id\":\"GPL-3.0\",\"meta\":{\"title\":\"GNU General Public License v3.0\",\"source\":\"https://spdx.org/licenses/GPL-3.0.html\",\"description\":\"Permissions of this strong copyleft license are conditioned on making available complete source code of licensed works and modifications, which include larger works using a licensed work, under the same license. Copyright and license notices must be preserved. Contributors provide an express grant of patent rights.\",\"how\":\"Create a text file (typically named COPYING, as per GNU conventions) in the root of your source code and copy the text of the license into the file.\",\"using\":{\"Ansible\":\"https://github.com/ansible/ansible/blob/devel/COPYING\",\"Bash\":\"https://git.savannah.gnu.org/cgit/bash.git/tree/COPYING\",\"GIMP\":\"https://git.gnome.org/browse/gimp/tree/COPYING\"},\"featured\":true,\"hidden\":false,\"nickname\":\"GNU GPLv3\",\"note\":\"The Free Software Foundation recommends taking the additional step of adding a boilerplate notice to the top of each file. The boilerplate can be found at the end of the license.\"},\"url\":\"http://choosealicense.com/licenses/gpl-3.0/\",\"rules\":{\"permissions\":[{\"tag\":\"commercial-use\",\"label\":\"Commercial use\",\"description\":\"The licensed material and derivatives may be used for commercial purposes.\"},{\"tag\":\"modifications\",\"label\":\"Modification\",\"description\":\"The licensed material may be modified.\"},{\"tag\":\"distribution\",\"label\":\"Distribution\",\"description\":\"The licensed material may be distributed.\"},{\"tag\":\"patent-use\",\"label\":\"Patent use\",\"description\":\"This license provides an express grant of patent rights from contributors.\"},{\"tag\":\"private-use\",\"label\":\"Private use\",\"description\":\"The licensed material may be used and modified in private.\"}],\"conditions\":[{\"tag\":\"include-copyright\",\"label\":\"License and copyright notice\",\"description\":\"A copy of the license and copyright notice must be included with the licensed material.\"},{\"tag\":\"document-changes\",\"label\":\"State changes\",\"description\":\"Changes made to the licensed material must be documented.\"},{\"tag\":\"disclose-source\",\"label\":\"Disclose source\",\"description\":\"Source code must be made available when the licensed material is distributed.\"},{\"tag\":\"same-license\",\"label\":\"Same license\",\"description\":\"Modifications must be released under the same license when distributing the licensed material. In some cases a similar or related license may be used.\"}],\"limitations\":[{\"tag\":\"liability\",\"label\":\"Liability\",\"description\":\"This license includes a limitation of liability.\"},{\"tag\":\"warranty\",\"label\":\"Warranty\",\"description\":\"This license explicitly states that it does NOT provide any warranty.\"}]},\"fields\":[],\"other\":false,\"gpl\":true,\"lgpl\":false,\"cc\":false}],\"matched_files\":[{\"filename\":\"README.md\",\"content\":\"Free to use GNU GENERAL PUBLIC LICENSE Version 3.\",\"content_hash\":\"51c6a5c6439f1b2e030da14b0e60eb5a00df65a3\",\"content_normalized\":\"free to use gnu general public license version 3.\",\"matcher\":{\"name\":\"reference\",\"confidence\":90},\"matched_license\":\"GPL-3.0\",\"attribution\":null}]}",
									"url": "https://jenkins.eosc-synergy.eu/job/eosc-synergy-org/job/pulsardt.assess.sqaaas/job/main/1/execution/node/61/log?consoleFull"
								},
								"level": "REQUIRED",
								"build_repo": "https://github.com/eosc-synergy/pulsardt.assess.sqaaas"
							},
							"standard": {
								"title": "A set of Common Software Quality Assurance Baseline Criteria for Research Projects",
								"version": "v4.0",
								"url": "https://github.com/indigo-dc/sqa-baseline/releases/tag/v4.0"
							},
							"data_unstructured": {
								"licenses": [
									{
										"key": "gpl-3.0",
										"spdx_id": "GPL-3.0",
										"meta": {
											"title": "GNU General Public License v3.0",
											"source": "https://spdx.org/licenses/GPL-3.0.html",
											"description": "Permissions of this strong copyleft license are conditioned on making available complete source code of licensed works and modifications, which include larger works using a licensed work, under the same license. Copyright and license notices must be preserved. Contributors provide an express grant of patent rights.",
											"how": "Create a text file (typically named COPYING, as per GNU conventions) in the root of your source code and copy the text of the license into the file.",
											"using": {
												"Ansible": "https://github.com/ansible/ansible/blob/devel/COPYING",
												"Bash": "https://git.savannah.gnu.org/cgit/bash.git/tree/COPYING",
												"GIMP": "https://git.gnome.org/browse/gimp/tree/COPYING"
											},
											"featured": true,
											"hidden": false,
											"nickname": "GNU GPLv3",
											"note": "The Free Software Foundation recommends taking the additional step of adding a boilerplate notice to the top of each file. The boilerplate can be found at the end of the license."
										},
										"url": "http://choosealicense.com/licenses/gpl-3.0/",
										"rules": {
											"permissions": [
												{
													"tag": "commercial-use",
													"label": "Commercial use",
													"description": "The licensed material and derivatives may be used for commercial purposes."
												},
												{
													"tag": "modifications",
													"label": "Modification",
													"description": "The licensed material may be modified."
												},
												{
													"tag": "distribution",
													"label": "Distribution",
													"description": "The licensed material may be distributed."
												},
												{
													"tag": "patent-use",
													"label": "Patent use",
													"description": "This license provides an express grant of patent rights from contributors."
												},
												{
													"tag": "private-use",
													"label": "Private use",
													"description": "The licensed material may be used and modified in private."
												}
											],
											"conditions": [
												{
													"tag": "include-copyright",
													"label": "License and copyright notice",
													"description": "A copy of the license and copyright notice must be included with the licensed material."
												},
												{
													"tag": "document-changes",
													"label": "State changes",
													"description": "Changes made to the licensed material must be documented."
												},
												{
													"tag": "disclose-source",
													"label": "Disclose source",
													"description": "Source code must be made available when the licensed material is distributed."
												},
												{
													"tag": "same-license",
													"label": "Same license",
													"description": "Modifications must be released under the same license when distributing the licensed material. In some cases a similar or related license may be used."
												}
											],
											"limitations": [
												{
													"tag": "liability",
													"label": "Liability",
													"description": "This license includes a limitation of liability."
												},
												{
													"tag": "warranty",
													"label": "Warranty",
													"description": "This license explicitly states that it does NOT provide any warranty."
												}
											]
										},
										"fields": [],
										"other": false,
										"gpl": true,
										"lgpl": false,
										"cc": false
									}
								],
								"matched_files": [
									{
										"filename": "README.md",
										"content": "Free to use GNU GENERAL PUBLIC LICENSE Version 3.",
										"content_hash": "51c6a5c6439f1b2e030da14b0e60eb5a00df65a3",
										"content_normalized": "free to use gnu general public license version 3.",
										"matcher": {
											"name": "reference",
											"confidence": 90
										},
										"matched_license": "GPL-3.0",
										"attribution": null
									}
								]
							}
						}
					],
					"valid": true
				},
				"QC.Lic02.1": {
					"description": "Does the code use an Open Source Initiative's popular-recognized license?",
					"requirement_level": "MAY",
					"hint": "The Open Source Initiative (OSI) sets out the requirements for software to be legally declared as Open Source. OSI provides a list of popular licenses that shall match most of the demands. The license in use shall be in the list of <a href=\"https://opensource.org/license-list.html\" target=\"_blank\">OSI popular licenses</a> for this criterion to be successful",
					"evidence": [
						{
							"valid": true,
							"message": "License GPL-3.0 is listed under the Open Source Initiative popular category",
							"plugin": {
								"name": "report2sqaaas-plugin-licensee",
								"version": "1.2.0"
							},
							"tool": {
								"name": "licensee",
								"lang": "license",
								"version": "9.15.1",
								"docker": {
									"dockerfile": "QC.Lic/licensee/Dockerfile",
									"reviewed": "2021-06-28"
								},
								"ci": {
									"name": "QC.Lic gitlab.com/ml-ppa/pulsardt licensee",
									"status": "SUCCESS",
									"stdout_command": [
										"licensee detect . --confidence 60 --json"
									],
									"stdout_text": "{\"licenses\":[{\"key\":\"gpl-3.0\",\"spdx_id\":\"GPL-3.0\",\"meta\":{\"title\":\"GNU General Public License v3.0\",\"source\":\"https://spdx.org/licenses/GPL-3.0.html\",\"description\":\"Permissions of this strong copyleft license are conditioned on making available complete source code of licensed works and modifications, which include larger works using a licensed work, under the same license. Copyright and license notices must be preserved. Contributors provide an express grant of patent rights.\",\"how\":\"Create a text file (typically named COPYING, as per GNU conventions) in the root of your source code and copy the text of the license into the file.\",\"using\":{\"Ansible\":\"https://github.com/ansible/ansible/blob/devel/COPYING\",\"Bash\":\"https://git.savannah.gnu.org/cgit/bash.git/tree/COPYING\",\"GIMP\":\"https://git.gnome.org/browse/gimp/tree/COPYING\"},\"featured\":true,\"hidden\":false,\"nickname\":\"GNU GPLv3\",\"note\":\"The Free Software Foundation recommends taking the additional step of adding a boilerplate notice to the top of each file. The boilerplate can be found at the end of the license.\"},\"url\":\"http://choosealicense.com/licenses/gpl-3.0/\",\"rules\":{\"permissions\":[{\"tag\":\"commercial-use\",\"label\":\"Commercial use\",\"description\":\"The licensed material and derivatives may be used for commercial purposes.\"},{\"tag\":\"modifications\",\"label\":\"Modification\",\"description\":\"The licensed material may be modified.\"},{\"tag\":\"distribution\",\"label\":\"Distribution\",\"description\":\"The licensed material may be distributed.\"},{\"tag\":\"patent-use\",\"label\":\"Patent use\",\"description\":\"This license provides an express grant of patent rights from contributors.\"},{\"tag\":\"private-use\",\"label\":\"Private use\",\"description\":\"The licensed material may be used and modified in private.\"}],\"conditions\":[{\"tag\":\"include-copyright\",\"label\":\"License and copyright notice\",\"description\":\"A copy of the license and copyright notice must be included with the licensed material.\"},{\"tag\":\"document-changes\",\"label\":\"State changes\",\"description\":\"Changes made to the licensed material must be documented.\"},{\"tag\":\"disclose-source\",\"label\":\"Disclose source\",\"description\":\"Source code must be made available when the licensed material is distributed.\"},{\"tag\":\"same-license\",\"label\":\"Same license\",\"description\":\"Modifications must be released under the same license when distributing the licensed material. In some cases a similar or related license may be used.\"}],\"limitations\":[{\"tag\":\"liability\",\"label\":\"Liability\",\"description\":\"This license includes a limitation of liability.\"},{\"tag\":\"warranty\",\"label\":\"Warranty\",\"description\":\"This license explicitly states that it does NOT provide any warranty.\"}]},\"fields\":[],\"other\":false,\"gpl\":true,\"lgpl\":false,\"cc\":false}],\"matched_files\":[{\"filename\":\"README.md\",\"content\":\"Free to use GNU GENERAL PUBLIC LICENSE Version 3.\",\"content_hash\":\"51c6a5c6439f1b2e030da14b0e60eb5a00df65a3\",\"content_normalized\":\"free to use gnu general public license version 3.\",\"matcher\":{\"name\":\"reference\",\"confidence\":90},\"matched_license\":\"GPL-3.0\",\"attribution\":null}]}",
									"url": "https://jenkins.eosc-synergy.eu/job/eosc-synergy-org/job/pulsardt.assess.sqaaas/job/main/1/execution/node/61/log?consoleFull"
								},
								"level": "REQUIRED",
								"build_repo": "https://github.com/eosc-synergy/pulsardt.assess.sqaaas"
							},
							"standard": {
								"title": "A set of Common Software Quality Assurance Baseline Criteria for Research Projects",
								"version": "v4.0",
								"url": "https://github.com/indigo-dc/sqa-baseline/releases/tag/v4.0"
							},
							"data_unstructured": {
								"licenses": [
									{
										"key": "gpl-3.0",
										"spdx_id": "GPL-3.0",
										"meta": {
											"title": "GNU General Public License v3.0",
											"source": "https://spdx.org/licenses/GPL-3.0.html",
											"description": "Permissions of this strong copyleft license are conditioned on making available complete source code of licensed works and modifications, which include larger works using a licensed work, under the same license. Copyright and license notices must be preserved. Contributors provide an express grant of patent rights.",
											"how": "Create a text file (typically named COPYING, as per GNU conventions) in the root of your source code and copy the text of the license into the file.",
											"using": {
												"Ansible": "https://github.com/ansible/ansible/blob/devel/COPYING",
												"Bash": "https://git.savannah.gnu.org/cgit/bash.git/tree/COPYING",
												"GIMP": "https://git.gnome.org/browse/gimp/tree/COPYING"
											},
											"featured": true,
											"hidden": false,
											"nickname": "GNU GPLv3",
											"note": "The Free Software Foundation recommends taking the additional step of adding a boilerplate notice to the top of each file. The boilerplate can be found at the end of the license."
										},
										"url": "http://choosealicense.com/licenses/gpl-3.0/",
										"rules": {
											"permissions": [
												{
													"tag": "commercial-use",
													"label": "Commercial use",
													"description": "The licensed material and derivatives may be used for commercial purposes."
												},
												{
													"tag": "modifications",
													"label": "Modification",
													"description": "The licensed material may be modified."
												},
												{
													"tag": "distribution",
													"label": "Distribution",
													"description": "The licensed material may be distributed."
												},
												{
													"tag": "patent-use",
													"label": "Patent use",
													"description": "This license provides an express grant of patent rights from contributors."
												},
												{
													"tag": "private-use",
													"label": "Private use",
													"description": "The licensed material may be used and modified in private."
												}
											],
											"conditions": [
												{
													"tag": "include-copyright",
													"label": "License and copyright notice",
													"description": "A copy of the license and copyright notice must be included with the licensed material."
												},
												{
													"tag": "document-changes",
													"label": "State changes",
													"description": "Changes made to the licensed material must be documented."
												},
												{
													"tag": "disclose-source",
													"label": "Disclose source",
													"description": "Source code must be made available when the licensed material is distributed."
												},
												{
													"tag": "same-license",
													"label": "Same license",
													"description": "Modifications must be released under the same license when distributing the licensed material. In some cases a similar or related license may be used."
												}
											],
											"limitations": [
												{
													"tag": "liability",
													"label": "Liability",
													"description": "This license includes a limitation of liability."
												},
												{
													"tag": "warranty",
													"label": "Warranty",
													"description": "This license explicitly states that it does NOT provide any warranty."
												}
											]
										},
										"fields": [],
										"other": false,
										"gpl": true,
										"lgpl": false,
										"cc": false
									}
								],
								"matched_files": [
									{
										"filename": "README.md",
										"content": "Free to use GNU GENERAL PUBLIC LICENSE Version 3.",
										"content_hash": "51c6a5c6439f1b2e030da14b0e60eb5a00df65a3",
										"content_normalized": "free to use gnu general public license version 3.",
										"matcher": {
											"name": "reference",
											"confidence": 90
										},
										"matched_license": "GPL-3.0",
										"attribution": null
									}
								]
							}
						}
					],
					"valid": true
				}
			},
			"coverage": {
				"percentage": 100,
				"total_subcriteria": 4,
				"success_subcriteria": 4
			}
		},
		"QC.Ver": {
			"valid": false,
			"subcriteria": {
				"QC.Ver01.0": {
					"description": "Are tags being used for releasing software",
					"requirement_level": "MUST",
					"hint": "Git tags are a convenient way to release software. This subcriterion checks if any git tag is present in the code history. More info on it-scm.com/book/en/v2/Git-Basics-Tagging\" target=\"_blank\">git tagging</a>",
					"evidence": [
						{
							"valid": false,
							"message": "The code repository does not use tags for releasing new software versions",
							"plugin": {
								"name": "report2sqaaas-plugin-is_semver",
								"version": "1.0.0"
							},
							"tool": {
								"name": "get_git_tags.py",
								"lang": "Semantic Versioning",
								"version": "latest",
								"docker": {
									"dockerfile": "QC.Ver/Dockerfile",
									"reviewed": "2022-05-10"
								},
								"ci": {
									"name": "QC.Ver gitlab.com/ml-ppa/pulsardt get_git_tags.py",
									"status": "SUCCESS",
									"stdout_command": [
										"get_git_tags.py"
									],
									"stdout_text": "[]",
									"url": "https://jenkins.eosc-synergy.eu/job/eosc-synergy-org/job/pulsardt.assess.sqaaas/job/main/1/execution/node/70/log?consoleFull"
								},
								"level": "REQUIRED",
								"build_repo": "https://github.com/eosc-synergy/pulsardt.assess.sqaaas"
							},
							"standard": {
								"title": "A set of Common Software Quality Assurance Baseline Criteria for Research Projects",
								"version": "v4.0",
								"url": "https://github.com/indigo-dc/sqa-baseline/releases/tag/v4.0"
							},
							"data_unstructured": []
						}
					],
					"valid": false,
					"required_for_next_level_badge": false
				},
				"QC.Ver01": {
					"description": "Is the latest release compliant with Semantic Versioning (SemVer) specification?",
					"requirement_level": "SHOULD",
					"hint": "Latest tag must be compliant with <a href=\"https://semver.org\" target=\"_blank\">SemVer specification</a>",
					"evidence": [
						{
							"valid": false,
							"message": "Latest release tag None found, but is not SemVer compliant",
							"plugin": {
								"name": "report2sqaaas-plugin-is_semver",
								"version": "1.0.0"
							},
							"tool": {
								"name": "get_git_tags.py",
								"lang": "Semantic Versioning",
								"version": "latest",
								"docker": {
									"dockerfile": "QC.Ver/Dockerfile",
									"reviewed": "2022-05-10"
								},
								"ci": {
									"name": "QC.Ver gitlab.com/ml-ppa/pulsardt get_git_tags.py",
									"status": "SUCCESS",
									"stdout_command": [
										"get_git_tags.py"
									],
									"stdout_text": "[]",
									"url": "https://jenkins.eosc-synergy.eu/job/eosc-synergy-org/job/pulsardt.assess.sqaaas/job/main/1/execution/node/70/log?consoleFull"
								},
								"level": "REQUIRED",
								"build_repo": "https://github.com/eosc-synergy/pulsardt.assess.sqaaas"
							},
							"standard": {
								"title": "A set of Common Software Quality Assurance Baseline Criteria for Research Projects",
								"version": "v4.0",
								"url": "https://github.com/indigo-dc/sqa-baseline/releases/tag/v4.0"
							},
							"data_unstructured": []
						}
					],
					"valid": false,
					"required_for_next_level_badge": false
				},
				"QC.Ver02": {
					"description": "Are all release tags with Semantic Versioning (SemVer) specification?",
					"requirement_level": "SHOULD",
					"hint": "Existent release tags shall be <a href=\"https://semver.org\" target=\"_blank\">SemVer</a> compliant for this subcriterion to be successful",
					"evidence": [
						{
							"valid": true,
							"message": "All release tags are SemVer compliant",
							"plugin": {
								"name": "report2sqaaas-plugin-is_semver",
								"version": "1.0.0"
							},
							"tool": {
								"name": "get_git_tags.py",
								"lang": "Semantic Versioning",
								"version": "latest",
								"docker": {
									"dockerfile": "QC.Ver/Dockerfile",
									"reviewed": "2022-05-10"
								},
								"ci": {
									"name": "QC.Ver gitlab.com/ml-ppa/pulsardt get_git_tags.py",
									"status": "SUCCESS",
									"stdout_command": [
										"get_git_tags.py"
									],
									"stdout_text": "[]",
									"url": "https://jenkins.eosc-synergy.eu/job/eosc-synergy-org/job/pulsardt.assess.sqaaas/job/main/1/execution/node/70/log?consoleFull"
								},
								"level": "REQUIRED",
								"build_repo": "https://github.com/eosc-synergy/pulsardt.assess.sqaaas"
							},
							"standard": {
								"title": "A set of Common Software Quality Assurance Baseline Criteria for Research Projects",
								"version": "v4.0",
								"url": "https://github.com/indigo-dc/sqa-baseline/releases/tag/v4.0"
							},
							"data_unstructured": []
						}
					],
					"valid": true
				}
			},
			"coverage": {
				"percentage": 33,
				"total_subcriteria": 3,
				"success_subcriteria": 1
			}
		},
		"QC.Met": {
			"valid": false,
			"subcriteria": {
				"QC.Met01": {
					"description": "Is the software citable?",
					"valid": false,
					"hint": "The two formats for software citation supported by SQAaaS are: 1) <a href=\"https://codemeta.github.io/\" target=\"_blank\">CodeMeta</a> and 2) <a href=\"https://citation-file-format.github.io/\" target=\"_blank\">Citation File Format (CFF)</a>. While CodeMeta provides you with a more comprehensive description, CFF is a more lightweight, good-enough approach to software (with built-in support by GitHub) citation. Both provide tools (<a href=\"https://codemeta.github.io/codemeta-generator/\" target=\"_blank\">CodeMeta generator</a>, <a href=\"https://citation-file-format.github.io/cff-initializer-javascript/#/\" target=\"_blank\">CFFINIT</a>)to easily generate a working citation file. Once having the file, be sure to add it to the root path of your code repo.",
					"evidence": [
						{
							"valid": false,
							"message": "No matching files found for language <CodeMeta> in repository searching by extensions or filenames\nNo matching files found for language <Citation File Format> in repository searching by extensions or filenames"
						}
					],
					"required_for_next_level_badge": false
				}
			},
			"coverage": {
				"percentage": 0,
				"total_subcriteria": 1,
				"success_subcriteria": 0
			}
		},
		"QC.Sec": {
			"valid": false,
			"subcriteria": {
				"QC.Sec02": {
					"description": "Is the source code passing Static Analysis Security Testing (SAST)?",
					"valid": false,
					"hint": "Please check & solve the security weaknesses found by the SAST tool",
					"evidence": [
						{
							"valid": false,
							"message": "No matching files found for language <Python> in repository searching by extensions or filenames\nNo matching files found for language <Go> in repository searching by extensions or filenames"
						}
					],
					"required_for_next_level_badge": false
				}
			},
			"coverage": {
				"percentage": 0,
				"total_subcriteria": 1,
				"success_subcriteria": 0
			}
		},
		"QC.Sty": {
			"valid": false,
			"subcriteria": {
				"QC.Sty01": {
					"description": "Is the software product following a style standard for {lang_name} files?",
					"valid": false,
					"hint": "Please check & solve the security weaknesses found by the linter tool",
					"evidence": [
						{
							"valid": false,
							"message": "No matching files found for language <Dockerfile> in repository searching by extensions or filenames\nNo matching files found for language <JSON> in repository searching by extensions or filenames\nNo matching files found for language <Python> in repository searching by extensions or filenames\nNo matching files found for language <Go> in repository searching by extensions or filenames\nNo matching files found for language <Ruby> in repository searching by extensions or filenames\nNo matching files found for language <Java> in repository searching by extensions or filenames"
						}
					],
					"required_for_next_level_badge": false
				}
			},
			"coverage": {
				"percentage": 0,
				"total_subcriteria": 1,
				"success_subcriteria": 0
			}
		},
		"QC.Uni": {
			"valid": false,
			"subcriteria": {
				"QC.Uni01": {
					"description": "Are the tests passing through an automated means?",
					"valid": false,
					"hint": "Please check & solve the failing test cases found by the {tool_name} tool",
					"evidence": [
						{
							"valid": false,
							"message": "No matching files found for language <Python> in repository searching by extensions or filenames"
						}
					],
					"required_for_next_level_badge": false
				}
			},
			"coverage": {
				"percentage": 0,
				"total_subcriteria": 1,
				"success_subcriteria": 0
			}
		}
	},
	"badge": {
		"software": {
			"criteria": {
				"bronze": {
					"to_fulfill": [
						"QC.Lic",
						"QC.Doc",
						"QC.Acc"
					],
					"missing": [
						"QC.Doc"
					],
					"fulfilled": [
						"QC.Lic",
						"QC.Acc"
					]
				},
				"silver": {
					"to_fulfill": [
						"QC.Ver",
						"QC.Met",
						"QC.Lic",
						"QC.Doc",
						"QC.Acc"
					],
					"missing": [
						"QC.Ver",
						"QC.Met",
						"QC.Doc"
					],
					"fulfilled": [
						"QC.Lic",
						"QC.Acc"
					]
				},
				"gold": {
					"to_fulfill": [
						"QC.Ver",
						"QC.Uni",
						"QC.Met",
						"QC.Lic",
						"QC.Doc",
						"QC.Acc",
						"QC.Sec",
						"QC.Sty"
					],
					"missing": [
						"QC.Ver",
						"QC.Uni",
						"QC.Met",
						"QC.Doc",
						"QC.Sty",
						"QC.Sec"
					],
					"fulfilled": [
						"QC.Lic",
						"QC.Acc"
					]
				}
			},
			"data": {}
		}
	}
}