smoking?,lung_cancer?,bronchitis?,visit_to_Asia?,tuberculosis?,tuberculos_or_cancer?,dyspnoea?,positive_XraY?
0,0,0,1,1,0,0,0
1,1,0,1,1,1,0,1
1,1,1,1,1,1,1,1
1,1,0,1,1,1,0,N/A
0,1,0,1,1,1,1,1
1,1,1,1,1,1,1,1
1,1,1,1,1,1,0,1
1,1,0,1,1,1,0,1
1,1,1,1,1,1,1,1
1,1,1,1,1,1,1,1
1,1,1,1,0,0,0,0
0,1,1,1,1,1,1,1
1,1,0,1,1,1,1,1
0,1,1,1,1,1,1,1
0,1,1,1,1,1,1,1
0,1,1,1,1,1,1,1
1,1,0,1,1,1,0,1
0,0,0,1,1,0,0,0
1,1,1,1,1,1,1,0
1,1,0,1,1,1,1,1
