{
  "1885233650": [
    {
      "label": "Naturelle",
      "anim": "mood_normal_1",
      "lib": "facials@gen_male@base",
      "category": "Etat"
    },
    {
      "label": "Souriante",
      "anim": "mood_smug_1",
      "lib": "facials@gen_male@base",
      "category": "Etat"
    },
    {
      "label": "Stressée",
      "anim": "mood_stressed_1",
      "lib": "facials@gen_male@base",
      "category": "Etat"
    },
    {
      "label": "Concentrée",
      "anim": "mood_drivefast_1",
      "lib": "facials@gen_male@base",
      "category": "Etat"
    },
    {
      "label": "Parachute",
      "anim": "mood_skydive_1",
      "lib": "facials@gen_male@base",
      "category": "Action"
    },
    {
      "label": "Enervée",
      "anim": "mood_angry_1",
      "lib": "facials@gen_male@base",
      "category": "Etat"
    },
    {
      "label": "Alcoolisé",
      "anim": "mood_drunk_1",
      "lib": "facials@gen_male@base",
      "category": "Etat"
    },
    {
      "label": "Joyeuse",
      "anim": "mood_happy_1",
      "lib": "facials@gen_male@base",
      "category": "Etat"
    },
    {
      "label": "Boudeuse",
      "anim": "mood_sulk_1",
      "lib": "facials@gen_male@base",
      "category": "Etat"
    },
    {
      "label": "Focus",
      "anim": "mood_aiming_1",
      "lib": "facials@gen_male@base",
      "category": "Etat"
    },
    {
      "label": "Choquée",
      "anim": "shocked_1",
      "lib": "facials@gen_male@base",
      "category": "Etat"
    },
    {
      "label": "Fermer les yeux",
      "anim": "mood_sleeping_1",
      "lib": "facials@gen_male@base",
      "category": "Action"
    },
    {
      "label": "Ko",
      "anim": "mood_knockout_1",
      "lib": "facials@gen_male@base",
      "category": "Etat"
    },
    {
      "label": "Blessée",
      "anim": "mood_injured_1",
      "lib": "facials@gen_male@base",
      "category": "Etat"
    },
    {
      "label": "Simuler la mort",
      "anim": "dead_1",
      "lib": "facials@gen_male@base",
      "category": "Etat"
    },
    {
      "label": "Proche du coma",
      "anim": "pain_3",
      "lib": "facials@gen_male@base",
      "category": "Etat"
    },
    {
      "label": "Souffrir intensément",
      "anim": "pain_2",
      "lib": "facials@gen_male@base",
      "category": "Etat"
    },
    {
      "label": "Effort",
      "anim": "effort_1",
      "lib": "facials@gen_male@base",
      "category": "Action"
    },
    {
      "label": "Effort intense",
      "anim": "effort_2",
      "lib": "facials@gen_male@base",
      "category": "Action"
    },
    {
      "label": "Tout donner",
      "anim": "effort_3",
      "lib": "facials@gen_male@base",
      "category": "Action"
    },
    {
      "label": "Faire du sport",
      "anim": "melee_effort_1",
      "lib": "facials@gen_male@base",
      "category": "Action"
    },
    {
      "label": "Sport intense",
      "anim": "melee_effort_2",
      "lib": "facials@gen_male@base",
      "category": "Action"
    },
    {
      "label": "Sport tout donner",
      "anim": "melee_effort_3",
      "lib": "facials@gen_male@base",
      "category": "Action"
    },
    {
      "label": "Désillusion",
      "anim": "pain_5",
      "lib": "facials@gen_male@base",
      "category": "Etat"
    },
    {
      "label": "Mal aux dents",
      "anim": "burning_1",
      "lib": "facials@gen_male@base",
      "category": "Action"
    },
    {
      "label": "Electrocutée",
      "anim": "electrocuted_1",
      "lib": "facials@gen_male@base",
      "category": "Action"
    },
    {
      "label": "Mastiquer",
      "anim": "eating_1",
      "lib": "facials@gen_male@base",
      "category": "Action"
    },
    {
      "label": "Boire",
      "anim": "drinking_1",
      "lib": "facials@gen_male@base",
      "category": "Action"
    },
    {
      "label": "Inhaler",
      "anim": "smoking_inhale_1",
      "lib": "facials@gen_male@base",
      "category": "Action"
    },
    {
      "label": "Cracher la fumée",
      "anim": "smoking_exhale_1",
      "lib": "facials@gen_male@base",
      "category": "Action"
    },
    {
      "label": "Tousser",
      "anim": "coughing_1",
      "lib": "facials@gen_male@base",
      "category": "Action"
    }
  ],
  "2627665880": [
    {
      "label": "Naturelle",
      "anim": "mood_normal_1",
      "lib": "facials@gen_female@base",
      "category": "Etat"
    },
    {
      "label": "Souriante",
      "anim": "mood_smug_1",
      "lib": "facials@gen_female@base",
      "category": "Etat"
    },
    {
      "label": "Stressée",
      "anim": "mood_stressed_1",
      "lib": "facials@gen_female@base",
      "category": "Etat"
    },
    {
      "label": "Concentrée",
      "anim": "mood_drivefast_1",
      "lib": "facials@gen_female@base",
      "category": "Etat"
    },
    {
      "label": "Parachute",
      "anim": "mood_skydive_1",
      "lib": "facials@gen_female@base",
      "category": "Action"
    },
    {
      "label": "Enervée",
      "anim": "mood_angry_1",
      "lib": "facials@gen_female@base",
      "category": "Etat"
    },
    {
      "label": "Alcoolisé",
      "anim": "mood_drunk_1",
      "lib": "facials@gen_female@base",
      "category": "Etat"
    },
    {
      "label": "Joyeuse",
      "anim": "mood_happy_1",
      "lib": "facials@gen_female@base",
      "category": "Etat"
    },
    {
      "label": "Boudeuse",
      "anim": "mood_sulk_1",
      "lib": "facials@gen_female@base",
      "category": "Etat"
    },
    {
      "label": "Focus",
      "anim": "mood_aiming_1",
      "lib": "facials@gen_female@base",
      "category": "Etat"
    },
    {
      "label": "Choquée",
      "anim": "shocked_1",
      "lib": "facials@gen_female@base",
      "category": "Etat"
    },
    {
      "label": "Fermer les yeux",
      "anim": "mood_sleeping_1",
      "lib": "facials@gen_female@base",
      "category": "Action"
    },
    {
      "label": "Ko",
      "anim": "mood_knockout_1",
      "lib": "facials@gen_female@base",
      "category": "Etat"
    },
    {
      "label": "Blessée",
      "anim": "mood_injured_1",
      "lib": "facials@gen_female@base",
      "category": "Etat"
    },
    {
      "label": "Simuler la mort",
      "anim": "dead_1",
      "lib": "facials@gen_female@base",
      "category": "Etat"
    },
    {
      "label": "Proche du coma",
      "anim": "pain_1",
      "lib": "facials@gen_female@base",
      "category": "Etat"
    },
    {
      "label": "Souffrir intensément",
      "anim": "pain_2",
      "lib": "facials@gen_female@base",
      "category": "Etat"
    },
    {
      "label": "Effort",
      "anim": "effort_1",
      "lib": "facials@gen_female@base",
      "category": "Action"
    },
    {
      "label": "Effort intense",
      "anim": "effort_2",
      "lib": "facials@gen_female@base",
      "category": "Action"
    },
    {
      "label": "Tout donner",
      "anim": "effort_3",
      "lib": "facials@gen_female@base",
      "category": "Action"
    },
    {
      "label": "Faire du sport",
      "anim": "melee_effort_1",
      "lib": "facials@gen_female@base",
      "category": "Action"
    },
    {
      "label": "Sport intense",
      "anim": "melee_effort_2",
      "lib": "facials@gen_female@base",
      "category": "Action"
    },
    {
      "label": "Sport tout donner",
      "anim": "melee_effort_3",
      "lib": "facials@gen_female@base",
      "category": "Action"
    },
    {
      "label": "Désillusion",
      "anim": "pain_5",
      "lib": "facials@gen_female@base",
      "category": "Etat"
    },
    {
      "label": "Mal aux dents",
      "anim": "burning_1",
      "lib": "facials@gen_female@base",
      "category": "Action"
    },
    {
      "label": "Electrocutée",
      "anim": "electrocuted_1",
      "lib": "facials@gen_female@base",
      "category": "Action"
    },
    {
      "label": "Mastiquer",
      "anim": "eating_1",
      "lib": "facials@gen_female@base",
      "category": "Action"
    },
    {
      "label": "Boire",
      "anim": "drinking_1",
      "lib": "facials@gen_female@base",
      "category": "Action"
    },
    {
      "label": "Inhaler",
      "anim": "smoking_inhale_1",
      "lib": "facials@gen_female@base",
      "category": "Action"
    },
    {
      "label": "Cracher la fumée",
      "anim": "smoking_exhale_1",
      "lib": "facials@gen_female@base",
      "category": "Action"
    },
    {
      "label": "Tousser",
      "anim": "coughing_1",
      "lib": "facials@gen_female@base",
      "category": "Action"
    }
  ]
}
