<HTML><HEAD>
<style TYPE="text/css">
<!--
.main { margin-top: -18px; }
body {scrollbar-face-color: #898532; scrollbar-shadow-color: #797522; scrollbar-highlight-color: #999542;
scrollbar-3dlight-color: #A9A552; scrollbar-darkshadow-color: #696512; scrollbar-track-color: #76732B;
scrollbar-arrow-color: #403F18}
-->
</STYLE>
</HEAD>
<BODY BACKGROUND = "mbback.bmp" BGCOLOR="#898532" TEXT="#403F18" LINK="#403F18" ALINK="#403F18" VLINK="#403F18">
<TABLE HEIGHT="100%" WIDTH="100%"><TR><TD ALIGN="left" VALIGN="top"><FONT FACE="dungeon, bankgothic lt bt">
<H3>Wa2 Metal<BR><SMALL><SMALL>
A Skin Made By <A HREF="mailto:riksruin@yahoo.com">--Rikki--</A></SMALL></SMALL>
</H4></FONT></TD></TR><TR><TD ALIGN="right" VALIGN="bottom"><FONT FACE="dungeon, bankgothic lt bt">
<ADDRESS><SMALL>
<A HREF="http://www.angelfire.com/goth/riksruin">See My Other Skins</A>
</SMALL></ADDRESS>
</FONT></TD></TR></TABLE>
</BODY></HTML>