163,173,113
163,173,113
183,190,144
186,193,148
188,196,152
191,198,157
194,201,161
197,203,166
200,206,170
203,208,175
206,211,179
209,214,184
211,216,188
214,219,192
217,221,197
220,224,201
223,226,206
226,229,210
255,255,255
223,226,206
211,216,188
206,211,179
194,201,161
