236,239,245	// 0 = black (background color #1)
236,239,245	// 1 = grey (background color #2)
236,239,245	// 2
140,143,150	// 3
227,230,236	// 4
140,143,150	// 5
227,230,236	// 6
140,143,150	// 7
227,230,236	// 8
140,143,150	// 9
227,230,236	// 10 = mid of spec
140,143,150	// 11
227,230,236	// 12
140,143,150	// 13
227,230,236	// 14
140,143,150	// 15
227,230,236	// 16
140,143,150	// 17 = bottom of spec
99,102,107	// 18 = osc 1 (brightest)
99,102,107	// 19 = osc 2
99,102,107	// 20 = osc 3
99,102,107	// 21 = osc 4
99,102,107	// 22 = osc 5 (dimmest)
