8,9,39
3,46,88
166,209,252
155,196,236
144,182,220
133,168,204
122,154,187
111,140,170
100,126,153
89,112,136
78,98,119
67,84,102
56,70,85
45,56,68
34,42,51
78,97,118
122,153,185
166,209,252
166,209,252
166,209,252
166,209,252
166,209,252
166,209,252
//Created by Skin Master
