normal
0,0, 17,0, 190,8, 245,0, 275,0, 274,50, 270,48, 265,46, 260,44, 250, 42, 230,40, 130,40, 140,53, 110,51, 100,60, 14,65, 10,63, 8,60 - top bar


eq
23,39, 32,39, 32,99, 23,99 - preamp
80,39, 89,39, 89,99, 80,99 - 60hz
98,39, 107,39, 107,99, 98,99 - 170hz
116,39, 125,39, 125,99, 116,99 - 310hz
134,39, 143,39, 143,99, 134,99 - 600hz
152,39, 161,39, 161,99, 152,99 - 1khz
170,39, 179,39, 179,99, 170,99 - 3khz
188,39, 197,39, 197,99, 188,99 - 6khz
206,39, 215,39, 215,99, 206,99 - 12khz
224,39, 233,39, 233,99, 224,99 - 14khz
242,39, 251,39, 251,99, 242,99 - 16khz
164,40, 211,44, 229,47, 250,55, 257,62, 260,70, 260,75, 257,81, 253,85, 243,90, 235,92, 220,93, 190,95, 160,96, 127,95, - elipse right
113,95, 95,90, 80,85, 70,80, 63,76, 59,73, 53,65, 52,60, 53,55, 56,50, 62,46, 70,43, 85,41, 100,40, 115,40, 151,42, - elipse left
77,90, 13,95, 15,90, 17,80, 18,70, 19,60, 25,50, 40,44, 40,44, 65,41, 55,45, 49,50, 47,55, 46,60, 47,65, 50,70, 55,75, 60,79 - preamp wave
20,115, 15,100, 75,95, 80,95, 80,90, 100,96, 113,98, 127,100, 160,101, 190,100, 220,99, 235,98, 243,96, 253,91, 260,86, 257,110 - bottom bar
14,10, 230,16, 258,0, 275,0, 275,13, 263,60, 255,52, 240,45, 230, 43, 220,40, 200,37, 180,35, 150,35, 90,36, 60,37, 55,37, 40,40, 30,43, 23,47, 14,60, 10,70 - top bar