74,0,9
74,0,9
74,0,9
255,255,255
74,0,9
255,255,255
74,0,9
255,255,255
74,0,9
255,255,255
74,0,9
255,255,255
74,0,9
255,255,255
74,0,9
255,255,255
74,0,9
255,255,255
255,255,255
255,255,255
255,255,255
255,255,255
255,255,255
255,255,255
