88,88,0,
156,129,0,
88,88,0,
241,125,2,
88,88,0,
241,125,2,
88,88,0,
241,125,2,
88,88,0,
241,125,2,
88,88,0,
241,125,2,
88,88,0,
241,125,2,
88,88,0,
241,125,2,
88,88,0,
241,125,2,
241,125,2,
241,125,2,
241,125,2,
241,125,2,
241,125,2,
255,175,52,


This file modified by Winamp Vis Toolkit
by Andrew Mackowski
http://home.pacbell.net/mackowsk