<?xml version="1.0" encoding="UTF-8" standalone="no"?>
<!-- Created with Inkscape (http://www.inkscape.org/) -->

<svg
   xmlns:osb="http://www.openswatchbook.org/uri/2009/osb"
   xmlns:dc="http://purl.org/dc/elements/1.1/"
   xmlns:cc="http://creativecommons.org/ns#"
   xmlns:rdf="http://www.w3.org/1999/02/22-rdf-syntax-ns#"
   xmlns:svg="http://www.w3.org/2000/svg"
   xmlns="http://www.w3.org/2000/svg"
   xmlns:xlink="http://www.w3.org/1999/xlink"
   xmlns:sodipodi="http://sodipodi.sourceforge.net/DTD/sodipodi-0.dtd"
   xmlns:inkscape="http://www.inkscape.org/namespaces/inkscape"
   id="svg3642"
   viewBox="0 0 164.01848 82.350335"
   version="1.0"
   height="82.350334"
   width="164.01848"
   inkscape:version="0.92.2 (5c3e80d, 2017-08-06)"
   sodipodi:docname="tooltip.svg">
  <sodipodi:namedview
     inkscape:showpageshadow="false"
     inkscape:pagecheckerboard="true"
     inkscape:window-maximized="0"
     inkscape:window-y="0"
     inkscape:window-x="0"
     pagecolor="#ffffff"
     bordercolor="#666666"
     borderopacity="1"
     objecttolerance="10"
     gridtolerance="10"
     guidetolerance="10"
     inkscape:pageopacity="0"
     inkscape:pageshadow="2"
     inkscape:window-width="1362"
     inkscape:window-height="695"
     id="namedview36"
     showgrid="false"
     inkscape:zoom="5.8370415"
     inkscape:cx="2.1374283"
     inkscape:cy="40.494393"
     inkscape:current-layer="svg3642"
     fit-margin-top="5"
     fit-margin-left="5"
     fit-margin-right="5"
     fit-margin-bottom="5"
     showguides="true"
     inkscape:guide-bbox="true"
     inkscape:snap-others="false" />
  <defs
     id="defs3644">
    <linearGradient
       id="border-3"
       osb:paint="solid">
      <stop
         style="stop-color:#000000;stop-opacity:0.627451;"
         offset="0"
         id="stop1657" />
    </linearGradient>
    <linearGradient
       osb:paint="solid"
       id="linearGradient852">
      <stop
         id="stop850"
         offset="0"
         style="stop-color:#3f41df;stop-opacity:1;" />
    </linearGradient>
    <linearGradient
       osb:paint="solid"
       id="North_Panel">
      <stop
         id="stop844"
         offset="0"
         style="stop-color:#d31212;stop-opacity:0.80392158;" />
    </linearGradient>
    <linearGradient
       inkscape:collect="always"
       xlink:href="#linearGradient852"
       id="linearGradient1825"
       gradientUnits="userSpaceOnUse"
       gradientTransform="matrix(0.04166667,0,0,20,121.62609,-215.00003)"
       x1="3.5"
       y1="11.5"
       x2="51.5"
       y2="11.5" />
    <linearGradient
       inkscape:collect="always"
       xlink:href="#linearGradient852"
       id="linearGradient1829"
       gradientUnits="userSpaceOnUse"
       gradientTransform="matrix(0.04166667,0,0,20,121.0168,-162.6497)"
       x1="3.5"
       y1="11.5"
       x2="51.5"
       y2="11.5" />
    <linearGradient
       inkscape:collect="always"
       xlink:href="#linearGradient852"
       id="linearGradient1833"
       gradientUnits="userSpaceOnUse"
       gradientTransform="matrix(0.41666671,0,0,2,137.56017,18.229441)"
       x1="3.5"
       y1="11.5"
       x2="51.5"
       y2="11.5" />
    <linearGradient
       inkscape:collect="always"
       xlink:href="#linearGradient852"
       id="linearGradient1837"
       gradientUnits="userSpaceOnUse"
       gradientTransform="matrix(0.41666671,0,0,2,85.021934,18.139632)"
       x1="3.5"
       y1="11.5"
       x2="51.5"
       y2="11.5" />
    <linearGradient
       inkscape:collect="always"
       xlink:href="#linearGradient852"
       id="linearGradient2472"
       gradientUnits="userSpaceOnUse"
       gradientTransform="matrix(0.04166667,0,0,8,39.989989,344.07829)"
       x1="12"
       y1="-52"
       x2="60"
       y2="-52" />
    <linearGradient
       inkscape:collect="always"
       xlink:href="#linearGradient852"
       id="linearGradient2476"
       gradientUnits="userSpaceOnUse"
       gradientTransform="matrix(0.04166667,0,0,8,43.717131,368.24391)"
       x1="12"
       y1="-52"
       x2="60"
       y2="-52" />
    <linearGradient
       inkscape:collect="always"
       xlink:href="#linearGradient852"
       id="linearGradient2480"
       gradientUnits="userSpaceOnUse"
       gradientTransform="matrix(0.16666668,0,0,2,24.458052,45.478385)"
       x1="12"
       y1="-52"
       x2="60"
       y2="-52" />
    <linearGradient
       inkscape:collect="always"
       xlink:href="#linearGradient852"
       id="linearGradient2484"
       gradientUnits="userSpaceOnUse"
       gradientTransform="matrix(0.16666668,0,0,2,48.774467,42.74456)"
       x1="12"
       y1="-52"
       x2="60"
       y2="-52" />
  </defs>
  <metadata
     id="metadata3647">
    <rdf:RDF>
      <cc:Work
         rdf:about="">
        <dc:format>image/svg+xml</dc:format>
        <dc:type
           rdf:resource="http://purl.org/dc/dcmitype/StillImage" />
        <dc:title />
      </cc:Work>
      <cc:Work
         rdf:about="">
        <dc:format>image/svg+xml</dc:format>
        <dc:type
           rdf:resource="http://purl.org/dc/dcmitype/StillImage" />
      </cc:Work>
      <cc:Work
         rdf:about="">
        <dc:format>image/svg+xml</dc:format>
        <dc:type
           rdf:resource="http://purl.org/dc/dcmitype/StillImage" />
      </cc:Work>
    </rdf:RDF>
  </metadata>
  <rect
     id="center"
     height="16"
     x="51.825153"
     y="34.851631"
     width="16"
     style="fill:#080808;fill-opacity:1;stroke-width:0.31999999;opacity:0.7" />
  <g
     id="shadow-right"
     transform="translate(13.3934,82.087107)">
    <rect
       transform="matrix(0,-1,-1,0,0,0)"
       style="fill:none;fill-opacity:1;stroke-width:0.35777089"
       width="16"
       y="-145.42953"
       x="32.873951"
       height="20"
       id="rect1028" />
    <rect
       transform="matrix(0,-1,-1,0,0,0)"
       y="-125.42953"
       x="32.873951"
       height="7.999999"
       width="16"
       id="rect1030"
       style="opacity:1;fill:none;fill-opacity:0.69130435;fill-rule:nonzero;stroke:none;stroke-width:1.92223215;stroke-linecap:round;stroke-miterlimit:4;stroke-dasharray:none;stroke-dashoffset:0;stroke-opacity:1" />
  </g>
  <rect
     style="fill:none;fill-opacity:0.24313725;stroke-width:0.31999999"
     width="16"
     y="33.213158"
     x="114.82293"
     height="16"
     id="shadow-center" />
  <rect
     id="shadow-hint-bottom-margin"
     height="20"
     x="121.16264"
     y="57.350334"
     width="2"
     style="fill:url(#linearGradient1829);fill-opacity:1;stroke-width:0.12649111" />
  <rect
     id="shadow-hint-left-margin"
     height="2"
     x="86.480164"
     y="40.139633"
     width="20"
     style="fill:url(#linearGradient1837);fill-opacity:1;stroke-width:0.12649111" />
  <rect
     transform="rotate(90)"
     id="hint-right-margin"
     height="8"
     x="40.489983"
     y="-75.921692"
     width="2"
     style="fill:url(#linearGradient2472);fill-opacity:1;stroke-width:0.07999999" />
  <rect
     style="fill:url(#linearGradient2476);fill-opacity:1;stroke-width:0.07999999"
     width="2"
     y="-51.756084"
     x="44.217129"
     height="8"
     id="hint-left-margin"
     transform="rotate(90)" />
  <rect
     transform="rotate(90)"
     id="hint-top-margin"
     height="2"
     x="26.458038"
     y="-59.52161"
     width="8"
     style="fill:url(#linearGradient2480);fill-opacity:1;stroke-width:0.07999999" />
  <rect
     style="fill:url(#linearGradient2484);fill-opacity:1;stroke-width:0.08"
     width="8"
     y="-62.255432"
     x="50.774467"
     height="2"
     id="hint-bottom-margin"
     transform="rotate(90)" />
  <rect
     style="fill:url(#linearGradient1825);fill-opacity:1;stroke-width:0.12649111"
     width="2"
     y="5"
     x="121.77192"
     height="20"
     id="shadow-hint-top-margin" />
  <path
     style="opacity:1;fill:none;fill-opacity:1;fill-rule:nonzero;stroke:none;stroke-width:7.09614515;stroke-linecap:round;stroke-miterlimit:4;stroke-dasharray:none;stroke-dashoffset:0;stroke-opacity:1"
     d="m 138.82291,49.213981 v 2.285157 c 0,3.165715 -2.54912,5.714843 -5.71484,5.714843 h -2.28516 v 20.000001 h 28 V 49.213981 Z"
     id="shadow-bottomright"
     inkscape:connector-curvature="0" />
  <rect
     style="fill:url(#linearGradient1833);fill-opacity:1;stroke-width:0.1264911"
     width="20"
     y="40.229439"
     x="139.01848"
     height="2"
     id="shadow-hint-right-margin" />
  <g
     id="right"
     transform="translate(-6,10.660625)"
     style="fill:#080808;fill-opacity:1;opacity:0.7">
    <g
       transform="matrix(0.875,0,0,1,9.2281437,0)"
       id="g1683"
       style="fill:#080808;fill-opacity:1">
      <rect
         id="rect1670"
         height="8"
         x="24.191008"
         y="-81.82515"
         width="16"
         style="fill:#080808;fill-opacity:1;stroke-width:0.22627418"
         transform="rotate(90)" />
    </g>
    <rect
       id="rect1663"
       height="1"
       x="24.191008"
       y="-81.82515"
       width="16"
       style="fill:#080808;fill-opacity:1;stroke-width:0.08000001"
       transform="rotate(90)" />
  </g>
  <g
     transform="matrix(-1,0,0,1,125.6503,10.660625)"
     id="left"
     style="fill:#080808;fill-opacity:1;opacity:0.7">
    <g
       id="g2348"
       transform="matrix(0.875,0,0,1,9.2281437,0)"
       style="fill:#080808;fill-opacity:1">
      <rect
         transform="rotate(90)"
         style="fill:#080808;fill-opacity:1;stroke-width:0.22627418"
         width="16"
         y="-81.82515"
         x="24.191008"
         height="8"
         id="rect2346" />
    </g>
    <rect
       transform="rotate(90)"
       style="fill:#080808;fill-opacity:1;stroke-width:0.08000001"
       width="16"
       y="-81.82515"
       x="24.191008"
       height="1"
       id="rect2350" />
  </g>
  <g
     transform="rotate(-90,68.155461,40.521321)"
     id="top"
     style="fill:#080808;fill-opacity:1;opacity:0.7">
    <g
       id="g2360"
       transform="matrix(0.875,0,0,1,9.2281437,0)"
       style="fill:#080808;fill-opacity:1">
      <rect
         transform="rotate(90)"
         style="fill:#080808;fill-opacity:1;stroke-width:0.22627418"
         width="16"
         y="-81.82515"
         x="24.191008"
         height="8"
         id="rect2358" />
    </g>
    <rect
       transform="rotate(90)"
       style="fill:#080808;fill-opacity:1;stroke-width:0.08000001"
       width="16"
       y="-81.82515"
       x="24.191008"
       height="1"
       id="rect2362" />
  </g>
  <g
     transform="rotate(90,57.494837,34.521321)"
     id="bottom"
     style="fill:#080808;fill-opacity:1;opacity:0.7">
    <g
       id="g2372"
       transform="matrix(0.875,0,0,1,9.2281437,0)"
       style="fill:#080808;fill-opacity:1">
      <rect
         transform="rotate(90)"
         style="fill:#080808;fill-opacity:1;stroke-width:0.22627418"
         width="16"
         y="-81.82515"
         x="24.191008"
         height="8"
         id="rect2370" />
    </g>
    <rect
       transform="rotate(90)"
       style="fill:#080808;fill-opacity:1;stroke-width:0.08000001"
       width="16"
       y="-81.82515"
       x="24.191008"
       height="1"
       id="rect2374" />
  </g>
  <g
     id="shadow-left"
     transform="matrix(-1,0,0,1,232.25246,82.087106)">
    <rect
       id="rect2431"
       height="20"
       x="32.873951"
       y="-145.42953"
       width="16"
       style="fill:none;fill-opacity:1;stroke-width:0.35777089"
       transform="matrix(0,-1,-1,0,0,0)" />
    <rect
       style="opacity:1;fill:none;fill-opacity:0.69130435;fill-rule:nonzero;stroke:none;stroke-width:1.92223215;stroke-linecap:round;stroke-miterlimit:4;stroke-dasharray:none;stroke-dashoffset:0;stroke-opacity:1"
       id="rect2433"
       width="16"
       height="7.999999"
       x="32.873951"
       y="-125.42953"
       transform="matrix(0,-1,-1,0,0,0)" />
  </g>
  <g
     id="shadow-top"
     transform="rotate(-90,157.16978,-6.5270987)">
    <rect
       id="rect2439"
       height="20"
       x="32.873951"
       y="-145.42953"
       width="16"
       style="fill:none;fill-opacity:1;stroke-width:0.35777089"
       transform="matrix(0,-1,-1,0,0,0)" />
    <rect
       style="opacity:1;fill:none;fill-opacity:0.69130435;fill-rule:nonzero;stroke:none;stroke-width:1.92223215;stroke-linecap:round;stroke-miterlimit:4;stroke-dasharray:none;stroke-dashoffset:0;stroke-opacity:1"
       id="rect2441"
       width="16"
       height="7.999999"
       x="32.873951"
       y="-125.42953"
       transform="matrix(0,-1,-1,0,0,0)" />
  </g>
  <g
     id="shadow-bottom"
     transform="rotate(90,75.082675,6.8663023)">
    <rect
       id="rect2447"
       height="20"
       x="32.873951"
       y="-145.42953"
       width="16"
       style="fill:none;fill-opacity:1;stroke-width:0.35777089"
       transform="matrix(0,-1,-1,0,0,0)" />
    <rect
       style="opacity:1;fill:none;fill-opacity:0.69130435;fill-rule:nonzero;stroke:none;stroke-width:1.92223215;stroke-linecap:round;stroke-miterlimit:4;stroke-dasharray:none;stroke-dashoffset:0;stroke-opacity:1"
       id="rect2449"
       width="16"
       height="7.999999"
       x="32.873951"
       y="-125.42953"
       transform="matrix(0,-1,-1,0,0,0)" />
  </g>
  <path
     id="shadow-bottomleft"
     d="m 106.82293,49.213155 v 2.285157 c 0,3.165715 2.54912,5.714843 5.71484,5.714843 h 2.28516 V 77.213156 H 86.822928 V 49.213155 Z"
     style="opacity:1;fill:none;fill-opacity:1;fill-rule:nonzero;stroke:none;stroke-width:7.09614515;stroke-linecap:round;stroke-miterlimit:4;stroke-dasharray:none;stroke-dashoffset:0;stroke-opacity:1"
     inkscape:connector-curvature="0" />
  <path
     id="shadow-topright"
     d="m 138.82294,33.213155 v -2.285157 c 0,-3.165715 -2.54912,-5.714843 -5.71484,-5.714843 h -2.28516 V 5.2131549 h 28 V 33.213155 Z"
     style="opacity:1;fill:none;fill-opacity:1;fill-rule:nonzero;stroke:none;stroke-width:7.09614515;stroke-linecap:round;stroke-miterlimit:4;stroke-dasharray:none;stroke-dashoffset:0;stroke-opacity:1"
     inkscape:connector-curvature="0" />
  <path
     inkscape:connector-curvature="0"
     style="opacity:1;fill:none;fill-opacity:1;fill-rule:nonzero;stroke:none;stroke-width:7.09614515;stroke-linecap:round;stroke-miterlimit:4;stroke-dasharray:none;stroke-dashoffset:0;stroke-opacity:1"
     d="m 106.82293,33.213155 v -2.285157 c 0,-3.165715 2.54912,-5.714843 5.71484,-5.714843 h 2.28516 V 5.2131549 H 86.822931 V 33.213155 Z"
     id="shadow-topleft" />
  <g
     id="topright"
     transform="translate(-4.4209445,8.0742886)"
     style="fill:#080808;fill-opacity:1;opacity:0.7">
    <path
       id="path2392"
       d="m 72.246094,19.919922 v 6.857422 h 6.855468 v -1.142578 c 0,-3.428572 -2.28432,-5.714844 -5.71289,-5.714844 z"
       style="opacity:1;fill:#080808;fill-opacity:1;stroke:none;stroke-width:1"
       inkscape:connector-curvature="0" />
    <path
       inkscape:connector-curvature="0"
       d="m 80.244422,24.49163 c 0,-3.165715 -2.54857,-5.714286 -5.71429,-5.714286 h -2.28571 v 1.142857 h 1.14286 c 3.42857,0 5.71428,2.285714 5.71428,5.714286 v 1.142857 h 1.14286 z"
       style="opacity:1;fill:#080808;fill-opacity:1;stroke:none;stroke-width:1.14285707"
       id="path907" />
  </g>
  <g
     transform="matrix(1,0,0,-1,-4.4209436,77.628978)"
     id="bottomright"
     style="fill:#080808;fill-opacity:1;opacity:0.7">
    <path
       inkscape:connector-curvature="0"
       style="opacity:1;fill:#080808;fill-opacity:1;stroke:none;stroke-width:1"
       d="m 72.246094,19.919922 v 6.857422 h 6.855468 v -1.142578 c 0,-3.428572 -2.28432,-5.714844 -5.71289,-5.714844 z"
       id="path916" />
    <path
       id="path919"
       style="opacity:1;fill:#080808;fill-opacity:1;stroke:none;stroke-width:1.14285707"
       d="m 80.244422,24.49163 c 0,-3.165715 -2.54857,-5.714286 -5.71429,-5.714286 h -2.28571 v 1.142857 h 1.14286 c 3.42857,0 5.71428,2.285714 5.71428,5.714286 v 1.142857 h 1.14286 z"
       inkscape:connector-curvature="0" />
  </g>
  <g
     transform="matrix(-1,0,0,1,124.0679,8.0742886)"
     id="topleft"
     style="fill:#080808;fill-opacity:1;opacity:0.7">
    <path
       inkscape:connector-curvature="0"
       style="opacity:1;fill:#080808;fill-opacity:1;stroke:none;stroke-width:1"
       d="m 72.246094,19.919922 v 6.857422 h 6.855468 v -1.142578 c 0,-3.428572 -2.28432,-5.714844 -5.71289,-5.714844 z"
       id="path1603" />
    <path
       id="path1605"
       style="opacity:1;fill:#080808;fill-opacity:1;stroke:none;stroke-width:1.14285707"
       d="m 80.244422,24.49163 c 0,-3.165715 -2.54857,-5.714286 -5.71429,-5.714286 h -2.28571 v 1.142857 h 1.14286 c 3.42857,0 5.71428,2.285714 5.71428,5.714286 v 1.142857 h 1.14286 z"
       inkscape:connector-curvature="0" />
  </g>
  <g
     id="bottomleft"
     transform="rotate(-180,62.03562,38.814489)"
     style="fill:#080808;fill-opacity:1;opacity:0.7">
    <path
       id="path1613"
       d="m 72.246094,19.919922 v 6.857422 h 6.855468 v -1.142578 c 0,-3.428572 -2.28432,-5.714844 -5.71289,-5.714844 z"
       style="opacity:1;fill:#080808;fill-opacity:1;stroke:none;stroke-width:1"
       inkscape:connector-curvature="0" />
    <path
       inkscape:connector-curvature="0"
       d="m 80.244422,24.49163 c 0,-3.165715 -2.54857,-5.714286 -5.71429,-5.714286 h -2.28571 v 1.142857 h 1.14286 c 3.42857,0 5.71428,2.285714 5.71428,5.714286 v 1.142857 h 1.14286 z"
       style="opacity:1;fill:#080808;fill-opacity:1;stroke:none;stroke-width:1.14285707"
       id="path1615" />
  </g>
</svg>
