 Minimum found at:
*** Qmin=1.092537e-08 ***   *    58 [ 0.726243083 0.036319082 0.001329455 0.005032739 42.420986039 -501.300004829 ] Q=1.092537e-08
 Minimum found at:
 Minimum found at:
Qopt=1.092537e-08  k1=7.262431e-01  k2=3.631908e-02  C01=1.329455e-03  C02=5.032739e-03  H1=4.242099e+01  H2=-5.013000e+02
