*** Qmin=2.835383e-07 ***   *    28 [ 0.718826317 0.068507419 0.001399714 0.003830215 36.141847385 -232.137807039 ] Q=2.835383e-07
*** Qmin=2.159391e-08 ***   *   319 [ 0.573903307 0.069514786 0.001979709 0.002288996 21.300972941 -394.152143368 ] Q=2.159391e-08
 Minimum found at:
 Minimum found at:
 Minimum found at:
*** Qmin=1.972368e-08 ***   *   996 [ 0.888438705 0.019781338 0.000850220 0.008977148 38.679115483 -500.279137870 ] Q=1.972368e-08
 Minimum found at:
 Minimum found at:
*** Qmin=1.523895e-08 ***   *  5019 [ 0.794201790 0.064406656 0.001007885 0.002490357 30.879920000 -434.132729999 ] Q=1.523895e-08
*** Qmin=1.481965e-08 ***   *  5150 [ 0.933432163 0.043753189 0.000746955 0.003959712 40.489759994 -468.484569999 ] Q=1.481965e-08
*** Qmin=1.448043e-08 ***   *  6334 [ 0.827866894 0.048031084 0.000722277 0.003627653 29.700880004 -435.548289999 ] Q=1.448043e-08
*** Qmin=1.407803e-08 ***   *  7350 [ 0.913079792 0.057719665 0.000632959 0.002954475 34.568239996 -424.895900002 ] Q=1.407803e-08
*** Qmin=1.347258e-08 ***   * 10474 [ 0.669628441 0.054496348 0.001077118 0.003136702 34.546240004 -430.332390000 ] Q=1.347258e-08
*** Qmin=1.261220e-08 ***   * 13191 [ 0.947148971 0.048913603 0.000658903 0.003448767 34.468680000 -450.629680000 ] Q=1.261220e-08
*** Qmin=1.221197e-08 ***   * 24414 [ 0.600071507 0.046008673 0.001260109 0.003926111 44.437120002 -454.286399999 ] Q=1.221197e-08
*** Qmin=1.180485e-08 ***   * 27836 [ 0.720933626 0.047353652 0.001192956 0.003792214 38.024320003 -439.120299999 ] Q=1.180485e-08
*** Qmin=1.166870e-08 ***   * 69808 [ 0.682108319 0.044176829 0.001133025 0.004039118 38.644719998 -453.491760000 ] Q=1.166870e-08
Qopt=1.166870e-08  k1=6.821083e-01  k2=4.417683e-02  C01=1.133025e-03  C02=4.039118e-03  H1=3.864472e+01  H2=-4.534918e+02
