 Minimum found at:
*** Qmin=1.429158e-08 ***   *    77 [ 0.869866750 0.057623024 0.000917226 0.002812292 24.388170400 -422.393724740 ] Q=1.429158e-08
 Minimum found at:
 Minimum found at:
 Minimum found at:
 Minimum found at:
 Minimum found at:
 Minimum found at:
 Minimum found at:
 Minimum found at:
 Minimum found at:
 Minimum found at:
 Minimum found at:
 Minimum found at:
 Minimum found at:
 Minimum found at:
*** Qmin=1.063803e-08 ***   *  5000 [ 0.750654466 0.023326396 0.001020461 0.008450348 48.315232362 -471.078050990 ] Q=1.063803e-08
Qopt=1.063803e-08  k1=7.506545e-01  k2=2.332640e-02  C01=1.020461e-03  C02=8.450348e-03  H1=4.831523e+01  H2=-4.710781e+02
