 Minimum found at:
*** Qmin=5.709575e-08 ***   *   390 [ 1.062049851 0.000484063 0.000766034 0.307537869 28.501454411 -578.625334380 ] Q=5.709575e-08
 Minimum found at:
*** Qmin=2.154820e-08 ***   *  5000 [ 0.613877819 0.069287107 0.001656808 0.002306871 21.496906346 -393.176833642 ] Q=2.154820e-08
*** Qmin=1.758766e-08 ***   *  5034 [ 0.678715786 0.055278781 0.001240137 0.002784569 23.465920000 -447.863060000 ] Q=1.758766e-08
*** Qmin=1.377786e-08 ***   *  5241 [ 0.710867161 0.049734109 0.001089971 0.003776587 39.304119992 -423.854010004 ] Q=1.377786e-08
*** Qmin=1.160193e-08 ***   *  5873 [ 0.897226392 0.045772307 0.000699067 0.003978555 39.218400001 -441.984960000 ] Q=1.160193e-08
*** Qmin=1.149193e-08 ***   * 36245 [ 0.747366816 0.046898840 0.001057467 0.003796237 35.864840006 -440.846749998 ] Q=1.149193e-08
*** Qmin=1.138085e-08 ***   * 55327 [ 0.721726852 0.045981015 0.001034431 0.003902913 40.601959998 -449.815260000 ] Q=1.138085e-08
Qopt=1.138085e-08  k1=7.217269e-01  k2=4.598102e-02  C01=1.034431e-03  C02=3.902913e-03  H1=4.060196e+01  H2=-4.498153e+02
