 Minimum found at:
*** Qmin=7.863581e-08 ***   *    38 [ 0.712433661 0.068666260 0.000972622 0.003170362 46.161779162 -339.751736381 ] Q=7.863581e-08
*** Qmin=3.486091e-08 ***   *    42 [ 0.914255221 0.041014670 0.000473444 0.004144874 57.689079961 -496.920470004 ] Q=3.486091e-08
*** Qmin=1.515338e-08 ***   *   110 [ 0.885489084 0.040040853 0.000719697 0.004753188 51.978075104 -454.528468288 ] Q=1.515338e-08
 Minimum found at:
*** Qmin=1.437278e-08 ***   *  6318 [ 0.872242369 0.049375491 0.000768758 0.003859131 44.034319995 -431.038450001 ] Q=1.437278e-08
*** Qmin=1.429933e-08 ***   *  8576 [ 0.676158006 0.058869039 0.001292560 0.002742636 27.235840003 -430.638120000 ] Q=1.429933e-08
*** Qmin=1.367772e-08 ***   *  9850 [ 0.920951741 0.053509230 0.000930902 0.003066091 28.237520005 -440.608959998 ] Q=1.367772e-08
*** Qmin=1.271305e-08 ***   * 11145 [ 0.825717211 0.049948688 0.000866982 0.003613586 36.316079999 -426.212130002 ] Q=1.271305e-08
*** Qmin=1.224875e-08 ***   * 41349 [ 0.702249068 0.044454736 0.001212223 0.003971571 32.983720003 -436.376040001 ] Q=1.224875e-08
*** Qmin=1.140063e-08 ***   * 66977 [ 0.842109950 0.045914313 0.000903170 0.003818048 35.362880005 -443.318389998 ] Q=1.140063e-08
Qopt=1.140063e-08  k1=8.421100e-01  k2=4.591431e-02  C01=9.031700e-04  C02=3.818048e-03  H1=3.536288e+01  H2=-4.433184e+02
