 Minimum found at:
*** Qmin=1.530775e-08 ***   *   150 [ 0.793012587 0.060256243 0.001086572 0.002671397 23.503507186 -416.760384194 ] Q=1.530775e-08
 Minimum found at:
*** Qmin=1.049580e-08 ***   *   211 [ 0.651401490 0.033187605 0.001222155 0.005973863 48.416006945 -450.492492558 ] Q=1.049580e-08
 Minimum found at:
 Minimum found at:
 Minimum found at:
 Minimum found at:
 Minimum found at:
 Minimum found at:
 Minimum found at:
 Minimum found at:
Qopt=1.049580e-08  k1=6.514015e-01  k2=3.318761e-02  C01=1.222155e-03  C02=5.973863e-03  H1=4.841601e+01  H2=-4.504925e+02
