 Minimum found at:
*** Qmin=1.225323e-08 ***   *   144 [ 0.773183709 0.038191783 0.001248529 0.004587547 37.306825589 -498.346215944 ] Q=1.225323e-08
*** Qmin=1.188336e-08 ***   * 24278 [ 0.778421589 0.046205486 0.001254957 0.003743759 39.565519994 -489.732590001 ] Q=1.188336e-08
*** Qmin=1.175725e-08 ***   * 30524 [ 0.884156914 0.048483015 0.000899798 0.003554388 36.999640001 -480.683670000 ] Q=1.175725e-08
Qopt=1.175725e-08  k1=8.841569e-01  k2=4.848302e-02  C01=8.997981e-04  C02=3.554388e-03  H1=3.699964e+01  H2=-4.806837e+02
