 Minimum found at:
*** Qmin=4.929795e-08 ***   *   323 [ 0.666804667 0.000711963 0.001284206 0.231939688 48.780103368 -592.844625021 ] Q=4.929795e-08
 Minimum found at:
*** Qmin=1.437996e-08 ***   *   401 [ 0.860592331 0.039169001 0.000910982 0.004311928 30.987783298 -462.885219966 ] Q=1.437996e-08
 Minimum found at:
 Minimum found at:
 Minimum found at:
 Minimum found at:
 Minimum found at:
 Minimum found at:
*** Qmin=1.333087e-08 ***   *  9120 [ 0.894214541 0.046113096 0.000919303 0.003659199 35.346319994 -452.844180000 ] Q=1.333087e-08
*** Qmin=1.241359e-08 ***   * 14453 [ 0.828743163 0.051177807 0.000859705 0.003339911 31.009720002 -431.691190001 ] Q=1.241359e-08
*** Qmin=1.137693e-08 ***   * 22823 [ 0.778333156 0.044156635 0.000997183 0.004102196 36.085679996 -442.277360001 ] Q=1.137693e-08
Qopt=1.137693e-08  k1=7.783332e-01  k2=4.415663e-02  C01=9.971834e-04  C02=4.102196e-03  H1=3.608568e+01  H2=-4.422774e+02
