 Minimum found at:
*** Qmin=2.680911e-08 ***   *   323 [ 0.982090571 0.038673657 0.000999725 0.003958157 22.407160808 -504.596124562 ] Q=2.680911e-08
 Minimum found at:
*** Qmin=1.496883e-08 ***   *   693 [ 0.795841556 0.012320298 0.001167189 0.015874913 53.885550437 -560.062535865 ] Q=1.496883e-08
 Minimum found at:
 Minimum found at:
 Minimum found at:
 Minimum found at:
 Minimum found at:
*** Qmin=1.456497e-08 ***   *  5231 [ 0.839791210 0.053435702 0.001189422 0.002976002 31.464800007 -482.496549996 ] Q=1.456497e-08
*** Qmin=1.379077e-08 ***   *  7093 [ 0.912248834 0.054145100 0.000918948 0.003136511 32.622279998 -478.944319999 ] Q=1.379077e-08
*** Qmin=1.356114e-08 ***   *  9092 [ 0.857499069 0.047335833 0.000819346 0.003822424 46.305240001 -502.669570000 ] Q=1.356114e-08
*** Qmin=1.247678e-08 ***   * 10282 [ 0.719422801 0.050373389 0.001273808 0.003442340 36.506120007 -481.993879998 ] Q=1.247678e-08
*** Qmin=1.184000e-08 ***   * 13979 [ 0.695873357 0.043355948 0.001358452 0.004064930 40.877360003 -499.833289999 ] Q=1.184000e-08
*** Qmin=1.179280e-08 ***   * 38329 [ 0.769252576 0.045854806 0.001195691 0.003929384 45.773479993 -498.069000001 ] Q=1.179280e-08
*** Qmin=1.177830e-08 ***   * 73412 [ 0.765376769 0.043902999 0.001201717 0.004067743 38.674839997 -492.260130000 ] Q=1.177830e-08
*** Qmin=1.156355e-08 ***   * 90190 [ 0.785190695 0.048577123 0.001142883 0.003693456 41.038999997 -483.601650000 ] Q=1.156355e-08
Qopt=1.156355e-08  k1=7.851907e-01  k2=4.857712e-02  C01=1.142883e-03  C02=3.693456e-03  H1=4.103900e+01  H2=-4.836017e+02
