*** Qmin=1.677747e-07 ***   *     3 [ 0.958065388 0.095442161 0.000701388 0.001415003 54.861399978 -527.443159990 ] Q=1.677747e-07
*** Qmin=8.592409e-08 ***   *   270 [ 0.506234744 0.098862255 0.002294012 0.001699606 21.080097024 -311.686943763 ] Q=8.592409e-08
 Minimum found at:
*** Qmin=1.334343e-08 ***   *   304 [ 0.764493724 0.047696269 0.000987963 0.003878926 38.016513479 -423.526371134 ] Q=1.334343e-08
 Minimum found at:
*** Qmin=1.299371e-08 ***   *  6111 [ 0.849180343 0.046753478 0.000755284 0.003778544 36.039559997 -428.874690002 ] Q=1.299371e-08
*** Qmin=1.288376e-08 ***   * 18584 [ 0.807827310 0.052509532 0.000978164 0.003407424 37.167039993 -430.734870001 ] Q=1.288376e-08
*** Qmin=1.194837e-08 ***   * 30166 [ 0.890624242 0.047398844 0.000744294 0.003814680 37.621520005 -445.388839998 ] Q=1.194837e-08
*** Qmin=1.193226e-08 ***   * 31930 [ 0.639030962 0.043878906 0.001207636 0.004033518 38.083959999 -451.520640001 ] Q=1.193226e-08
*** Qmin=1.189123e-08 ***   * 44392 [ 0.944387799 0.047620870 0.000712278 0.003666318 33.283560001 -434.563590001 ] Q=1.189123e-08
Qopt=1.189123e-08  k1=9.443878e-01  k2=4.762087e-02  C01=7.122777e-04  C02=3.666318e-03  H1=3.328356e+01  H2=-4.345636e+02
