*** Qmin=8.683424e-08 ***   *  2669 [ 0.655122559 0.074085728 0.001088298 0.002885257 43.927846583 -331.168679983 ] Q=8.683424e-08
 Minimum found at:
*** Qmin=6.070070e-08 ***   *  3069 [ 0.696224770 0.065219652 0.001031507 0.003229651 44.482145902 -353.327514117 ] Q=6.070070e-08
 Minimum found at:
 Minimum found at:
*** Qmin=5.156403e-08 ***   *  4850 [ 0.833595170 0.000815233 0.001194563 0.186947268 29.763463903 -567.290934702 ] Q=5.156403e-08
*** Qmin=4.226272e-08 ***   *  5016 [ 0.880989052 0.086667144 0.000682269 0.002105026 47.614240000 -415.529639999 ] Q=4.226272e-08
*** Qmin=3.617833e-08 ***   *  5020 [ 0.610918754 0.094711301 0.000957864 0.001631751 36.951559997 -398.233320001 ] Q=3.617833e-08
*** Qmin=1.752681e-08 ***   *  5028 [ 0.792690184 0.045881370 0.000796749 0.003708764 42.897640001 -478.728459993 ] Q=1.752681e-08
*** Qmin=1.418976e-08 ***   *  5066 [ 0.821148576 0.062159682 0.000863188 0.002603622 29.386640002 -424.152430000 ] Q=1.418976e-08
*** Qmin=1.302989e-08 ***   *  5628 [ 0.596898547 0.053314130 0.001496016 0.003267362 36.217960003 -438.484330000 ] Q=1.302989e-08
*** Qmin=1.221019e-08 ***   *  9172 [ 0.736947551 0.043649197 0.000944251 0.004164116 39.523399997 -434.781170002 ] Q=1.221019e-08
*** Qmin=1.218794e-08 ***   * 95575 [ 0.817523381 0.047317678 0.000831516 0.003606925 34.739919998 -450.693750000 ] Q=1.218794e-08
Qopt=1.218794e-08  k1=8.175234e-01  k2=4.731768e-02  C01=8.315162e-04  C02=3.606925e-03  H1=3.473992e+01  H2=-4.506938e+02
