*** Qmin=3.798912e-07 ***   *   113 [ 0.629543793 0.161910180 0.001363724 0.001289801 40.343220974 -242.274187694 ] Q=3.798912e-07
*** Qmin=8.071080e-08 ***   *  5002 [ 0.743568808 0.066999532 0.001019291 0.001957386 30.428839996 -401.702560001 ] Q=8.071080e-08
*** Qmin=6.188341e-08 ***   *  5005 [ 0.423480940 0.084175494 0.000697321 0.001860086 34.060999999 -420.617400000 ] Q=6.188341e-08
*** Qmin=2.501833e-08 ***   *  5018 [ 0.761098067 0.084665465 0.001035811 0.001858340 23.416040003 -421.243049999 ] Q=2.501833e-08
*** Qmin=2.101319e-08 ***   *  5106 [ 0.760828671 0.066807171 0.001079385 0.002586210 48.244399994 -492.324200000 ] Q=2.101319e-08
*** Qmin=1.641754e-08 ***   *  5158 [ 0.916442894 0.058190122 0.000928456 0.002673847 21.557640008 -456.487569998 ] Q=1.641754e-08
*** Qmin=1.434399e-08 ***   *  5236 [ 0.694494404 0.050078811 0.001460699 0.003398559 32.818160004 -457.099460003 ] Q=1.434399e-08
*** Qmin=1.378673e-08 ***   *  5921 [ 0.905926653 0.054918699 0.001020914 0.002934836 26.232400008 -459.847160000 ] Q=1.378673e-08
*** Qmin=1.271219e-08 ***   *  6475 [ 0.732869511 0.045857713 0.001099017 0.004034632 49.284599998 -493.757820001 ] Q=1.271219e-08
*** Qmin=1.226821e-08 ***   * 18600 [ 0.782623909 0.048668387 0.001192030 0.003670914 38.814959992 -470.693050002 ] Q=1.226821e-08
*** Qmin=1.217829e-08 ***   * 32756 [ 0.916643189 0.046166888 0.000889586 0.003814524 37.993559996 -472.608270002 ] Q=1.217829e-08
*** Qmin=1.212645e-08 ***   * 43291 [ 0.812169387 0.047523595 0.001065537 0.003736634 36.027879997 -470.471600002 ] Q=1.212645e-08
*** Qmin=1.199220e-08 ***   * 55988 [ 0.685903907 0.042665941 0.001313019 0.004109626 39.245320000 -488.984390001 ] Q=1.199220e-08
*** Qmin=1.187871e-08 ***   * 103801 [ 0.742670587 0.045637565 0.001320923 0.003824824 37.625960007 -477.224319999 ] Q=1.187871e-08
Qopt=1.187871e-08  k1=7.426706e-01  k2=4.563757e-02  C01=1.320923e-03  C02=3.824824e-03  H1=3.762596e+01  H2=-4.772243e+02
