 Minimum found at:
*** Qmin=4.509645e-08 ***   *    61 [ 0.607032815 0.053352635 0.001550580 0.004100915 57.752461480 -440.886031801 ] Q=4.509645e-08
*** Qmin=4.129612e-08 ***   *  5032 [ 0.518468232 0.059627448 0.001014200 0.002826321 59.027719996 -498.758290001 ] Q=4.129612e-08
*** Qmin=1.883659e-08 ***   *  5042 [ 0.799439230 0.059843080 0.000932232 0.002556245 20.900360004 -443.126610000 ] Q=1.883659e-08
*** Qmin=1.865510e-08 ***   *  5224 [ 0.803645674 0.065864906 0.001120199 0.002421853 31.429079995 -439.233820002 ] Q=1.865510e-08
*** Qmin=1.552466e-08 ***   *  6080 [ 0.920580635 0.058757578 0.000952172 0.002639474 32.776759996 -476.437420000 ] Q=1.552466e-08
*** Qmin=1.509386e-08 ***   *  7064 [ 0.935634738 0.056456822 0.001006888 0.002965625 24.934080007 -446.224329999 ] Q=1.509386e-08
*** Qmin=1.334274e-08 ***   *  8771 [ 0.829884263 0.049717525 0.001003300 0.003687767 48.246760005 -500.324779998 ] Q=1.334274e-08
*** Qmin=1.323312e-08 ***   *  8843 [ 0.826502564 0.045406314 0.000923748 0.003741235 41.555759999 -502.038330000 ] Q=1.323312e-08
*** Qmin=1.305771e-08 ***   *  9702 [ 0.863515524 0.048806758 0.000984616 0.003411249 30.165960007 -472.602679999 ] Q=1.305771e-08
*** Qmin=1.231496e-08 ***   * 13298 [ 0.841426510 0.049033820 0.001109189 0.003571080 33.863119997 -465.426410002 ] Q=1.231496e-08
*** Qmin=1.211783e-08 ***   * 22731 [ 0.916716928 0.047524877 0.000975786 0.003566366 35.706239995 -485.935690000 ] Q=1.211783e-08
*** Qmin=1.145472e-08 ***   * 34784 [ 0.813695373 0.047895900 0.001086435 0.003743925 41.069960002 -483.354830000 ] Q=1.145472e-08
Qopt=1.145472e-08  k1=8.136954e-01  k2=4.789590e-02  C01=1.086435e-03  C02=3.743925e-03  H1=4.106996e+01  H2=-4.833548e+02
