 Minimum found at:
*** Qmin=5.634823e-08 ***   *   714 [ 0.966766808 0.005849448 0.001220431 0.025509361 20.767330332 -564.811978236 ] Q=5.634823e-08
 Minimum found at:
 Minimum found at:
*** Qmin=3.444423e-08 ***   *  5026 [ 0.920683434 0.100659463 0.000703584 0.001495032 29.291120002 -424.956529999 ] Q=3.444423e-08
*** Qmin=2.088181e-08 ***   *  5028 [ 0.828212557 0.062627142 0.000986020 0.002345954 21.307240008 -471.261509998 ] Q=2.088181e-08
*** Qmin=1.607691e-08 ***   *  5566 [ 0.696092272 0.043455052 0.001223541 0.003724995 36.003999996 -487.368450001 ] Q=1.607691e-08
*** Qmin=1.477547e-08 ***   * 10577 [ 0.932950632 0.053954028 0.001180928 0.003022515 29.696440005 -471.887159998 ] Q=1.477547e-08
*** Qmin=1.433487e-08 ***   * 11781 [ 0.917092339 0.043373235 0.000799275 0.004019200 45.682800000 -516.189199999 ] Q=1.433487e-08
*** Qmin=1.401576e-08 ***   * 13260 [ 0.588568418 0.044096910 0.001459353 0.003927175 43.958760000 -507.427520000 ] Q=1.401576e-08
*** Qmin=1.323838e-08 ***   * 13549 [ 0.899609227 0.040709344 0.000880605 0.004147887 37.206399996 -487.719760001 ] Q=1.323838e-08
*** Qmin=1.271478e-08 ***   * 15675 [ 0.929208674 0.048163652 0.001024419 0.003497642 30.039119996 -470.201560001 ] Q=1.271478e-08
*** Qmin=1.261573e-08 ***   * 53536 [ 0.927831398 0.055014980 0.000904564 0.003035845 33.509719999 -473.812700000 ] Q=1.261573e-08
*** Qmin=1.211944e-08 ***   * 57921 [ 0.797911792 0.048627793 0.001185765 0.003521713 35.583120004 -472.144730000 ] Q=1.211944e-08
*** Qmin=1.210787e-08 ***   * 103440 [ 0.820630943 0.049594460 0.001051843 0.003662545 41.031839994 -484.859400001 ] Q=1.210787e-08
*** Qmin=1.207515e-08 ***   * 104876 [ 0.839857131 0.045496135 0.001021313 0.003769670 39.493079994 -485.407650001 ] Q=1.207515e-08
Qopt=1.207515e-08  k1=8.398571e-01  k2=4.549613e-02  C01=1.021313e-03  C02=3.769670e-03  H1=3.949308e+01  H2=-4.854077e+02
