*** Qmin=3.724764e-08 ***   *   145 [ 0.571348411 0.062200456 0.001376572 0.003293344 45.825996119 -381.465109158 ] Q=3.724764e-08
 Minimum found at:
 Minimum found at:
 Minimum found at:
 Minimum found at:
*** Qmin=1.039016e-08 ***   *  1080 [ 0.561396972 0.019968666 0.001515485 0.010273663 55.822423505 -479.967544682 ] Q=1.039016e-08
 Minimum found at:
 Minimum found at:
 Minimum found at:
 Minimum found at:
Qopt=1.039016e-08  k1=5.613970e-01  k2=1.996867e-02  C01=1.515485e-03  C02=1.027366e-02  H1=5.582242e+01  H2=-4.799675e+02
