*** Qmin=4.638959e-07 ***   *    67 [ 0.928505957 0.138543529 0.000911921 0.001901234 47.842128204 -235.102981437 ] Q=4.638959e-07
*** Qmin=2.508317e-07 ***   *    75 [ 0.901399347 0.101466739 0.000466486 0.001222595 55.110440017 -631.933159981 ] Q=2.508317e-07
*** Qmin=3.308590e-08 ***   *   565 [ 0.801775084 0.001108935 0.001218464 0.159409573 49.940165502 -610.031831375 ] Q=3.308590e-08
*** Qmin=1.743175e-08 ***   *  5030 [ 0.790383679 0.067787813 0.001315451 0.002322316 30.126519995 -445.203940001 ] Q=1.743175e-08
*** Qmin=1.327354e-08 ***   *  5482 [ 0.712813193 0.049850498 0.001222821 0.003396335 40.855320005 -499.235589998 ] Q=1.327354e-08
*** Qmin=1.293514e-08 ***   *  7441 [ 0.719795301 0.042360596 0.001195099 0.004125967 39.281319995 -480.762790002 ] Q=1.293514e-08
*** Qmin=1.268167e-08 ***   *  7607 [ 0.841025748 0.043708100 0.001166303 0.003850892 32.214560012 -478.556459998 ] Q=1.268167e-08
*** Qmin=1.200205e-08 ***   * 19143 [ 0.762644765 0.048081966 0.001205252 0.003578923 35.401720001 -480.976930000 ] Q=1.200205e-08
Qopt=1.200205e-08  k1=7.626448e-01  k2=4.808197e-02  C01=1.205252e-03  C02=3.578923e-03  H1=3.540172e+01  H2=-4.809769e+02
