 Minimum found at:
*** Qmin=1.513766e-08 ***   *    65 [ 0.953432507 0.056091590 0.000979696 0.002792883 22.759512047 -456.541732646 ] Q=1.513766e-08
 Minimum found at:
*** Qmin=1.036793e-08 ***   *  2820 [ 0.760620924 0.028653960 0.001215933 0.006730495 49.574575370 -519.041378394 ] Q=1.036793e-08
Qopt=1.036793e-08  k1=7.606209e-01  k2=2.865396e-02  C01=1.215933e-03  C02=6.730495e-03  H1=4.957458e+01  H2=-5.190414e+02
