 Minimum found at:
*** Qmin=1.097664e-08 ***   *    58 [ 0.613340445 0.033771627 0.001324086 0.005940098 49.713694197 -447.310085345 ] Q=1.097664e-08
 Minimum found at:
 Minimum found at:
 Minimum found at:
 Minimum found at:
 Minimum found at:
*** Qmin=1.054005e-08 ***   *  2011 [ 0.585695756 0.031554288 0.001420330 0.006366081 50.632122201 -453.348535158 ] Q=1.054005e-08
 Minimum found at:
 Minimum found at:
 Minimum found at:
Qopt=1.054005e-08  k1=5.856958e-01  k2=3.155429e-02  C01=1.420330e-03  C02=6.366081e-03  H1=5.063212e+01  H2=-4.533485e+02
