*** Qmin=1.742418e-08 ***   *    26 [ 0.599112456 0.052662269 0.001514962 0.003500994 45.322136496 -424.264658418 ] Q=1.742418e-08
 Minimum found at:
 Minimum found at:
*** Qmin=1.333524e-08 ***   *   855 [ 0.591592341 0.014689989 0.001430510 0.013582691 55.484568652 -501.956399095 ] Q=1.333524e-08
 Minimum found at:
 Minimum found at:
 Minimum found at:
 Minimum found at:
 Minimum found at:
 Minimum found at:
*** Qmin=1.077883e-08 ***   *  4678 [ 0.597823099 0.024462116 0.001323282 0.008810124 59.544008457 -459.543155680 ] Q=1.077883e-08
Qopt=1.077883e-08  k1=5.978231e-01  k2=2.446212e-02  C01=1.323282e-03  C02=8.810124e-03  H1=5.954401e+01  H2=-4.595432e+02
