 Minimum found at:
*** Qmin=1.143624e-08 ***   *   641 [ 0.750837218 0.026991490 0.001258655 0.006990810 47.595463945 -525.042440757 ] Q=1.143624e-08
 Minimum found at:
*** Qmin=1.100151e-08 ***   *  1438 [ 0.723076670 0.030263959 0.001266749 0.006806440 56.741525933 -511.142958470 ] Q=1.100151e-08
 Minimum found at:
 Minimum found at:
 Minimum found at:
 Minimum found at:
 Minimum found at:
Qopt=1.100151e-08  k1=7.230767e-01  k2=3.026396e-02  C01=1.266749e-03  C02=6.806440e-03  H1=5.674153e+01  H2=-5.111430e+02
