*** Qmin=9.621504e-08 ***   *    45 [ 0.830796598 0.032700735 0.000803165 0.004291958 58.426433485 -571.035672669 ] Q=9.621504e-08
 Minimum found at:
*** Qmin=1.000094e-08 ***   *   189 [ 0.583391074 0.019925747 0.001409718 0.010502502 57.906783636 -476.869988165 ] Q=1.000094e-08
 Minimum found at:
 Minimum found at:
 Minimum found at:
 Minimum found at:
 Minimum found at:
 Minimum found at:
 Minimum found at:
Qopt=1.000094e-08  k1=5.833911e-01  k2=1.992575e-02  C01=1.409718e-03  C02=1.050250e-02  H1=5.790678e+01  H2=-4.768700e+02
