*** Qmin=1.920235e-07 ***   *    13 [ 0.331471674 0.104341483 0.000760690 0.001127222 52.330120061 -560.127889840 ] Q=1.920235e-07
 Minimum found at:
*** Qmin=1.134950e-07 ***   *   641 [ 0.570753442 0.066493107 0.001287579 0.003714667 58.396089488 -327.950486790 ] Q=1.134950e-07
 Minimum found at:
*** Qmin=3.934243e-08 ***   *  1382 [ 0.906067028 0.001587073 0.000899534 0.104703501 37.308198808 -555.505551793 ] Q=3.934243e-08
 Minimum found at:
*** Qmin=2.561265e-08 ***   *  2367 [ 0.708453662 0.030190752 0.001380325 0.005353736 28.116364236 -492.572622954 ] Q=2.561265e-08
*** Qmin=1.947115e-08 ***   *  2466 [ 0.933187566 0.067381908 0.000903101 0.002435331 25.280492699 -396.984169369 ] Q=1.947115e-08
 Minimum found at:
*** Qmin=1.357091e-08 ***   *  5040 [ 0.606067611 0.045349521 0.001105776 0.003950001 41.518359998 -442.347450001 ] Q=1.357091e-08
*** Qmin=1.326487e-08 ***   * 11752 [ 0.893650495 0.042448875 0.000790346 0.003967207 34.198759997 -461.772270000 ] Q=1.326487e-08
*** Qmin=1.292476e-08 ***   * 12998 [ 0.884642445 0.048011329 0.000738185 0.003782228 35.055119995 -425.376210004 ] Q=1.292476e-08
*** Qmin=1.267613e-08 ***   * 15660 [ 0.773290192 0.052984883 0.000928035 0.003359219 38.053039999 -431.076290001 ] Q=1.267613e-08
*** Qmin=1.259513e-08 ***   * 29841 [ 0.948060540 0.042723075 0.000839713 0.004052134 34.128879994 -441.861550001 ] Q=1.259513e-08
*** Qmin=1.220308e-08 ***   * 36972 [ 0.895543898 0.045971391 0.000796503 0.003903033 34.037719995 -429.782850003 ] Q=1.220308e-08
*** Qmin=1.148128e-08 ***   * 38355 [ 0.716588693 0.046741586 0.001105001 0.003823607 38.005800006 -438.767699999 ] Q=1.148128e-08
Qopt=1.148128e-08  k1=7.165887e-01  k2=4.674159e-02  C01=1.105001e-03  C02=3.823607e-03  H1=3.800580e+01  H2=-4.387677e+02
