*** Qmin=6.406382e-07 ***   *  5001 [ 0.951696046 0.070300931 0.000805367 0.003160558 54.200319973 -225.107580011 ] Q=6.406382e-07
*** Qmin=1.061793e-07 ***   *  5002 [ 0.784735226 0.064439760 0.001251012 0.002421017 31.042959992 -359.024630003 ] Q=1.061793e-07
*** Qmin=2.689203e-08 ***   *  5003 [ 0.467114006 0.053744602 0.001478469 0.003399768 42.364120002 -468.033070000 ] Q=2.689203e-08
*** Qmin=2.485097e-08 ***   *  5047 [ 0.667511322 0.054558787 0.001000596 0.003267661 49.045799996 -469.605580001 ] Q=2.485097e-08
*** Qmin=2.412535e-08 ***   *  5184 [ 0.917168238 0.082355252 0.000783385 0.001872673 22.532719995 -410.919610002 ] Q=2.412535e-08
*** Qmin=1.992836e-08 ***   *  5205 [ 0.628323258 0.076420497 0.001481073 0.001896005 22.644960006 -441.166669999 ] Q=1.992836e-08
*** Qmin=1.872968e-08 ***   *  5274 [ 0.794442101 0.046097848 0.001181650 0.003661156 48.703479994 -511.073060001 ] Q=1.872968e-08
*** Qmin=1.722407e-08 ***   *  5399 [ 0.930189031 0.063307487 0.000737415 0.002518772 33.722239995 -453.311590001 ] Q=1.722407e-08
*** Qmin=1.532348e-08 ***   *  5475 [ 0.589551294 0.046001090 0.001496629 0.003645209 34.985280007 -487.905949999 ] Q=1.532348e-08
*** Qmin=1.418202e-08 ***   *  5491 [ 0.754602058 0.059413231 0.001126925 0.002811125 39.099040005 -479.517509999 ] Q=1.418202e-08
*** Qmin=1.381915e-08 ***   *  5836 [ 0.771303227 0.044488341 0.001019137 0.004100062 53.121079996 -510.033320001 ] Q=1.381915e-08
*** Qmin=1.257142e-08 ***   *  8200 [ 0.790507006 0.047834747 0.001157140 0.003710658 36.994240002 -466.402510001 ] Q=1.257142e-08
*** Qmin=1.149993e-08 ***   *  8262 [ 0.709035825 0.045346411 0.001317511 0.003873687 40.312640004 -491.929029999 ] Q=1.149993e-08
*** Qmin=1.132613e-08 ***   * 42286 [ 0.886922736 0.043321203 0.000997064 0.004106513 41.354279994 -493.901010001 ] Q=1.132613e-08
Qopt=1.132613e-08  k1=8.869227e-01  k2=4.332120e-02  C01=9.970644e-04  C02=4.106513e-03  H1=4.135428e+01  H2=-4.939010e+02
