*** Qmin=1.406293e-07 ***   *     5 [ 0.342319292 0.103113542 0.000475720 0.001027546 21.634680055 -519.231879892 ] Q=1.406293e-07
 Minimum found at:
*** Qmin=8.138403e-08 ***   *   741 [ 0.585972057 0.056782241 0.001255054 0.004285101 59.698112392 -351.625774891 ] Q=8.138403e-08
*** Qmin=4.515931e-08 ***   *  1207 [ 0.794863413 0.000739795 0.001161656 0.217672680 38.326942460 -571.616649591 ] Q=4.515931e-08
*** Qmin=3.050642e-08 ***   *  5068 [ 0.554511339 0.050780364 0.001068040 0.002862546 22.438600000 -466.928399999 ] Q=3.050642e-08
*** Qmin=2.098312e-08 ***   *  5074 [ 0.724536059 0.072760475 0.001295913 0.002113722 31.350999996 -435.760710000 ] Q=2.098312e-08
*** Qmin=1.632473e-08 ***   *  5315 [ 0.734137576 0.054229962 0.001000453 0.003420437 45.519079996 -425.807930003 ] Q=1.632473e-08
*** Qmin=1.553851e-08 ***   *  5637 [ 0.627429397 0.060054256 0.001289433 0.002956921 40.414239993 -427.624680003 ] Q=1.553851e-08
*** Qmin=1.385558e-08 ***   *  8482 [ 0.680418234 0.041966400 0.001101766 0.004157112 35.328239997 -434.512420002 ] Q=1.385558e-08
*** Qmin=1.248674e-08 ***   * 11858 [ 0.603115955 0.047862776 0.001200462 0.003823099 43.744960004 -446.263459999 ] Q=1.248674e-08
*** Qmin=1.227501e-08 ***   * 17528 [ 0.775902709 0.051074211 0.000931964 0.003446733 39.712719999 -440.353109999 ] Q=1.227501e-08
*** Qmin=1.165915e-08 ***   * 18000 [ 0.906740760 0.045580438 0.000732499 0.003805977 36.499800005 -446.190789998 ] Q=1.165915e-08
Qopt=1.165915e-08  k1=9.067408e-01  k2=4.558044e-02  C01=7.324989e-04  C02=3.805977e-03  H1=3.649980e+01  H2=-4.461908e+02
