 Minimum found at:
*** Qmin=1.154949e-08 ***   *   753 [ 0.589893999 0.019011947 0.001449197 0.010473002 52.593653760 -486.896683333 ] Q=1.154949e-08
 Minimum found at:
 Minimum found at:
 Minimum found at:
 Minimum found at:
*** Qmin=1.059152e-08 ***   *  4764 [ 0.645572040 0.020272358 0.001249548 0.009957723 53.319874098 -480.738231558 ] Q=1.059152e-08
 Minimum found at:
Qopt=1.059152e-08  k1=6.455720e-01  k2=2.027236e-02  C01=1.249548e-03  C02=9.957723e-03  H1=5.331987e+01  H2=-4.807382e+02
