 Minimum found at:
*** Qmin=1.062220e-08 ***   *    68 [ 0.754603688 0.038238317 0.001008415 0.004907195 41.477180072 -446.448779652 ] Q=1.062220e-08
 Minimum found at:
 Minimum found at:
 Minimum found at:
 Minimum found at:
 Minimum found at:
 Minimum found at:
 Minimum found at:
 Minimum found at:
 Minimum found at:
Qopt=1.062220e-08  k1=7.546037e-01  k2=3.823832e-02  C01=1.008415e-03  C02=4.907195e-03  H1=4.147718e+01  H2=-4.464488e+02
