*** Qmin=1.037660e-07 ***   *  5001 [ 0.764387176 0.076122419 0.000752739 0.002331498 40.664159992 -367.296540003 ] Q=1.037660e-07
*** Qmin=1.031053e-07 ***   *  5004 [ 0.522247102 0.050259005 0.000899164 0.002561761 50.664279996 -501.035570001 ] Q=1.031053e-07
*** Qmin=1.027907e-07 ***   *  5005 [ 0.899116416 0.035862032 0.000798266 0.004131723 38.220999991 -422.994870003 ] Q=1.027907e-07
*** Qmin=9.608728e-08 ***   *  5009 [ 0.911244256 0.088911182 0.000644604 0.002180006 25.878119997 -338.389790002 ] Q=9.608728e-08
*** Qmin=6.225371e-08 ***   *  5012 [ 0.935416258 0.070469774 0.001102311 0.002345197 32.810880005 -521.740929998 ] Q=6.225371e-08
*** Qmin=5.637838e-08 ***   *  5013 [ 0.461258954 0.066777340 0.000697537 0.002090916 22.221560003 -491.490429998 ] Q=5.637838e-08
*** Qmin=2.544183e-08 ***   *  5021 [ 0.903136552 0.055535769 0.000776493 0.002896318 44.703839997 -528.703489999 ] Q=2.544183e-08
*** Qmin=1.921698e-08 ***   *  5047 [ 0.758830923 0.044468128 0.001076853 0.003452354 29.109719998 -483.538440001 ] Q=1.921698e-08
*** Qmin=1.571134e-08 ***   *  5265 [ 0.771206933 0.052812278 0.001117351 0.003551884 44.279119989 -465.336540003 ] Q=1.571134e-08
*** Qmin=1.498468e-08 ***   *  5273 [ 0.858056733 0.049452175 0.000938278 0.003581135 37.340799993 -457.301130003 ] Q=1.498468e-08
*** Qmin=1.302732e-08 ***   *  5347 [ 0.891303601 0.050644560 0.000864471 0.003321268 33.743879997 -466.436050001 ] Q=1.302732e-08
*** Qmin=1.300208e-08 ***   *  7253 [ 0.970506461 0.047169938 0.000901132 0.003637594 32.650439994 -461.659610002 ] Q=1.300208e-08
*** Qmin=1.222206e-08 ***   * 18445 [ 0.947938776 0.044118419 0.000903959 0.003888195 35.735080006 -491.899789998 ] Q=1.222206e-08
*** Qmin=1.198658e-08 ***   * 18943 [ 0.837974423 0.044880714 0.000903068 0.003955974 40.667200001 -487.205910000 ] Q=1.198658e-08
*** Qmin=1.172861e-08 ***   * 25736 [ 0.755182998 0.049160867 0.001174517 0.003610635 39.682199994 -482.972130001 ] Q=1.172861e-08
*** Qmin=1.170845e-08 ***   * 34241 [ 0.881893782 0.046531715 0.000924764 0.003898410 43.821599998 -494.027860000 ] Q=1.170845e-08
*** Qmin=1.141930e-08 ***   * 80875 [ 0.839268211 0.045181963 0.001001624 0.003997633 41.868439992 -482.802710002 ] Q=1.141930e-08
Qopt=1.141930e-08  k1=8.392682e-01  k2=4.518196e-02  C01=1.001624e-03  C02=3.997633e-03  H1=4.186844e+01  H2=-4.828027e+02
