 Minimum found at:
*** Qmin=2.708923e-08 ***   *   259 [ 0.710799351 0.002086145 0.001259090 0.086912605 44.104878190 -535.041833359 ] Q=2.708923e-08
 Minimum found at:
 Minimum found at:
 Minimum found at:
 Minimum found at:
 Minimum found at:
*** Qmin=1.199716e-08 ***   *  2144 [ 0.723278877 0.039579765 0.001041961 0.004928963 44.859748853 -435.587436623 ] Q=1.199716e-08
 Minimum found at:
 Minimum found at:
 Minimum found at:
 Minimum found at:
*** Qmin=1.033108e-08 ***   *  3789 [ 0.595435706 0.030589894 0.001391006 0.006556642 50.594507221 -455.911890801 ] Q=1.033108e-08
 Minimum found at:
 Minimum found at:
Qopt=1.033108e-08  k1=5.954357e-01  k2=3.058989e-02  C01=1.391006e-03  C02=6.556642e-03  H1=5.059451e+01  H2=-4.559119e+02
