{
    "name": "No Distraction",
    "cinnamon-version": [
        "1.8",
        "1.9",
        "2.0",
        "2.2",
        "2.4",
        "4.2",
        "5.4"
    ],
    "url": "https://gitlab.com/linux-generic-and-cinnamon",
    "version": "1.1.1",
    "description": "Fade out all windows but the active/focused one.",
    "uuid": "no-distraction@drugwash",
    "author": "Drugwash",
    "last-edited": 1705711585
}
