{
    "section1": {
        "type": "section",
        "description": "Behavior"
    },
    "launcherList": {
        "type": "generic",
        "default": ["org.gnome.Terminal.desktop"]
    },
    "allow-dragging": {
        "type": "switch",
        "default": true,
        "description": "Allow dragging of launchers"
    }
}
